Project

General

Profile

Backport #6833 » error.log

Anonymous, 08/04/2012 05:10 PM

 
1
	CC = gcc
2
	LD = ld
3
	LDSHARED = gcc -dynamic -bundle
4
	CFLAGS = -O3 -ggdb -Wextra -Wno-unused-parameter -Wno-parentheses -Wno-long-long -Wno-missing-field-initializers -Werror=pointer-arith -Werror=write-strings -Werror=declaration-after-statement -Werror=shorten-64-to-32 -Werror=implicit-function-declaration  -pipe 
5
	XCFLAGS = -include ruby/config.h -include ruby/missing.h -fvisibility=hidden -DRUBY_EXPORT
6
	CPPFLAGS = -D_XOPEN_SOURCE -D_DARWIN_C_SOURCE   -I. -I.ext/include/x86_64-darwin12.0.0 -I./include -I.
7
	DLDFLAGS = -Wl,-undefined,dynamic_lookup -Wl,-multiply_defined,suppress -Wl,-flat_namespace  
8
	SOLIBS = 
9
compiling main.c
10
compiling dmydln.c
11
compiling dmyencoding.c
12
compiling version.c
13
compiling dmyversion.c
14
compiling miniprelude.c
15
compiling array.c
16
compiling bignum.c
17
compiling class.c
18
compiling compar.c
19
compiling complex.c
20
compiling dir.c
21
compiling dln_find.c
22
compiling enum.c
23
compiling enumerator.c
24
compiling error.c
25
compiling eval.c
26
compiling load.c
27
compiling proc.c
28
compiling file.c
29
compiling gc.c
30
compiling hash.c
31
compiling inits.c
32
compiling io.c
33
compiling marshal.c
34
compiling math.c
35
compiling node.c
36
compiling numeric.c
37
compiling object.c
38
compiling pack.c
39
compiling parse.c
40
compiling process.c
41
compiling random.c
42
compiling range.c
43
compiling rational.c
44
compiling re.c
45
compiling regcomp.c
46
regcomp.c: In function ‘add_compile_string_length’:
47
regcomp.c:436: warning: implicit conversion shortens 64-bit value into a 32-bit value
48
regcomp.c: In function ‘onig_is_code_in_cc_len’:
49
regcomp.c:5702: warning: implicit conversion shortens 64-bit value into a 32-bit value
50
regcomp.c:5702: warning: implicit conversion shortens 64-bit value into a 32-bit value
51
compiling regenc.c
52
compiling regerror.c
53
compiling regexec.c
54
compiling regparse.c
55
regparse.c: In function ‘node_new_cclass_by_codepoint_range’:
56
regparse.c:1178: warning: implicit conversion shortens 64-bit value into a 32-bit value
57
regparse.c:1178: warning: implicit conversion shortens 64-bit value into a 32-bit value
58
regparse.c: In function ‘add_ctype_to_cc_by_range’:
59
regparse.c:3859: warning: implicit conversion shortens 64-bit value into a 32-bit value
60
regparse.c:3859: warning: implicit conversion shortens 64-bit value into a 32-bit value
61
regparse.c:3859: warning: implicit conversion shortens 64-bit value into a 32-bit value
62
regparse.c:3859: warning: implicit conversion shortens 64-bit value into a 32-bit value
63
regparse.c:3880: warning: implicit conversion shortens 64-bit value into a 32-bit value
64
regparse.c:3880: warning: implicit conversion shortens 64-bit value into a 32-bit value
65
regparse.c:3880: warning: implicit conversion shortens 64-bit value into a 32-bit value
66
regparse.c:3880: warning: implicit conversion shortens 64-bit value into a 32-bit value
67
regparse.c:3885: warning: implicit conversion shortens 64-bit value into a 32-bit value
68
regparse.c:3885: warning: implicit conversion shortens 64-bit value into a 32-bit value
69
regparse.c:3885: warning: implicit conversion shortens 64-bit value into a 32-bit value
70
regparse.c:3885: warning: implicit conversion shortens 64-bit value into a 32-bit value
71
regparse.c: In function ‘i_apply_case_fold’:
72
regparse.c:5086: warning: implicit conversion shortens 64-bit value into a 32-bit value
73
regparse.c:5086: warning: implicit conversion shortens 64-bit value into a 32-bit value
74
compiling regsyntax.c
75
compiling ruby.c
76
compiling safe.c
77
compiling signal.c
78
compiling sprintf.c
79
compiling st.c
80
compiling strftime.c
81
compiling string.c
82
compiling struct.c
83
compiling time.c
84
compiling transcode.c
85
compiling util.c
86
compiling variable.c
87
compiling compile.c
88
compiling debug.c
89
compiling iseq.c
90
compiling vm.c
91
In file included from vm.c:23:
92
vm_insnhelper.c: In function ‘vm_call_cfunc’:
93
vm_insnhelper.c:411: warning: initialization from incompatible pointer type
94
compiling vm_dump.c
95
compiling thread.c
96
compiling cont.c
97
compiling ./enc/ascii.c
98
compiling ./enc/us_ascii.c
99
/opt/local/bin/gmkdir -p enc/unicode
100
+ cp enc/unicode/name2ctype.h.blt enc/unicode/name2ctype.h
101
compiling ./enc/unicode.c
102
compiling ./enc/utf_8.c
103
compiling newline.c
104
compiling ./missing/setproctitle.c
105
compiling dmyext.c
106
linking miniruby
107
rbconfig.rb updated
108
generating enc.mk
109
compiling dln.c
110
compiling encoding.c
111
generating prelude.c
112
compiling prelude.c
113
linking static-library libruby-static.a
114
generating encdb.h
115
encdb.h updated
116
making enc
117
compiling ./enc/encdb.c
118
linking encoding encdb.bundle
119
compiling ./enc/big5.c
120
linking encoding big5.bundle
121
compiling ./enc/cp949.c
122
linking encoding cp949.bundle
123
compiling ./enc/emacs_mule.c
124
linking encoding emacs_mule.bundle
125
compiling ./enc/euc_jp.c
126
linking encoding euc_jp.bundle
127
compiling ./enc/euc_kr.c
128
linking encoding euc_kr.bundle
129
compiling ./enc/euc_tw.c
130
linking encoding euc_tw.bundle
131
compiling ./enc/gb2312.c
132
linking encoding gb2312.bundle
133
compiling ./enc/gb18030.c
134
linking encoding gb18030.bundle
135
compiling ./enc/gbk.c
136
linking encoding gbk.bundle
137
compiling ./enc/iso_8859_1.c
138
linking encoding iso_8859_1.bundle
139
compiling ./enc/iso_8859_2.c
140
linking encoding iso_8859_2.bundle
141
compiling ./enc/iso_8859_3.c
142
linking encoding iso_8859_3.bundle
143
compiling ./enc/iso_8859_4.c
144
linking encoding iso_8859_4.bundle
145
compiling ./enc/iso_8859_5.c
146
linking encoding iso_8859_5.bundle
147
compiling ./enc/iso_8859_6.c
148
linking encoding iso_8859_6.bundle
149
compiling ./enc/iso_8859_7.c
150
linking encoding iso_8859_7.bundle
151
compiling ./enc/iso_8859_8.c
152
linking encoding iso_8859_8.bundle
153
compiling ./enc/iso_8859_9.c
154
linking encoding iso_8859_9.bundle
155
compiling ./enc/iso_8859_10.c
156
linking encoding iso_8859_10.bundle
157
compiling ./enc/iso_8859_11.c
158
linking encoding iso_8859_11.bundle
159
compiling ./enc/iso_8859_13.c
160
linking encoding iso_8859_13.bundle
161
compiling ./enc/iso_8859_14.c
162
linking encoding iso_8859_14.bundle
163
compiling ./enc/iso_8859_15.c
164
linking encoding iso_8859_15.bundle
165
compiling ./enc/iso_8859_16.c
166
linking encoding iso_8859_16.bundle
167
compiling ./enc/koi8_r.c
168
linking encoding koi8_r.bundle
169
compiling ./enc/koi8_u.c
170
linking encoding koi8_u.bundle
171
compiling ./enc/shift_jis.c
172
linking encoding shift_jis.bundle
173
compiling ./enc/utf_16be.c
174
linking encoding utf_16be.bundle
175
compiling ./enc/utf_16le.c
176
linking encoding utf_16le.bundle
177
compiling ./enc/utf_32be.c
178
linking encoding utf_32be.bundle
179
compiling ./enc/utf_32le.c
180
linking encoding utf_32le.bundle
181
compiling ./enc/windows_1251.c
182
linking encoding windows_1251.bundle
183
making srcs under enc
184
make[1]: Nothing to be done for `srcs'.
185
generating transdb.h
186
transdb.h updated
187
making trans
188
compiling ./enc/trans/transdb.c
189
linking transcoder transdb.bundle
190
compiling ./enc/trans/big5.c
191
linking transcoder big5.bundle
192
compiling ./enc/trans/chinese.c
193
linking transcoder chinese.bundle
194
compiling ./enc/trans/emoji.c
195
linking transcoder emoji.bundle
196
compiling ./enc/trans/emoji_iso2022_kddi.c
197
linking transcoder emoji_iso2022_kddi.bundle
198
compiling ./enc/trans/emoji_sjis_docomo.c
199
linking transcoder emoji_sjis_docomo.bundle
200
compiling ./enc/trans/emoji_sjis_kddi.c
201
linking transcoder emoji_sjis_kddi.bundle
202
compiling ./enc/trans/emoji_sjis_softbank.c
203
linking transcoder emoji_sjis_softbank.bundle
204
compiling ./enc/trans/escape.c
205
linking transcoder escape.bundle
206
compiling ./enc/trans/gb18030.c
207
linking transcoder gb18030.bundle
208
compiling ./enc/trans/gbk.c
209
linking transcoder gbk.bundle
210
compiling ./enc/trans/iso2022.c
211
linking transcoder iso2022.bundle
212
compiling ./enc/trans/japanese.c
213
linking transcoder japanese.bundle
214
compiling ./enc/trans/japanese_euc.c
215
linking transcoder japanese_euc.bundle
216
compiling ./enc/trans/japanese_sjis.c
217
linking transcoder japanese_sjis.bundle
218
compiling ./enc/trans/korean.c
219
linking transcoder korean.bundle
220
compiling ./enc/trans/single_byte.c
221
linking transcoder single_byte.bundle
222
compiling ./enc/trans/utf8_mac.c
223
linking transcoder utf8_mac.bundle
224
compiling ./enc/trans/utf_16_32.c
225
linking transcoder utf_16_32.bundle
226
making encs
227
./revision.h unchanged
228
configuring -test-/add_suffix
229
configuring -test-/array/resize
230
configuring -test-/bug-3571
231
configuring -test-/bug-3662
232
configuring -test-/funcall
233
configuring -test-/load/dot.dot
234
configuring -test-/old_thread_select
235
configuring -test-/st/numhash
236
configuring -test-/string
237
configuring -test-/wait_for_single_fd
238
configuring -test-/win32/dln
239
Failed to configure -test-/win32/dln. It will not be installed.
240
configuring -test-/win32/fd_setsize
241
Failed to configure -test-/win32/fd_setsize. It will not be installed.
242
configuring bigdecimal
243
configuring continuation
244
configuring coverage
245
configuring curses
246
configuring date
247
configuring dbm
248
configuring digest
249
configuring digest/bubblebabble
250
configuring digest/md5
251
configuring digest/rmd160
252
configuring digest/sha1
253
configuring digest/sha2
254
configuring dl
255
configuring dl/callback
256
configuring dl/win32
257
Failed to configure dl/win32. It will not be installed.
258
configuring etc
259
configuring fcntl
260
configuring fiber
261
configuring fiddle
262
configuring gdbm
263
Failed to configure gdbm. It will not be installed.
264
configuring iconv
265
configuring io/console
266
configuring io/nonblock
267
configuring io/wait
268
configuring json
269
configuring json/generator
270
configuring json/parser
271
configuring mathn/complex
272
configuring mathn/rational
273
configuring nkf
274
configuring objspace
275
configuring openssl
276
configuring pathname
277
configuring psych
278
yaml.h is missing. Please install libyaml.
279
Failed to configure psych. It will not be installed.
280
configuring pty
281
configuring racc/cparse
282
configuring readline
283
configuring ripper
284
configuring sdbm
285
configuring socket
286
configuring stringio
287
configuring strscan
288
configuring syck
289
configuring syslog
290
configuring tk
291
check functions.........
292
check struct members..
293
check libraries....
294
Use ActiveTcl libraries (if available).
295
Search tclConfig.sh and tkConfig.sh...................................
296
Valid [tclConfig.sh, tkConfig.sh] are found in [["/System/Library/Frameworks/Tcl.framework", "/System/Library/Frameworks/Tk.framework"], ["/usr/lib", "/usr/lib"], ["/opt/local/lib", "/opt/local/lib"], ["/System/Library/Frameworks/Tcl.framework/Versions/Current", "/System/Library/Frameworks/Tk.framework/Versions/Current"], ["/System/Library/Frameworks/Tcl.framework/Versions/8.5", "/System/Library/Frameworks/Tk.framework/Versions/8.5"], ["/System/Library/Frameworks/Tcl.framework/Versions/8.4", "/System/Library/Frameworks/Tk.framework/Versions/8.4"]]
297
Use [tclConfig.sh, tkConfig.sh] == ["/System/Library/Frameworks/Tcl.framework/tclConfig.sh", "/System/Library/Frameworks/Tk.framework/tkConfig.sh"]
298
Use MacOS X Frameworks.
299

    
300
Find Tcl/Tk libraries. Make tcltklib.so which is required by Ruby/Tk.
301
configuring tk/tkutil
302
configuring win32ole
303
Failed to configure win32ole. It will not be installed.
304
configuring zlib
305
compiling bug.c
306
linking shared-object -test-/add_suffix/bug.bundle
307
installing default bug libraries
308
compiling resize.c
309
linking shared-object -test-/array/resize.bundle
310
installing default resize libraries
311
compiling bug.c
312
linking shared-object -test-/bug-3571/bug.bundle
313
installing default bug libraries
314
compiling bug.c
315
linking shared-object -test-/bug-3662/bug.bundle
316
installing default bug libraries
317
compiling passing_block.c
318
linking shared-object -test-/funcall/funcall.bundle
319
installing default funcall libraries
320
compiling dot.dot.c
321
linking shared-object -test-/load/dot.dot/dot.dot.bundle
322
installing default dot.dot libraries
323
compiling old_thread_select.c
324
old_thread_select.c: In function ‘old_thread_select’:
325
old_thread_select.c:57: warning: ‘rb_thread_select’ is deprecated (declared at ../../.././include/ruby/intern.h:379)
326
linking shared-object -test-/old_thread_select/old_thread_select.bundle
327
installing default old_thread_select libraries
328
compiling numhash.c
329
linking shared-object -test-/st/numhash.bundle
330
installing default numhash libraries
331
compiling cstr.c
332
compiling ellipsize.c
333
compiling enc_associate.c
334
compiling init.c
335
compiling modify.c
336
compiling set_len.c
337
linking shared-object -test-/string/string.bundle
338
installing default string libraries
339
compiling wait_for_single_fd.c
340
linking shared-object -test-/wait_for_single_fd/wait_for_single_fd.bundle
341
installing default wait_for_single_fd libraries
342
make[2]: Nothing to be done for `all'.
343
make[2]: Nothing to be done for `all'.
344
compiling bigdecimal.c
345
linking shared-object bigdecimal.bundle
346
installing default bigdecimal libraries
347
compiling continuation.c
348
linking shared-object continuation.bundle
349
installing default continuation libraries
350
compiling coverage.c
351
linking shared-object coverage.bundle
352
installing default coverage libraries
353
compiling curses.c
354
linking shared-object curses.bundle
355
installing default curses libraries
356
compiling date_core.c
357
compiling date_parse.c
358
compiling date_strftime.c
359
compiling date_strptime.c
360
linking shared-object date_core.bundle
361
installing default date_core libraries
362
compiling dbm.c
363
dbm.c: In function ‘fdbm_has_value’:
364
dbm.c:818: warning: comparison between signed and unsigned
365
linking shared-object dbm.bundle
366
installing default dbm libraries
367
compiling digest.c
368
linking shared-object digest.bundle
369
installing digest libraries
370
installing default digest libraries
371
compiling bubblebabble.c
372
linking shared-object digest/bubblebabble.bundle
373
installing default bubblebabble libraries
374
compiling md5init.c
375
compiling md5ossl.c
376
linking shared-object digest/md5.bundle
377
installing default md5 libraries
378
compiling rmd160init.c
379
compiling rmd160ossl.c
380
linking shared-object digest/rmd160.bundle
381
installing default rmd160 libraries
382
compiling sha1init.c
383
compiling sha1ossl.c
384
linking shared-object digest/sha1.bundle
385
installing default sha1 libraries
386
compiling sha2init.c
387
compiling sha2ossl.c
388
linking shared-object digest/sha2.bundle
389
installing default sha2 libraries
390
compiling cfunc.c
391
compiling cptr.c
392
compiling dl.c
393
compiling handle.c
394
linking shared-object dl.bundle
395
installing dl libraries
396
installing default dl libraries
397
compiling callback.c
398
compiling callback-0.c
399
compiling callback-1.c
400
compiling callback-2.c
401
compiling callback-3.c
402
compiling callback-4.c
403
compiling callback-5.c
404
compiling callback-6.c
405
compiling callback-7.c
406
compiling callback-8.c
407
linking shared-object dl/callback.bundle
408
installing default callback libraries
409
make[2]: Nothing to be done for `all'.
410
compiling etc.c
411
linking shared-object etc.bundle
412
installing default etc libraries
413
compiling fcntl.c
414
linking shared-object fcntl.bundle
415
installing default fcntl libraries
416
compiling fiber.c
417
linking shared-object fiber.bundle
418
installing default fiber libraries
419
compiling closure.c
420
compiling conversions.c
421
compiling fiddle.c
422
compiling function.c
423
linking shared-object fiddle.bundle
424
installing default fiddle libraries
425
make[2]: Nothing to be done for `all'.
426
compiling iconv.c
427
linking shared-object iconv.bundle
428
installing default iconv libraries
429
compiling console.c
430
linking shared-object io/console.bundle
431
installing default console libraries
432
compiling nonblock.c
433
linking shared-object io/nonblock.bundle
434
installing default nonblock libraries
435
compiling wait.c
436
linking shared-object io/wait.bundle
437
installing default wait libraries
438
installing default libraries
439
compiling generator.c
440
linking shared-object json/ext/generator.bundle
441
installing default generator libraries
442
compiling parser.c
443
linking shared-object json/ext/parser.bundle
444
installing default parser libraries
445
compiling complex.c
446
linking shared-object mathn/complex.bundle
447
installing default complex libraries
448
compiling rational.c
449
linking shared-object mathn/rational.bundle
450
installing default rational libraries
451
compiling nkf.c
452
linking shared-object nkf.bundle
453
installing default nkf libraries
454
compiling objspace.c
455
linking shared-object objspace.bundle
456
installing default objspace libraries
457
compiling openssl_missing.c
458
compiling ossl.c
459
compiling ossl_asn1.c
460
ossl_asn1.c: In function ‘int_ossl_asn1_decode0_prim’:
461
ossl_asn1.c:792: warning: implicit conversion shortens 64-bit value into a 32-bit value
462
ossl_asn1.c:795: warning: implicit conversion shortens 64-bit value into a 32-bit value
463
ossl_asn1.c:798: warning: implicit conversion shortens 64-bit value into a 32-bit value
464
ossl_asn1.c:801: warning: implicit conversion shortens 64-bit value into a 32-bit value
465
ossl_asn1.c:804: warning: implicit conversion shortens 64-bit value into a 32-bit value
466
ossl_asn1.c:807: warning: implicit conversion shortens 64-bit value into a 32-bit value
467
ossl_asn1.c:810: warning: implicit conversion shortens 64-bit value into a 32-bit value
468
ossl_asn1.c:814: warning: implicit conversion shortens 64-bit value into a 32-bit value
469
ossl_asn1.c: In function ‘ossl_asn1_decode0’:
470
ossl_asn1.c:945: warning: implicit conversion shortens 64-bit value into a 32-bit value
471
compiling ossl_bio.c
472
compiling ossl_bn.c
473
compiling ossl_cipher.c
474
compiling ossl_config.c
475
compiling ossl_digest.c
476
compiling ossl_engine.c
477
compiling ossl_hmac.c
478
compiling ossl_ns_spki.c
479
compiling ossl_ocsp.c
480
compiling ossl_pkcs12.c
481
compiling ossl_pkcs5.c
482
ossl_pkcs5.c: In function ‘ossl_pkcs5_pbkdf2_hmac’:
483
ossl_pkcs5.c:42: warning: implicit conversion shortens 64-bit value into a 32-bit value
484
ossl_pkcs5.c:42: warning: implicit conversion shortens 64-bit value into a 32-bit value
485
compiling ossl_pkcs7.c
486
compiling ossl_pkey.c
487
compiling ossl_pkey_dh.c
488
compiling ossl_pkey_dsa.c
489
compiling ossl_pkey_ec.c
490
compiling ossl_pkey_rsa.c
491
ossl_pkey_rsa.c: In function ‘ossl_rsa_s_generate’:
492
ossl_pkey_rsa.c:106: warning: implicit conversion shortens 64-bit value into a 32-bit value
493
ossl_pkey_rsa.c: In function ‘ossl_rsa_initialize’:
494
ossl_pkey_rsa.c:151: warning: implicit conversion shortens 64-bit value into a 32-bit value
495
compiling ossl_rand.c
496
compiling ossl_ssl.c
497
compiling ossl_ssl_session.c
498
compiling ossl_x509.c
499
compiling ossl_x509attr.c
500
compiling ossl_x509cert.c
501
compiling ossl_x509crl.c
502
compiling ossl_x509ext.c
503
compiling ossl_x509name.c
504
compiling ossl_x509req.c
505
compiling ossl_x509revoked.c
506
compiling ossl_x509store.c
507
linking shared-object openssl.bundle
508
installing default openssl libraries
509
compiling pathname.c
510
linking shared-object pathname.bundle
511
installing default pathname libraries
512
make[2]: Nothing to be done for `all'.
513
compiling pty.c
514
linking shared-object pty.bundle
515
installing default pty libraries
516
compiling cparse.c
517
linking shared-object racc/cparse.bundle
518
installing default cparse libraries
519
compiling readline.c
520
linking shared-object readline.bundle
521
installing default readline libraries
522
extracting ripper.y from ../.././parse.y
523
compiling compiler ripper.y
524
generating eventids1.c from ../.././parse.y
525
generating eventids2table.c from ../.././ext/ripper/eventids2.c
526
compiling ripper.c
527
parse.c:695: error: expected ‘)’ before ‘->’ token
528
make[2]: *** [ripper.o] Error 1
529
make[1]: *** [ext/ripper/all] Error 2
530
make: *** [build-ext] Error 2