Project

General

Profile

Backport #7550 » my-make2.log

Second make log - l0b0 (Victor Engmark), 12/12/2012 07:28 PM

 
1
	CC = gcc
2
	LD = ld
3
	LDSHARED = gcc -shared
4
	CFLAGS = -O3 -ggdb -Wall -Wextra -Wno-unused-parameter -Wno-parentheses -Wno-long-long -Wno-missing-field-initializers -Werror=pointer-arith -Werror=write-strings -Werror=declaration-after-statement -Werror=implicit-function-declaration 
5
	XCFLAGS = -include ruby/config.h -include ruby/missing.h -fvisibility=hidden -DRUBY_EXPORT
6
	CPPFLAGS =   -I. -I.ext/include/i686-linux -I./include -I.
7
	DLDFLAGS =  
8
	SOLIBS = 
9
compiling main.c
10
compiling dmydln.c
11
compiling dmyencoding.c
12
compiling version.c
13
compiling dmyversion.c
14
generating miniprelude.c
15
compiling miniprelude.c
16
compiling array.c
17
compiling bignum.c
18
bignum.c: In function ‘big_rshift’:
19
bignum.c:3532:20: warning: variable ‘save_x’ set but not used [-Wunused-but-set-variable]
20
compiling class.c
21
class.c: In function ‘rb_obj_methods’:
22
class.c:1016:8: warning: variable ‘args’ set but not used [-Wunused-but-set-variable]
23
compiling compar.c
24
compiling complex.c
25
compiling dir.c
26
dir.c: In function ‘dir_open_dir’:
27
dir.c:1850:22: warning: variable ‘dirp’ set but not used [-Wunused-but-set-variable]
28
compiling dln_find.c
29
compiling enum.c
30
compiling enumerator.c
31
generating known_errors.inc
32
known_errors.inc updated
33
compiling error.c
34
compiling eval.c
35
compiling load.c
36
compiling proc.c
37
proc.c: In function ‘binding_free’:
38
proc.c:241:19: warning: variable ‘bind’ set but not used [-Wunused-but-set-variable]
39
compiling file.c
40
compiling gc.c
41
gc.c: In function ‘objspace_each_objects’:
42
gc.c:2618:20: warning: variable ‘v’ set but not used [-Wunused-but-set-variable]
43
compiling hash.c
44
compiling inits.c
45
compiling io.c
46
io.c: In function ‘rb_io_each_byte’:
47
io.c:3080:15: warning: variable ‘e’ set but not used [-Wunused-but-set-variable]
48
io.c: In function ‘pipe_open’:
49
io.c:5305:12: warning: variable ‘argv’ set but not used [-Wunused-but-set-variable]
50
io.c:5304:9: warning: variable ‘argc’ set but not used [-Wunused-but-set-variable]
51
compiling marshal.c
52
compiling math.c
53
compiling node.c
54
compiling numeric.c
55
compiling object.c
56
compiling pack.c
57
pack.c: In function ‘pack_pack’:
58
pack.c:381:9: warning: variable ‘signed_p’ set but not used [-Wunused-but-set-variable]
59
compiling parse.c
60
parse.y: In function ‘parser_compile_string’:
61
parse.y:5305:20: warning: variable ‘tmp’ set but not used [-Wunused-but-set-variable]
62
parse.y: In function ‘rb_parser_compile_file’:
63
parse.y:5366:20: warning: variable ‘tmp’ set but not used [-Wunused-but-set-variable]
64
compiling process.c
65
process.c: In function ‘rb_proc_exec_n’:
66
process.c:1134:9: warning: variable ‘ret’ set but not used [-Wunused-but-set-variable]
67
compiling random.c
68
compiling range.c
69
compiling rational.c
70
compiling re.c
71
compiling regcomp.c
72
regcomp.c: In function ‘is_not_included’:
73
regcomp.c:2436:13: warning: variable ‘c’ set but not used [-Wunused-but-set-variable]
74
regcomp.c: In function ‘update_string_node_case_fold’:
75
regcomp.c:3226:14: warning: variable ‘q’ set but not used [-Wunused-but-set-variable]
76
compiling regenc.c
77
compiling regerror.c
78
compiling regexec.c
79
compiling regparse.c
80
regparse.c: In function ‘fetch_escaped_value’:
81
regparse.c:2452:3: warning: variable ‘pfetch_prev’ set but not used [-Wunused-but-set-variable]
82
regparse.c: In function ‘fetch_name’:
83
regparse.c:2665:3: warning: variable ‘pfetch_prev’ set but not used [-Wunused-but-set-variable]
84
regparse.c: In function ‘parse_posix_bracket’:
85
regparse.c:4044:3: warning: variable ‘pfetch_prev’ set but not used [-Wunused-but-set-variable]
86
regparse.c: In function ‘fetch_char_property_to_ctype’:
87
regparse.c:4097:3: warning: variable ‘pfetch_prev’ set but not used [-Wunused-but-set-variable]
88
regparse.c: In function ‘code_exist_check’:
89
regparse.c:4262:3: warning: variable ‘pfetch_prev’ set but not used [-Wunused-but-set-variable]
90
compiling regsyntax.c
91
compiling ruby.c
92
compiling safe.c
93
compiling signal.c
94
signal.c: In function ‘trap_handler’:
95
signal.c:792:17: warning: variable ‘proc’ set but not used [-Wunused-but-set-variable]
96
compiling sprintf.c
97
compiling st.c
98
compiling strftime.c
99
compiling string.c
100
compiling struct.c
101
compiling time.c
102
compiling transcode.c
103
transcode.c: In function ‘rb_econv_open0’:
104
transcode.c:985:25: warning: variable ‘denc’ set but not used [-Wunused-but-set-variable]
105
transcode.c:985:18: warning: variable ‘senc’ set but not used [-Wunused-but-set-variable]
106
transcode.c: In function ‘make_replacement’:
107
transcode.c:2177:18: warning: variable ‘enc’ set but not used [-Wunused-but-set-variable]
108
compiling util.c
109
compiling variable.c
110
generating insns.inc
111
generating insns_info.inc
112
generating optinsn.inc
113
generating optunifs.inc
114
generating opt_sc.inc
115
compiling compile.c
116
compile.c: In function ‘validate_label’:
117
compile.c:444:10: warning: variable ‘ret’ set but not used [-Wunused-but-set-variable]
118
compile.c: In function ‘iseq_compile_each’:
119
compile.c:3320:5: warning: variable ‘mid’ set but not used [-Wunused-but-set-variable]
120
compile.c: In function ‘iseq_build_from_ary_exception’:
121
compile.c:5272:6: warning: variable ‘sp’ set but not used [-Wunused-but-set-variable]
122
compiling debug.c
123
generating node_name.inc
124
compiling iseq.c
125
iseq.c: In function ‘iseq_load’:
126
iseq.c:444:51: warning: variable ‘misc’ set but not used [-Wunused-but-set-variable]
127
iseq.c:444:38: warning: variable ‘format_type’ set but not used [-Wunused-but-set-variable]
128
iseq.c:444:28: warning: variable ‘version2’ set but not used [-Wunused-but-set-variable]
129
iseq.c:444:18: warning: variable ‘version1’ set but not used [-Wunused-but-set-variable]
130
iseq.c:444:11: warning: variable ‘magic’ set but not used [-Wunused-but-set-variable]
131
iseq.c: In function ‘rb_iseq_parameters’:
132
iseq.c:1378:15: warning: variable ‘s’ set but not used [-Wunused-but-set-variable]
133
generating vmtc.inc
134
generating vm.inc
135
compiling vm.c
136
In file included from vm.c:23:0:
137
vm_insnhelper.c: In function ‘vm_expandarray’:
138
vm_insnhelper.c:1642:20: warning: variable ‘tmp_ary’ set but not used [-Wunused-but-set-variable]
139
In file included from vm.c:27:0:
140
vm_method.c: In function ‘rb_gc_mark_unlinked_live_method_entries’:
141
vm_method.c:102:100: warning: unused variable ‘curr_ume’ [-Wunused-variable]
142
vm_method.c:102:85: warning: unused variable ‘prev_ume’ [-Wunused-variable]
143
In file included from vm.c:28:0:
144
vm_eval.c: In function ‘raise_method_missing’:
145
vm_eval.c:509:8: warning: variable ‘id’ set but not used [-Wunused-but-set-variable]
146
vm.c: In function ‘rb_iseq_eval’:
147
vm.c:1446:20: warning: variable ‘tmp’ set but not used [-Wunused-but-set-variable]
148
vm.c: In function ‘rb_iseq_eval_main’:
149
vm.c:1460:20: warning: variable ‘tmp’ set but not used [-Wunused-but-set-variable]
150
compiling vm_dump.c
151
compiling thread.c
152
compiling cont.c
153
cont.c: In function ‘cont_capture’:
154
cont.c:429:20: warning: variable ‘contval’ set but not used [-Wunused-but-set-variable]
155
compiling ./enc/ascii.c
156
compiling ./enc/us_ascii.c
157
/bin/mkdir -p enc/unicode
158
+ cp enc/unicode/name2ctype.h.blt enc/unicode/name2ctype.h
159
compiling ./enc/unicode.c
160
compiling ./enc/utf_8.c
161
compiling newline.c
162
compiling ./missing/strlcpy.c
163
compiling ./missing/strlcat.c
164
compiling ./missing/setproctitle.c
165
compiling addr2line.c
166
addr2line.c: In function ‘parse_debug_line_cu’:
167
addr2line.c:230:18: warning: variable ‘isa’ set but not used [-Wunused-but-set-variable]
168
addr2line.c:227:9: warning: variable ‘end_sequence’ set but not used [-Wunused-but-set-variable]
169
addr2line.c:226:9: warning: variable ‘basic_block’ set but not used [-Wunused-but-set-variable]
170
addr2line.c:224:18: warning: variable ‘column’ set but not used [-Wunused-but-set-variable]
171
addr2line.c:218:20: warning: variable ‘standard_opcode_lengths’ set but not used [-Wunused-but-set-variable]
172
compiling dmyext.c
173
linking miniruby
174
rbconfig.rb updated
175
generating enc.mk
176
compiling dln.c
177
compiling encoding.c
178
generating prelude.c
179
compiling prelude.c
180
linking static-library libruby-static.a
181
generating encdb.h
182
encdb.h updated
183
making enc
184
make[1]: Entering directory `/home/victor/ruby-1.9.3-p327'
185
compiling ./enc/encdb.c
186
linking encoding encdb.so
187
compiling ./enc/big5.c
188
linking encoding big5.so
189
compiling ./enc/cp949.c
190
linking encoding cp949.so
191
compiling ./enc/emacs_mule.c
192
linking encoding emacs_mule.so
193
compiling ./enc/euc_jp.c
194
linking encoding euc_jp.so
195
compiling ./enc/euc_kr.c
196
linking encoding euc_kr.so
197
compiling ./enc/euc_tw.c
198
linking encoding euc_tw.so
199
compiling ./enc/gb2312.c
200
linking encoding gb2312.so
201
compiling ./enc/gb18030.c
202
linking encoding gb18030.so
203
compiling ./enc/gbk.c
204
linking encoding gbk.so
205
compiling ./enc/iso_8859_1.c
206
linking encoding iso_8859_1.so
207
compiling ./enc/iso_8859_2.c
208
linking encoding iso_8859_2.so
209
compiling ./enc/iso_8859_3.c
210
linking encoding iso_8859_3.so
211
compiling ./enc/iso_8859_4.c
212
linking encoding iso_8859_4.so
213
compiling ./enc/iso_8859_5.c
214
linking encoding iso_8859_5.so
215
compiling ./enc/iso_8859_6.c
216
linking encoding iso_8859_6.so
217
compiling ./enc/iso_8859_7.c
218
linking encoding iso_8859_7.so
219
compiling ./enc/iso_8859_8.c
220
linking encoding iso_8859_8.so
221
compiling ./enc/iso_8859_9.c
222
linking encoding iso_8859_9.so
223
compiling ./enc/iso_8859_10.c
224
linking encoding iso_8859_10.so
225
compiling ./enc/iso_8859_11.c
226
linking encoding iso_8859_11.so
227
compiling ./enc/iso_8859_13.c
228
linking encoding iso_8859_13.so
229
compiling ./enc/iso_8859_14.c
230
linking encoding iso_8859_14.so
231
compiling ./enc/iso_8859_15.c
232
linking encoding iso_8859_15.so
233
compiling ./enc/iso_8859_16.c
234
linking encoding iso_8859_16.so
235
compiling ./enc/koi8_r.c
236
linking encoding koi8_r.so
237
compiling ./enc/koi8_u.c
238
linking encoding koi8_u.so
239
compiling ./enc/shift_jis.c
240
linking encoding shift_jis.so
241
compiling ./enc/utf_16be.c
242
linking encoding utf_16be.so
243
compiling ./enc/utf_16le.c
244
linking encoding utf_16le.so
245
compiling ./enc/utf_32be.c
246
linking encoding utf_32be.so
247
compiling ./enc/utf_32le.c
248
linking encoding utf_32le.so
249
compiling ./enc/windows_1251.c
250
linking encoding windows_1251.so
251
make[1]: Leaving directory `/home/victor/ruby-1.9.3-p327'
252
making srcs under enc
253
make[1]: Entering directory `/home/victor/ruby-1.9.3-p327'
254
make[1]: Nothing to be done for `srcs'.
255
make[1]: Leaving directory `/home/victor/ruby-1.9.3-p327'
256
generating transdb.h
257
transdb.h updated
258
making trans
259
make[1]: Entering directory `/home/victor/ruby-1.9.3-p327'
260
compiling ./enc/trans/transdb.c
261
linking transcoder transdb.so
262
compiling ./enc/trans/big5.c
263
linking transcoder big5.so
264
compiling ./enc/trans/chinese.c
265
linking transcoder chinese.so
266
compiling ./enc/trans/emoji.c
267
linking transcoder emoji.so
268
compiling ./enc/trans/emoji_iso2022_kddi.c
269
linking transcoder emoji_iso2022_kddi.so
270
compiling ./enc/trans/emoji_sjis_docomo.c
271
linking transcoder emoji_sjis_docomo.so
272
compiling ./enc/trans/emoji_sjis_kddi.c
273
linking transcoder emoji_sjis_kddi.so
274
compiling ./enc/trans/emoji_sjis_softbank.c
275
linking transcoder emoji_sjis_softbank.so
276
compiling ./enc/trans/escape.c
277
linking transcoder escape.so
278
compiling ./enc/trans/gb18030.c
279
linking transcoder gb18030.so
280
compiling ./enc/trans/gbk.c
281
linking transcoder gbk.so
282
compiling ./enc/trans/iso2022.c
283
linking transcoder iso2022.so
284
compiling ./enc/trans/japanese.c
285
linking transcoder japanese.so
286
compiling ./enc/trans/japanese_euc.c
287
linking transcoder japanese_euc.so
288
compiling ./enc/trans/japanese_sjis.c
289
linking transcoder japanese_sjis.so
290
compiling ./enc/trans/korean.c
291
linking transcoder korean.so
292
compiling ./enc/trans/single_byte.c
293
linking transcoder single_byte.so
294
compiling ./enc/trans/utf8_mac.c
295
linking transcoder utf8_mac.so
296
compiling ./enc/trans/utf_16_32.c
297
linking transcoder utf_16_32.so
298
make[1]: Leaving directory `/home/victor/ruby-1.9.3-p327'
299
making encs
300
make[1]: Entering directory `/home/victor/ruby-1.9.3-p327'
301
make[1]: Leaving directory `/home/victor/ruby-1.9.3-p327'
302
file2lastrev.rb: does not seem to be under a vcs: .
303
make: [.revision.time] Error 1 (ignored)
304
./revision.h updated
305
configuring -test-/array/resize
306
configuring -test-/bug-3571
307
configuring -test-/bug-3662
308
configuring -test-/funcall
309
configuring -test-/load/dot.dot
310
configuring -test-/old_thread_select
311
configuring -test-/st/numhash
312
configuring -test-/string
313
configuring -test-/wait_for_single_fd
314
configuring -test-/win32/dln
315
Failed to configure -test-/win32/dln. It will not be installed.
316
configuring -test-/win32/fd_setsize
317
Failed to configure -test-/win32/fd_setsize. It will not be installed.
318
configuring bigdecimal
319
configuring continuation
320
configuring coverage
321
configuring curses
322
Failed to configure curses. It will not be installed.
323
configuring date
324
configuring dbm
325
Failed to configure dbm. It will not be installed.
326
configuring digest
327
configuring digest/bubblebabble
328
configuring digest/md5
329
configuring digest/rmd160
330
configuring digest/sha1
331
configuring digest/sha2
332
configuring dl
333
configuring dl/callback
334
configuring dl/win32
335
Failed to configure dl/win32. It will not be installed.
336
configuring etc
337
configuring fcntl
338
configuring fiber
339
configuring fiddle
340
ffi.h is missing. Please install libffi.
341
Failed to configure fiddle. It will not be installed.
342
configuring gdbm
343
Failed to configure gdbm. It will not be installed.
344
configuring iconv
345
configuring io/console
346
configuring io/nonblock
347
configuring io/wait
348
configuring json
349
configuring json/generator
350
configuring json/parser
351
configuring mathn/complex
352
configuring mathn/rational
353
configuring nkf
354
configuring objspace
355
configuring openssl
356
configuring pathname
357
configuring psych
358
configuring pty
359
configuring racc/cparse
360
configuring readline
361
configuring ripper
362
Failed to configure ripper. It will not be installed.
363
configuring sdbm
364
configuring socket
365
configuring stringio
366
configuring strscan
367
configuring syck
368
configuring syslog
369
configuring tk
370
check functions.........
371
check struct members..
372
check libraries....
373
Use ActiveTcl libraries (if available).
374
Search tclConfig.sh and tkConfig.sh.....................
375
Fail to find [tclConfig.sh, tkConfig.sh]
376
Use X11 libraries (or use TK_XINCLUDES/TK_XLIBSW information on tkConfig.sh).
377

    
378
Search tcl.h.......
379
Search tk.h.......Can't find "tcl.h".
380
Can't find "tk.h".
381

    
382
Can't find proper Tcl/Tk libraries. So, can't make tcltklib.so which is required by Ruby/Tk.
383
Failed to configure tk. It will not be installed.
384
configuring tk/tkutil
385
Failed to configure tk/tkutil. It will not be installed.
386
configuring win32ole
387
Failed to configure win32ole. It will not be installed.
388
configuring zlib
389
make[1]: Entering directory `/home/victor/ruby-1.9.3-p327'
390
make[2]: Entering directory `/home/victor/ruby-1.9.3-p327/ext/-test-/array/resize'
391
compiling resize.c
392
linking shared-object -test-/array/resize.so
393
/usr/bin/ld: cannot open output file ../../../../.ext/i686-linux/-test-/array/resize.so: No such file or directory
394
collect2: ld returned 1 exit status
395
make[2]: *** [../../../../.ext/i686-linux/-test-/array/resize.so] Error 1
396
make[2]: Leaving directory `/home/victor/ruby-1.9.3-p327/ext/-test-/array/resize'
397
make[1]: *** [ext/-test-/array/resize/all] Error 2
398
make[1]: Leaving directory `/home/victor/ruby-1.9.3-p327'
399
make: *** [build-ext] Error 2