output-r38509.txt

Vit Ondruch, 12/22/2012 01:44 AM

Download (44.3 KB)

 
1
./miniruby -I./lib -I. -I.ext/common  ./tool/runruby.rb --extout=.ext  -- --disable-gems "./test/runner.rb" --ruby="./miniruby -I./lib -I. -I.ext/common  ./tool/runruby.rb --extout=.ext  -- --disable-gems"  -v 'test/webrick/test_httpauth.rb'
2
Run options: "--ruby=./miniruby -I./lib -I. -I.ext/common  ./tool/runruby.rb --extout=.ext  -- --disable-gems" -v
3

    
4
# Running tests:
5

    
6
TestWEBrickHTTPAuth#test_basic_auth = 0.02 s = .
7
TestWEBrickHTTPAuth#test_basic_auth2 = 0.02 s = .
8
TestWEBrickHTTPAuth#test_basic_auth3 = 0.00 s = .
9
TestWEBrickHTTPAuth#test_digest_auth = md5_dgst.c(78): OpenSSL internal error, assertion failed: Digest MD5 forbidden in FIPS mode!
10
make: *** [yes-test-all] Aborted
11
./miniruby -I./lib -I. -I.ext/common  ./tool/runruby.rb --extout=.ext  -- --disable-gems "./test/runner.rb" --ruby="./miniruby -I./lib -I. -I.ext/common  ./tool/runruby.rb --extout=.ext  -- --disable-gems"  -v 'test/digest/test_digest.rb'
12
Run options: "--ruby=./miniruby -I./lib -I. -I.ext/common  ./tool/runruby.rb --extout=.ext  -- --disable-gems" -v
13

    
14
# Running tests:
15

    
16
TestDigest::TestBase#test_base = 0.00 s = .
17
TestDigest::TestMD5#test_alignment = md5_dgst.c(78): OpenSSL internal error, assertion failed: Digest MD5 forbidden in FIPS mode!
18
make: *** [yes-test-all] Aborted
19
./miniruby -I./lib -I. -I.ext/common  ./tool/runruby.rb --extout=.ext  -- --disable-gems "./test/runner.rb" --ruby="./miniruby -I./lib -I. -I.ext/common  ./tool/runruby.rb --extout=.ext  -- --disable-gems"  -v 'test/digest/test_digest_hmac.rb'
20
Run options: "--ruby=./miniruby -I./lib -I. -I.ext/common  ./tool/runruby.rb --extout=.ext  -- --disable-gems" -v
21

    
22
# Running tests:
23

    
24
TC_HMAC_MD5#test_hexdigest = md5_dgst.c(78): OpenSSL internal error, assertion failed: Digest MD5 forbidden in FIPS mode!
25
make: *** [yes-test-all] Aborted
26
./miniruby -I./lib -I. -I.ext/common  ./tool/runruby.rb --extout=.ext  -- --disable-gems "./test/runner.rb" --ruby="./miniruby -I./lib -I. -I.ext/common  ./tool/runruby.rb --extout=.ext  -- --disable-gems"  -v 'test/psych/test_yamlstore.rb'
27
md5_dgst.c(78): OpenSSL internal error, assertion failed: Digest MD5 forbidden in FIPS mode!
28
make: *** [yes-test-all] Aborted
29
./miniruby -I./lib -I. -I.ext/common  ./tool/runruby.rb --extout=.ext  -- --disable-gems "./test/runner.rb" --ruby="./miniruby -I./lib -I. -I.ext/common  ./tool/runruby.rb --extout=.ext  -- --disable-gems"  -v 'test/openssl/test_ssl.rb'
30
Run options: "--ruby=./miniruby -I./lib -I. -I.ext/common  ./tool/runruby.rb --extout=.ext  -- --disable-gems" -v
31

    
32
# Running tests:
33

    
34
OpenSSL::TestSSL#test_client_auth = 0.05 s = E
35
OpenSSL::TestSSL#test_client_ca = 0.04 s = E
36
OpenSSL::TestSSL#test_connect_and_close = 0.06 s = .
37
OpenSSL::TestSSL#test_ctx_setup = 0.02 s = .
38
OpenSSL::TestSSL#test_ctx_setup_no_compression = 0.02 s = .
39
OpenSSL::TestSSL#test_exception_in_verify_callback_is_ignored = 0.03 s = .
40
OpenSSL::TestSSL#test_forbid_ssl_v3_for_client = 0.02 s = .
41
OpenSSL::TestSSL#test_forbid_ssl_v3_from_server = 0.03 s = .
42
OpenSSL::TestSSL#test_forbid_tls_v1_1_for_client = 0.03 s = .
43
OpenSSL::TestSSL#test_forbid_tls_v1_1_from_server = 0.02 s = .
44
OpenSSL::TestSSL#test_forbid_tls_v1_2_for_client = 0.03 s = .
45
OpenSSL::TestSSL#test_forbid_tls_v1_2_from_server = 0.02 s = .
46
OpenSSL::TestSSL#test_forbid_tls_v1_for_client = 0.02 s = .
47
OpenSSL::TestSSL#test_forbid_tls_v1_from_server = 0.02 s = .
48
OpenSSL::TestSSL#test_multibyte_read_write = 0.09 s = .
49
OpenSSL::TestSSL#test_not_started_session = 0.02 s = .
50
OpenSSL::TestSSL#test_npn_advertised_protocol_too_long = 0.02 s = .
51
OpenSSL::TestSSL#test_npn_protocol_selection_ary = 0.06 s = .
52
OpenSSL::TestSSL#test_npn_protocol_selection_cancel = 0.03 s = .
53
OpenSSL::TestSSL#test_npn_protocol_selection_enum = 0.06 s = .
54
OpenSSL::TestSSL#test_npn_selected_protocol_too_long = 0.03 s = .
55
OpenSSL::TestSSL#test_parallel = 0.26 s = .
56
OpenSSL::TestSSL#test_post_connection_check = 0.10 s = .
57
OpenSSL::TestSSL#test_read_and_write = 0.07 s = .
58
OpenSSL::TestSSL#test_renegotiation_cb = 0.04 s = .
59
OpenSSL::TestSSL#test_ssl_read_nonblock = 0.04 s = .
60
OpenSSL::TestSSL#test_sslctx_set_params = 0.03 s = .
61
OpenSSL::TestSSL#test_starttls = 1.05 s = .
62
OpenSSL::TestSSL#test_tls_v1_1 = 0.04 s = .
63
OpenSSL::TestSSL#test_tls_v1_2 = 0.04 s = .
64
OpenSSL::TestSSL#test_tlsext_hostname = 0.06 s = .
65
OpenSSL::TestSSL#test_unset_OP_ALL = 0.04 s = .
66
OpenSSL::TestSSL#test_verify_result = 0.05 s = .
67

    
68

    
69
Finished tests in 2.561918s, 12.8810 tests/s, 112.0254 assertions/s.
70

    
71
  1) Error:
72
test_client_auth(OpenSSL::TestSSL):
73
OpenSSL::SSL::SSLError: SSL_connect returned=1 errno=0 state=SSLv3 write certificate verify A: EVP lib
74
    /home/mockbuild/rpmbuild/BUILD/ruby-2.0.0-r38509/test/openssl/test_ssl.rb:616:in `connect'
75
    /home/mockbuild/rpmbuild/BUILD/ruby-2.0.0-r38509/test/openssl/test_ssl.rb:616:in `server_connect'
76
    /home/mockbuild/rpmbuild/BUILD/ruby-2.0.0-r38509/test/openssl/test_ssl.rb:121:in `block in test_client_auth'
77
    /home/mockbuild/rpmbuild/BUILD/ruby-2.0.0-r38509/test/openssl/utils.rb:298:in `call'
78
    /home/mockbuild/rpmbuild/BUILD/ruby-2.0.0-r38509/test/openssl/utils.rb:298:in `start_server'
79
    /home/mockbuild/rpmbuild/BUILD/ruby-2.0.0-r38509/test/openssl/test_ssl.rb:110:in `test_client_auth'
80

    
81
  2) Error:
82
test_client_ca(OpenSSL::TestSSL):
83
OpenSSL::SSL::SSLError: SSL_connect returned=1 errno=0 state=SSLv3 write certificate verify A: EVP lib
84
    /home/mockbuild/rpmbuild/BUILD/ruby-2.0.0-r38509/test/openssl/test_ssl.rb:616:in `connect'
85
    /home/mockbuild/rpmbuild/BUILD/ruby-2.0.0-r38509/test/openssl/test_ssl.rb:616:in `server_connect'
86
    /home/mockbuild/rpmbuild/BUILD/ruby-2.0.0-r38509/test/openssl/test_ssl.rb:154:in `block in test_client_ca'
87
    /home/mockbuild/rpmbuild/BUILD/ruby-2.0.0-r38509/test/openssl/utils.rb:298:in `call'
88
    /home/mockbuild/rpmbuild/BUILD/ruby-2.0.0-r38509/test/openssl/utils.rb:298:in `start_server'
89
    /home/mockbuild/rpmbuild/BUILD/ruby-2.0.0-r38509/test/openssl/test_ssl.rb:147:in `test_client_ca'
90

    
91
33 tests, 287 assertions, 0 failures, 2 errors, 0 skips
92

    
93
ruby -v: ruby 2.0.0dev (2012-12-20 trunk 38509) [x86_64-linux]
94
make: *** [yes-test-all] Error 2
95
./miniruby -I./lib -I. -I.ext/common  ./tool/runruby.rb --extout=.ext  -- --disable-gems "./test/runner.rb" --ruby="./miniruby -I./lib -I. -I.ext/common  ./tool/runruby.rb --extout=.ext  -- --disable-gems"  -v 'test/openssl/test_x509crl.rb'
96
Run options: "--ruby=./miniruby -I./lib -I. -I.ext/common  ./tool/runruby.rb --extout=.ext  -- --disable-gems" -v
97

    
98
# Running tests:
99

    
100
OpenSSL::TestX509CRL#test_basic = 0.02 s = .
101
OpenSSL::TestX509CRL#test_crlnumber = 0.03 s = .
102
OpenSSL::TestX509CRL#test_extension = 0.02 s = .
103
OpenSSL::TestX509CRL#test_revoked = 0.20 s = .
104
OpenSSL::TestX509CRL#test_sign_and_verify = 0.01 s = E
105

    
106

    
107
Finished tests in 0.284619s, 17.5673 tests/s, 284.5908 assertions/s.
108

    
109
  1) Error:
110
test_sign_and_verify(OpenSSL::TestX509CRL):
111
OpenSSL::X509::CertificateError: EVP lib
112
    /home/mockbuild/rpmbuild/BUILD/ruby-2.0.0-r38509/test/openssl/utils.rb:141:in `sign'
113
    /home/mockbuild/rpmbuild/BUILD/ruby-2.0.0-r38509/test/openssl/utils.rb:141:in `issue_cert'
114
    /home/mockbuild/rpmbuild/BUILD/ruby-2.0.0-r38509/test/openssl/test_x509crl.rb:24:in `issue_cert'
115
    /home/mockbuild/rpmbuild/BUILD/ruby-2.0.0-r38509/test/openssl/test_x509crl.rb:200:in `test_sign_and_verify'
116

    
117
5 tests, 81 assertions, 0 failures, 1 errors, 0 skips
118

    
119
ruby -v: ruby 2.0.0dev (2012-12-20 trunk 38509) [x86_64-linux]
120
make: *** [yes-test-all] Error 1
121
./miniruby -I./lib -I. -I.ext/common  ./tool/runruby.rb --extout=.ext  -- --disable-gems "./test/runner.rb" --ruby="./miniruby -I./lib -I. -I.ext/common  ./tool/runruby.rb --extout=.ext  -- --disable-gems"  -v 'test/openssl/test_x509name.rb'
122
Run options: "--ruby=./miniruby -I./lib -I. -I.ext/common  ./tool/runruby.rb --extout=.ext  -- --disable-gems" -v
123

    
124
# Running tests:
125

    
126
OpenSSL::TestX509Name#test_add_entry = 0.00 s = .
127
OpenSSL::TestX509Name#test_add_entry_street = 0.00 s = .
128
OpenSSL::TestX509Name#test_equals2 = 0.00 s = .
129
OpenSSL::TestX509Name#test_hash = md5_dgst.c(78): OpenSSL internal error, assertion failed: Digest MD5 forbidden in FIPS mode!
130
make: *** [yes-test-all] Aborted
131
./miniruby -I./lib -I. -I.ext/common  ./tool/runruby.rb --extout=.ext  -- --disable-gems "./test/runner.rb" --ruby="./miniruby -I./lib -I. -I.ext/common  ./tool/runruby.rb --extout=.ext  -- --disable-gems"  -v 'test/openssl/test_cipher.rb'
132
Run options: "--ruby=./miniruby -I./lib -I. -I.ext/common  ./tool/runruby.rb --extout=.ext  -- --disable-gems" -v
133

    
134
# Running tests:
135

    
136
OpenSSL::TestCipher#test_AES = 0.00 s = E
137
OpenSSL::TestCipher#test_AES_crush = 0.01 s = .
138
OpenSSL::TestCipher#test_aes_gcm = 0.00 s = .
139
OpenSSL::TestCipher#test_aes_gcm_short_tag = 0.00 s = .
140
OpenSSL::TestCipher#test_aes_gcm_wrong_auth_data = 0.00 s = .
141
OpenSSL::TestCipher#test_aes_gcm_wrong_ciphertext = 0.00 s = .
142
OpenSSL::TestCipher#test_aes_gcm_wrong_tag = 0.00 s = .
143
OpenSSL::TestCipher#test_authenticated = 0.00 s = .
144
OpenSSL::TestCipher#test_ciphers = 0.00 s = .
145
OpenSSL::TestCipher#test_crypt = 0.00 s = F
146
OpenSSL::TestCipher#test_ctr_if_exists = 0.00 s = F
147
OpenSSL::TestCipher#test_dup = 0.00 s = .
148
OpenSSL::TestCipher#test_empty_data = 0.00 s = .
149
OpenSSL::TestCipher#test_info = 0.00 s = .
150
OpenSSL::TestCipher#test_initialize = 0.00 s = .
151
OpenSSL::TestCipher#test_reset = 0.00 s = .
152

    
153

    
154
Finished tests in 0.026365s, 606.8589 tests/s, 22984.7826 assertions/s.
155

    
156
  1) Failure:
157
test_ctr_if_exists(OpenSSL::TestCipher) [/home/mockbuild/rpmbuild/BUILD/ruby-2.0.0-r38509/test/openssl/test_cipher.rb:99]:
158
<"hello,world"> expected but was
159
<"\xCF7\xBCy`N*\x16%_\xCB">.
160

    
161
  2) Failure:
162
test_crypt(OpenSSL::TestCipher) [/home/mockbuild/rpmbuild/BUILD/ruby-2.0.0-r38509/test/openssl/test_cipher.rb:44]:
163
encrypt.
164
<"eW\x17\x83.\x0F\xA0q"> expected but was
165
<"\xBE)\xF0\x81\x02\xC1\x10u">.
166

    
167
  3) Error:
168
test_AES(OpenSSL::TestCipher):
169
OpenSSL::Cipher::CipherError: bad decrypt
170
    /home/mockbuild/rpmbuild/BUILD/ruby-2.0.0-r38509/test/openssl/test_cipher.rb:122:in `final'
171
    /home/mockbuild/rpmbuild/BUILD/ruby-2.0.0-r38509/test/openssl/test_cipher.rb:122:in `block in test_AES'
172
    /home/mockbuild/rpmbuild/BUILD/ruby-2.0.0-r38509/test/openssl/test_cipher.rb:113:in `each'
173
    /home/mockbuild/rpmbuild/BUILD/ruby-2.0.0-r38509/test/openssl/test_cipher.rb:113:in `test_AES'
174

    
175
16 tests, 606 assertions, 2 failures, 1 errors, 0 skips
176

    
177
ruby -v: ruby 2.0.0dev (2012-12-20 trunk 38509) [x86_64-linux]
178
make: *** [yes-test-all] Error 3
179
./miniruby -I./lib -I. -I.ext/common  ./tool/runruby.rb --extout=.ext  -- --disable-gems "./test/runner.rb" --ruby="./miniruby -I./lib -I. -I.ext/common  ./tool/runruby.rb --extout=.ext  -- --disable-gems"  -v 'test/openssl/test_digest.rb'
180
Run options: "--ruby=./miniruby -I./lib -I. -I.ext/common  ./tool/runruby.rb --extout=.ext  -- --disable-gems" -v
181

    
182
# Running tests:
183

    
184
OpenSSL::TestDigest#test_098_features = 0.00 s = E
185
OpenSSL::TestDigest#test_digest = 0.00 s = E
186
OpenSSL::TestDigest#test_digest_by_oid_and_name = 0.00 s = E
187
OpenSSL::TestDigest#test_digest_by_oid_and_name_sha2 = 0.00 s = E
188
OpenSSL::TestDigest#test_digest_constants = 0.00 s = E
189
OpenSSL::TestDigest#test_dup = 0.00 s = E
190
OpenSSL::TestDigest#test_eql = 0.00 s = E
191
OpenSSL::TestDigest#test_info = 0.00 s = E
192
OpenSSL::TestDigest#test_openssl_digest = 0.00 s = E
193
OpenSSL::TestDigest#test_reset = 0.00 s = E
194

    
195

    
196
Finished tests in 0.014931s, 669.7411 tests/s, 0.0000 assertions/s.
197

    
198
  1) Error:
199
test_098_features(OpenSSL::TestDigest):
200
OpenSSL::Digest::DigestError: Digest initialization failed.: disabled for fips
201
    /home/mockbuild/rpmbuild/BUILD/ruby-2.0.0-r38509/.ext/common/openssl/digest.rb:66:in `initialize'
202
    /home/mockbuild/rpmbuild/BUILD/ruby-2.0.0-r38509/.ext/common/openssl/digest.rb:66:in `initialize'
203
    /home/mockbuild/rpmbuild/BUILD/ruby-2.0.0-r38509/test/openssl/test_digest.rb:7:in `new'
204
    /home/mockbuild/rpmbuild/BUILD/ruby-2.0.0-r38509/test/openssl/test_digest.rb:7:in `setup'
205

    
206
  2) Error:
207
test_digest(OpenSSL::TestDigest):
208
OpenSSL::Digest::DigestError: Digest initialization failed.: disabled for fips
209
    /home/mockbuild/rpmbuild/BUILD/ruby-2.0.0-r38509/.ext/common/openssl/digest.rb:66:in `initialize'
210
    /home/mockbuild/rpmbuild/BUILD/ruby-2.0.0-r38509/.ext/common/openssl/digest.rb:66:in `initialize'
211
    /home/mockbuild/rpmbuild/BUILD/ruby-2.0.0-r38509/test/openssl/test_digest.rb:7:in `new'
212
    /home/mockbuild/rpmbuild/BUILD/ruby-2.0.0-r38509/test/openssl/test_digest.rb:7:in `setup'
213

    
214
  3) Error:
215
test_digest_by_oid_and_name(OpenSSL::TestDigest):
216
OpenSSL::Digest::DigestError: Digest initialization failed.: disabled for fips
217
    /home/mockbuild/rpmbuild/BUILD/ruby-2.0.0-r38509/.ext/common/openssl/digest.rb:66:in `initialize'
218
    /home/mockbuild/rpmbuild/BUILD/ruby-2.0.0-r38509/.ext/common/openssl/digest.rb:66:in `initialize'
219
    /home/mockbuild/rpmbuild/BUILD/ruby-2.0.0-r38509/test/openssl/test_digest.rb:7:in `new'
220
    /home/mockbuild/rpmbuild/BUILD/ruby-2.0.0-r38509/test/openssl/test_digest.rb:7:in `setup'
221

    
222
  4) Error:
223
test_digest_by_oid_and_name_sha2(OpenSSL::TestDigest):
224
OpenSSL::Digest::DigestError: Digest initialization failed.: disabled for fips
225
    /home/mockbuild/rpmbuild/BUILD/ruby-2.0.0-r38509/.ext/common/openssl/digest.rb:66:in `initialize'
226
    /home/mockbuild/rpmbuild/BUILD/ruby-2.0.0-r38509/.ext/common/openssl/digest.rb:66:in `initialize'
227
    /home/mockbuild/rpmbuild/BUILD/ruby-2.0.0-r38509/test/openssl/test_digest.rb:7:in `new'
228
    /home/mockbuild/rpmbuild/BUILD/ruby-2.0.0-r38509/test/openssl/test_digest.rb:7:in `setup'
229

    
230
  5) Error:
231
test_digest_constants(OpenSSL::TestDigest):
232
OpenSSL::Digest::DigestError: Digest initialization failed.: disabled for fips
233
    /home/mockbuild/rpmbuild/BUILD/ruby-2.0.0-r38509/.ext/common/openssl/digest.rb:66:in `initialize'
234
    /home/mockbuild/rpmbuild/BUILD/ruby-2.0.0-r38509/.ext/common/openssl/digest.rb:66:in `initialize'
235
    /home/mockbuild/rpmbuild/BUILD/ruby-2.0.0-r38509/test/openssl/test_digest.rb:7:in `new'
236
    /home/mockbuild/rpmbuild/BUILD/ruby-2.0.0-r38509/test/openssl/test_digest.rb:7:in `setup'
237

    
238
  6) Error:
239
test_dup(OpenSSL::TestDigest):
240
OpenSSL::Digest::DigestError: Digest initialization failed.: disabled for fips
241
    /home/mockbuild/rpmbuild/BUILD/ruby-2.0.0-r38509/.ext/common/openssl/digest.rb:66:in `initialize'
242
    /home/mockbuild/rpmbuild/BUILD/ruby-2.0.0-r38509/.ext/common/openssl/digest.rb:66:in `initialize'
243
    /home/mockbuild/rpmbuild/BUILD/ruby-2.0.0-r38509/test/openssl/test_digest.rb:7:in `new'
244
    /home/mockbuild/rpmbuild/BUILD/ruby-2.0.0-r38509/test/openssl/test_digest.rb:7:in `setup'
245

    
246
  7) Error:
247
test_eql(OpenSSL::TestDigest):
248
OpenSSL::Digest::DigestError: Digest initialization failed.: disabled for fips
249
    /home/mockbuild/rpmbuild/BUILD/ruby-2.0.0-r38509/.ext/common/openssl/digest.rb:66:in `initialize'
250
    /home/mockbuild/rpmbuild/BUILD/ruby-2.0.0-r38509/.ext/common/openssl/digest.rb:66:in `initialize'
251
    /home/mockbuild/rpmbuild/BUILD/ruby-2.0.0-r38509/test/openssl/test_digest.rb:7:in `new'
252
    /home/mockbuild/rpmbuild/BUILD/ruby-2.0.0-r38509/test/openssl/test_digest.rb:7:in `setup'
253

    
254
  8) Error:
255
test_info(OpenSSL::TestDigest):
256
OpenSSL::Digest::DigestError: Digest initialization failed.: disabled for fips
257
    /home/mockbuild/rpmbuild/BUILD/ruby-2.0.0-r38509/.ext/common/openssl/digest.rb:66:in `initialize'
258
    /home/mockbuild/rpmbuild/BUILD/ruby-2.0.0-r38509/.ext/common/openssl/digest.rb:66:in `initialize'
259
    /home/mockbuild/rpmbuild/BUILD/ruby-2.0.0-r38509/test/openssl/test_digest.rb:7:in `new'
260
    /home/mockbuild/rpmbuild/BUILD/ruby-2.0.0-r38509/test/openssl/test_digest.rb:7:in `setup'
261

    
262
  9) Error:
263
test_openssl_digest(OpenSSL::TestDigest):
264
OpenSSL::Digest::DigestError: Digest initialization failed.: disabled for fips
265
    /home/mockbuild/rpmbuild/BUILD/ruby-2.0.0-r38509/.ext/common/openssl/digest.rb:66:in `initialize'
266
    /home/mockbuild/rpmbuild/BUILD/ruby-2.0.0-r38509/.ext/common/openssl/digest.rb:66:in `initialize'
267
    /home/mockbuild/rpmbuild/BUILD/ruby-2.0.0-r38509/test/openssl/test_digest.rb:7:in `new'
268
    /home/mockbuild/rpmbuild/BUILD/ruby-2.0.0-r38509/test/openssl/test_digest.rb:7:in `setup'
269

    
270
 10) Error:
271
test_reset(OpenSSL::TestDigest):
272
OpenSSL::Digest::DigestError: Digest initialization failed.: disabled for fips
273
    /home/mockbuild/rpmbuild/BUILD/ruby-2.0.0-r38509/.ext/common/openssl/digest.rb:66:in `initialize'
274
    /home/mockbuild/rpmbuild/BUILD/ruby-2.0.0-r38509/.ext/common/openssl/digest.rb:66:in `initialize'
275
    /home/mockbuild/rpmbuild/BUILD/ruby-2.0.0-r38509/test/openssl/test_digest.rb:7:in `new'
276
    /home/mockbuild/rpmbuild/BUILD/ruby-2.0.0-r38509/test/openssl/test_digest.rb:7:in `setup'
277

    
278
10 tests, 0 assertions, 0 failures, 10 errors, 0 skips
279

    
280
ruby -v: ruby 2.0.0dev (2012-12-20 trunk 38509) [x86_64-linux]
281
make: *** [yes-test-all] Error 10
282
./miniruby -I./lib -I. -I.ext/common  ./tool/runruby.rb --extout=.ext  -- --disable-gems "./test/runner.rb" --ruby="./miniruby -I./lib -I. -I.ext/common  ./tool/runruby.rb --extout=.ext  -- --disable-gems"  -v 'test/openssl/test_pkey_dh.rb'
283
Run options: "--ruby=./miniruby -I./lib -I. -I.ext/common  ./tool/runruby.rb --extout=.ext  -- --disable-gems" -v
284

    
285
# Running tests:
286

    
287
OpenSSL::TestPKeyDH#test_generate_key = 0.00 s = E
288
OpenSSL::TestPKeyDH#test_key_exchange = 0.00 s = E
289
OpenSSL::TestPKeyDH#test_new = 0.00 s = E
290
OpenSSL::TestPKeyDH#test_new_break = 0.00 s = E
291
OpenSSL::TestPKeyDH#test_public_key = 0.00 s = .
292
OpenSSL::TestPKeyDH#test_to_der = 0.00 s = .
293
OpenSSL::TestPKeyDH#test_to_pem = 0.00 s = .
294

    
295

    
296
Finished tests in 0.014519s, 482.1420 tests/s, 1515.3035 assertions/s.
297

    
298
  1) Error:
299
test_generate_key(OpenSSL::TestPKeyDH):
300
OpenSSL::PKey::DHError: Failed to generate key: key size too small
301
    /home/mockbuild/rpmbuild/BUILD/ruby-2.0.0-r38509/test/openssl/test_pkey_dh.rb:48:in `generate_key!'
302
    /home/mockbuild/rpmbuild/BUILD/ruby-2.0.0-r38509/test/openssl/test_pkey_dh.rb:48:in `test_generate_key'
303

    
304
  2) Error:
305
test_key_exchange(OpenSSL::TestPKeyDH):
306
OpenSSL::PKey::DHError: Failed to generate key: key size too small
307
    /home/mockbuild/rpmbuild/BUILD/ruby-2.0.0-r38509/test/openssl/test_pkey_dh.rb:55:in `generate_key!'
308
    /home/mockbuild/rpmbuild/BUILD/ruby-2.0.0-r38509/test/openssl/test_pkey_dh.rb:55:in `test_key_exchange'
309

    
310
  3) Error:
311
test_new(OpenSSL::TestPKeyDH):
312
OpenSSL::PKey::DHError: BN lib
313
    /home/mockbuild/rpmbuild/BUILD/ruby-2.0.0-r38509/test/openssl/test_pkey_dh.rb:10:in `initialize'
314
    /home/mockbuild/rpmbuild/BUILD/ruby-2.0.0-r38509/test/openssl/test_pkey_dh.rb:10:in `new'
315
    /home/mockbuild/rpmbuild/BUILD/ruby-2.0.0-r38509/test/openssl/test_pkey_dh.rb:10:in `test_new'
316

    
317
  4) Error:
318
test_new_break(OpenSSL::TestPKeyDH):
319
OpenSSL::PKey::DHError: BN lib
320
    /home/mockbuild/rpmbuild/BUILD/ruby-2.0.0-r38509/test/openssl/test_pkey_dh.rb:15:in `initialize'
321
    /home/mockbuild/rpmbuild/BUILD/ruby-2.0.0-r38509/test/openssl/test_pkey_dh.rb:15:in `new'
322
    /home/mockbuild/rpmbuild/BUILD/ruby-2.0.0-r38509/test/openssl/test_pkey_dh.rb:15:in `test_new_break'
323

    
324
7 tests, 22 assertions, 0 failures, 4 errors, 0 skips
325

    
326
ruby -v: ruby 2.0.0dev (2012-12-20 trunk 38509) [x86_64-linux]
327
make: *** [yes-test-all] Error 4
328
./miniruby -I./lib -I. -I.ext/common  ./tool/runruby.rb --extout=.ext  -- --disable-gems "./test/runner.rb" --ruby="./miniruby -I./lib -I. -I.ext/common  ./tool/runruby.rb --extout=.ext  -- --disable-gems"  -v 'test/openssl/test_hmac.rb'
329
Run options: "--ruby=./miniruby -I./lib -I. -I.ext/common  ./tool/runruby.rb --extout=.ext  -- --disable-gems" -v
330

    
331
# Running tests:
332

    
333
OpenSSL::TestHMAC#test_dup = 0.00 s = E
334
OpenSSL::TestHMAC#test_hmac = 0.00 s = E
335

    
336

    
337
Finished tests in 0.013000s, 153.8487 tests/s, 0.0000 assertions/s.
338

    
339
  1) Error:
340
test_dup(OpenSSL::TestHMAC):
341
OpenSSL::Digest::DigestError: Digest initialization failed.: disabled for fips
342
    /home/mockbuild/rpmbuild/BUILD/ruby-2.0.0-r38509/.ext/common/openssl/digest.rb:51:in `initialize'
343
    /home/mockbuild/rpmbuild/BUILD/ruby-2.0.0-r38509/.ext/common/openssl/digest.rb:51:in `block (3 levels) in <class:Digest>'
344
    /home/mockbuild/rpmbuild/BUILD/ruby-2.0.0-r38509/test/openssl/test_hmac.rb:8:in `new'
345
    /home/mockbuild/rpmbuild/BUILD/ruby-2.0.0-r38509/test/openssl/test_hmac.rb:8:in `setup'
346

    
347
  2) Error:
348
test_hmac(OpenSSL::TestHMAC):
349
OpenSSL::Digest::DigestError: Digest initialization failed.: disabled for fips
350
    /home/mockbuild/rpmbuild/BUILD/ruby-2.0.0-r38509/.ext/common/openssl/digest.rb:51:in `initialize'
351
    /home/mockbuild/rpmbuild/BUILD/ruby-2.0.0-r38509/.ext/common/openssl/digest.rb:51:in `block (3 levels) in <class:Digest>'
352
    /home/mockbuild/rpmbuild/BUILD/ruby-2.0.0-r38509/test/openssl/test_hmac.rb:8:in `new'
353
    /home/mockbuild/rpmbuild/BUILD/ruby-2.0.0-r38509/test/openssl/test_hmac.rb:8:in `setup'
354

    
355
2 tests, 0 assertions, 0 failures, 2 errors, 0 skips
356

    
357
ruby -v: ruby 2.0.0dev (2012-12-20 trunk 38509) [x86_64-linux]
358
make: *** [yes-test-all] Error 2
359
./miniruby -I./lib -I. -I.ext/common  ./tool/runruby.rb --extout=.ext  -- --disable-gems "./test/runner.rb" --ruby="./miniruby -I./lib -I. -I.ext/common  ./tool/runruby.rb --extout=.ext  -- --disable-gems"  -v 'test/openssl/test_engine.rb'
360
Run options: "--ruby=./miniruby -I./lib -I. -I.ext/common  ./tool/runruby.rb --extout=.ext  -- --disable-gems" -v
361

    
362
# Running tests:
363

    
364
OpenSSL::TestEngine#test_engines_free = 0.00 s = .
365
OpenSSL::TestEngine#test_openssl_engine_builtin = 0.00 s = .
366
OpenSSL::TestEngine#test_openssl_engine_by_id_string = 0.00 s = .
367
OpenSSL::TestEngine#test_openssl_engine_cipher_rc4 = 0.00 s = E
368
OpenSSL::TestEngine#test_openssl_engine_digest_sha1 = 0.00 s = E
369
OpenSSL::TestEngine#test_openssl_engine_id_name_inspect = 0.00 s = .
370

    
371

    
372
Finished tests in 0.014245s, 421.1978 tests/s, 912.5953 assertions/s.
373

    
374
  1) Error:
375
test_openssl_engine_cipher_rc4(OpenSSL::TestEngine):
376
OpenSSL::Engine::EngineError: no such cipher `RC4'
377
    /home/mockbuild/rpmbuild/BUILD/ruby-2.0.0-r38509/test/openssl/test_engine.rb:51:in `cipher'
378
    /home/mockbuild/rpmbuild/BUILD/ruby-2.0.0-r38509/test/openssl/test_engine.rb:51:in `block in test_openssl_engine_cipher_rc4'
379
    /home/mockbuild/rpmbuild/BUILD/ruby-2.0.0-r38509/test/openssl/test_engine.rb:68:in `crypt_data'
380
    /home/mockbuild/rpmbuild/BUILD/ruby-2.0.0-r38509/test/openssl/test_engine.rb:51:in `test_openssl_engine_cipher_rc4'
381

    
382
  2) Error:
383
test_openssl_engine_digest_sha1(OpenSSL::TestEngine):
384
OpenSSL::Digest::DigestError: Digest initialization failed.: disabled for fips
385
    /home/mockbuild/rpmbuild/BUILD/ruby-2.0.0-r38509/test/openssl/test_engine.rb:37:in `digest'
386
    /home/mockbuild/rpmbuild/BUILD/ruby-2.0.0-r38509/test/openssl/test_engine.rb:37:in `test_openssl_engine_digest_sha1'
387

    
388
6 tests, 13 assertions, 0 failures, 2 errors, 0 skips
389

    
390
ruby -v: ruby 2.0.0dev (2012-12-20 trunk 38509) [x86_64-linux]
391
make: *** [yes-test-all] Error 2
392
./miniruby -I./lib -I. -I.ext/common  ./tool/runruby.rb --extout=.ext  -- --disable-gems "./test/runner.rb" --ruby="./miniruby -I./lib -I. -I.ext/common  ./tool/runruby.rb --extout=.ext  -- --disable-gems"  -v 'test/openssl/test_pkey_dsa.rb'
393
Run options: "--ruby=./miniruby -I./lib -I. -I.ext/common  ./tool/runruby.rb --extout=.ext  -- --disable-gems" -v
394

    
395
# Running tests:
396

    
397
OpenSSL::TestPKeyDSA#test_digest_state_irrelevant_verify = 0.00 s = E
398
OpenSSL::TestPKeyDSA#test_export_format_is_DSA_PUBKEY_pem = 0.00 s = .
399
OpenSSL::TestPKeyDSA#test_export_password_length = 0.01 s = .
400
OpenSSL::TestPKeyDSA#test_new = 0.00 s = E
401
OpenSSL::TestPKeyDSA#test_new_break = 0.00 s = E
402
OpenSSL::TestPKeyDSA#test_private = 0.00 s = E
403
OpenSSL::TestPKeyDSA#test_read_DSAPublicKey_pem = 0.00 s = .
404
OpenSSL::TestPKeyDSA#test_read_DSA_PUBKEY = 0.00 s = .
405
OpenSSL::TestPKeyDSA#test_read_DSA_PUBKEY_pem = 0.00 s = .
406
OpenSSL::TestPKeyDSA#test_read_private_key_der = 0.00 s = .
407
OpenSSL::TestPKeyDSA#test_read_private_key_pem = 0.00 s = .
408
OpenSSL::TestPKeyDSA#test_read_private_key_pem_pw = 0.02 s = .
409
OpenSSL::TestPKeyDSA#test_read_public_key_der = 0.00 s = .
410
OpenSSL::TestPKeyDSA#test_read_public_key_pem = 0.00 s = .
411
OpenSSL::TestPKeyDSA#test_sign_verify = 0.00 s = E
412
OpenSSL::TestPKeyDSA#test_sign_verify_sha1 = 0.00 s = E
413
OpenSSL::TestPKeyDSA#test_sign_verify_sha256 = 0.00 s = E
414
OpenSSL::TestPKeyDSA#test_sys_sign_verify = 0.00 s = E
415

    
416

    
417
Finished tests in 0.047449s, 379.3530 tests/s, 1264.5100 assertions/s.
418

    
419
  1) Error:
420
test_digest_state_irrelevant_verify(OpenSSL::TestPKeyDSA):
421
OpenSSL::PKey::PKeyError: key size too small
422
    /home/mockbuild/rpmbuild/BUILD/ruby-2.0.0-r38509/test/openssl/test_pkey_dsa.rb:59:in `sign'
423
    /home/mockbuild/rpmbuild/BUILD/ruby-2.0.0-r38509/test/openssl/test_pkey_dsa.rb:59:in `test_digest_state_irrelevant_verify'
424

    
425
  2) Error:
426
test_new(OpenSSL::TestPKeyDSA):
427
OpenSSL::PKey::DSAError: key size invalid
428
    /home/mockbuild/rpmbuild/BUILD/ruby-2.0.0-r38509/test/openssl/test_pkey_dsa.rb:19:in `initialize'
429
    /home/mockbuild/rpmbuild/BUILD/ruby-2.0.0-r38509/test/openssl/test_pkey_dsa.rb:19:in `new'
430
    /home/mockbuild/rpmbuild/BUILD/ruby-2.0.0-r38509/test/openssl/test_pkey_dsa.rb:19:in `test_new'
431

    
432
  3) Error:
433
test_new_break(OpenSSL::TestPKeyDSA):
434
OpenSSL::PKey::DSAError: key size invalid
435
    /home/mockbuild/rpmbuild/BUILD/ruby-2.0.0-r38509/test/openssl/test_pkey_dsa.rb:26:in `initialize'
436
    /home/mockbuild/rpmbuild/BUILD/ruby-2.0.0-r38509/test/openssl/test_pkey_dsa.rb:26:in `new'
437
    /home/mockbuild/rpmbuild/BUILD/ruby-2.0.0-r38509/test/openssl/test_pkey_dsa.rb:26:in `test_new_break'
438

    
439
  4) Error:
440
test_private(OpenSSL::TestPKeyDSA):
441
OpenSSL::PKey::DSAError: key size invalid
442
    /home/mockbuild/rpmbuild/BUILD/ruby-2.0.0-r38509/test/openssl/test_pkey_dsa.rb:8:in `initialize'
443
    /home/mockbuild/rpmbuild/BUILD/ruby-2.0.0-r38509/test/openssl/test_pkey_dsa.rb:8:in `new'
444
    /home/mockbuild/rpmbuild/BUILD/ruby-2.0.0-r38509/test/openssl/test_pkey_dsa.rb:8:in `test_private'
445

    
446
  5) Error:
447
test_sign_verify(OpenSSL::TestPKeyDSA):
448
OpenSSL::PKey::PKeyError: key size too small
449
    /home/mockbuild/rpmbuild/BUILD/ruby-2.0.0-r38509/test/openssl/test_pkey_dsa.rb:235:in `sign'
450
    /home/mockbuild/rpmbuild/BUILD/ruby-2.0.0-r38509/test/openssl/test_pkey_dsa.rb:235:in `check_sign_verify'
451
    /home/mockbuild/rpmbuild/BUILD/ruby-2.0.0-r38509/test/openssl/test_pkey_dsa.rb:41:in `test_sign_verify'
452

    
453
  6) Error:
454
test_sign_verify_sha1(OpenSSL::TestPKeyDSA):
455
OpenSSL::PKey::PKeyError: key size too small
456
    /home/mockbuild/rpmbuild/BUILD/ruby-2.0.0-r38509/test/openssl/test_pkey_dsa.rb:235:in `sign'
457
    /home/mockbuild/rpmbuild/BUILD/ruby-2.0.0-r38509/test/openssl/test_pkey_dsa.rb:235:in `check_sign_verify'
458
    /home/mockbuild/rpmbuild/BUILD/ruby-2.0.0-r38509/test/openssl/test_pkey_dsa.rb:46:in `test_sign_verify_sha1'
459

    
460
  7) Error:
461
test_sign_verify_sha256(OpenSSL::TestPKeyDSA):
462
OpenSSL::PKey::PKeyError: key size too small
463
    /home/mockbuild/rpmbuild/BUILD/ruby-2.0.0-r38509/test/openssl/test_pkey_dsa.rb:235:in `sign'
464
    /home/mockbuild/rpmbuild/BUILD/ruby-2.0.0-r38509/test/openssl/test_pkey_dsa.rb:235:in `check_sign_verify'
465
    /home/mockbuild/rpmbuild/BUILD/ruby-2.0.0-r38509/test/openssl/test_pkey_dsa.rb:50:in `test_sign_verify_sha256'
466

    
467
  8) Error:
468
test_sys_sign_verify(OpenSSL::TestPKeyDSA):
469
OpenSSL::PKey::DSAError: key size too small
470
    /home/mockbuild/rpmbuild/BUILD/ruby-2.0.0-r38509/test/openssl/test_pkey_dsa.rb:36:in `syssign'
471
    /home/mockbuild/rpmbuild/BUILD/ruby-2.0.0-r38509/test/openssl/test_pkey_dsa.rb:36:in `test_sys_sign_verify'
472

    
473
18 tests, 60 assertions, 0 failures, 8 errors, 0 skips
474

    
475
ruby -v: ruby 2.0.0dev (2012-12-20 trunk 38509) [x86_64-linux]
476
make: *** [yes-test-all] Error 8
477
./miniruby -I./lib -I. -I.ext/common  ./tool/runruby.rb --extout=.ext  -- --disable-gems "./test/runner.rb" --ruby="./miniruby -I./lib -I. -I.ext/common  ./tool/runruby.rb --extout=.ext  -- --disable-gems"  -v 'test/openssl/test_x509req.rb'
478
Run options: "--ruby=./miniruby -I./lib -I. -I.ext/common  ./tool/runruby.rb --extout=.ext  -- --disable-gems" -v
479

    
480
# Running tests:
481

    
482
OpenSSL::TestX509Request#test_attr = 0.00 s = .
483
OpenSSL::TestX509Request#test_public_key = 0.00 s = E
484
OpenSSL::TestX509Request#test_sign_and_verify = 0.00 s = E
485
OpenSSL::TestX509Request#test_subject = 0.00 s = .
486
OpenSSL::TestX509Request#test_version = 0.00 s = .
487

    
488

    
489
Finished tests in 0.025100s, 199.2005 tests/s, 956.1624 assertions/s.
490

    
491
  1) Error:
492
test_public_key(OpenSSL::TestX509Request):
493
OpenSSL::X509::RequestError: EVP lib
494
    /home/mockbuild/rpmbuild/BUILD/ruby-2.0.0-r38509/test/openssl/test_x509req.rb:19:in `sign'
495
    /home/mockbuild/rpmbuild/BUILD/ruby-2.0.0-r38509/test/openssl/test_x509req.rb:19:in `issue_csr'
496
    /home/mockbuild/rpmbuild/BUILD/ruby-2.0.0-r38509/test/openssl/test_x509req.rb:29:in `test_public_key'
497

    
498
  2) Error:
499
test_sign_and_verify(OpenSSL::TestX509Request):
500
OpenSSL::Digest::DigestError: Digest initialization failed.: disabled for fips
501
    /home/mockbuild/rpmbuild/BUILD/ruby-2.0.0-r38509/.ext/common/openssl/digest.rb:51:in `initialize'
502
    /home/mockbuild/rpmbuild/BUILD/ruby-2.0.0-r38509/.ext/common/openssl/digest.rb:51:in `block (3 levels) in <class:Digest>'
503
    /home/mockbuild/rpmbuild/BUILD/ruby-2.0.0-r38509/test/openssl/test_x509req.rb:110:in `new'
504
    /home/mockbuild/rpmbuild/BUILD/ruby-2.0.0-r38509/test/openssl/test_x509req.rb:110:in `test_sign_and_verify'
505

    
506
5 tests, 24 assertions, 0 failures, 2 errors, 0 skips
507

    
508
ruby -v: ruby 2.0.0dev (2012-12-20 trunk 38509) [x86_64-linux]
509
make: *** [yes-test-all] Error 2
510
./miniruby -I./lib -I. -I.ext/common  ./tool/runruby.rb --extout=.ext  -- --disable-gems "./test/runner.rb" --ruby="./miniruby -I./lib -I. -I.ext/common  ./tool/runruby.rb --extout=.ext  -- --disable-gems"  -v 'test/openssl/test_pkey_rsa.rb'
511
Run options: "--ruby=./miniruby -I./lib -I. -I.ext/common  ./tool/runruby.rb --extout=.ext  -- --disable-gems" -v
512

    
513
# Running tests:
514

    
515
OpenSSL::TestPKeyRSA#test_digest_state_irrelevant_sign = 0.00 s = .
516
OpenSSL::TestPKeyRSA#test_digest_state_irrelevant_verify = 0.00 s = .
517
OpenSSL::TestPKeyRSA#test_export_format_is_RSA_PUBKEY = 0.00 s = E
518
OpenSSL::TestPKeyRSA#test_export_format_is_RSA_PUBKEY_pem = 0.00 s = E
519
OpenSSL::TestPKeyRSA#test_export_password_length = 0.01 s = .
520
OpenSSL::TestPKeyRSA#test_new = 0.00 s = E
521
OpenSSL::TestPKeyRSA#test_new_break = 0.00 s = .
522
OpenSSL::TestPKeyRSA#test_new_exponent_default = 0.00 s = E
523
OpenSSL::TestPKeyRSA#test_new_with_exponent = 0.00 s = E
524
OpenSSL::TestPKeyRSA#test_padding = 0.00 s = E
525
OpenSSL::TestPKeyRSA#test_private = 0.00 s = E
526
OpenSSL::TestPKeyRSA#test_read_RSAPublicKey = 0.00 s = .
527
OpenSSL::TestPKeyRSA#test_read_RSAPublicKey_pem = 0.00 s = .
528
OpenSSL::TestPKeyRSA#test_read_RSA_PUBKEY = 0.00 s = .
529
OpenSSL::TestPKeyRSA#test_read_RSA_PUBKEY_pem = 0.00 s = .
530
OpenSSL::TestPKeyRSA#test_read_private_key_der = 0.00 s = .
531
OpenSSL::TestPKeyRSA#test_read_private_key_pem = 0.00 s = .
532
OpenSSL::TestPKeyRSA#test_read_private_key_pem_pw = 0.02 s = .
533
OpenSSL::TestPKeyRSA#test_read_private_key_pem_pw_exception = 0.01 s = .
534
OpenSSL::TestPKeyRSA#test_read_public_key_der = 0.00 s = .
535
OpenSSL::TestPKeyRSA#test_read_public_key_pem = 0.00 s = .
536
OpenSSL::TestPKeyRSA#test_sign_verify = 0.00 s = .
537

    
538

    
539
Finished tests in 0.060756s, 362.1018 tests/s, 938.1728 assertions/s.
540

    
541
  1) Error:
542
test_export_format_is_RSA_PUBKEY(OpenSSL::TestPKeyRSA):
543
OpenSSL::PKey::RSAError: key too short
544
    /home/mockbuild/rpmbuild/BUILD/ruby-2.0.0-r38509/test/openssl/test_pkey_rsa.rb:177:in `initialize'
545
    /home/mockbuild/rpmbuild/BUILD/ruby-2.0.0-r38509/test/openssl/test_pkey_rsa.rb:177:in `new'
546
    /home/mockbuild/rpmbuild/BUILD/ruby-2.0.0-r38509/test/openssl/test_pkey_rsa.rb:177:in `test_export_format_is_RSA_PUBKEY'
547

    
548
  2) Error:
549
test_export_format_is_RSA_PUBKEY_pem(OpenSSL::TestPKeyRSA):
550
OpenSSL::PKey::RSAError: key too short
551
    /home/mockbuild/rpmbuild/BUILD/ruby-2.0.0-r38509/test/openssl/test_pkey_rsa.rb:183:in `initialize'
552
    /home/mockbuild/rpmbuild/BUILD/ruby-2.0.0-r38509/test/openssl/test_pkey_rsa.rb:183:in `new'
553
    /home/mockbuild/rpmbuild/BUILD/ruby-2.0.0-r38509/test/openssl/test_pkey_rsa.rb:183:in `test_export_format_is_RSA_PUBKEY_pem'
554

    
555
  3) Error:
556
test_new(OpenSSL::TestPKeyRSA):
557
OpenSSL::PKey::RSAError: key too short
558
    /home/mockbuild/rpmbuild/BUILD/ruby-2.0.0-r38509/test/openssl/test_pkey_rsa.rb:45:in `initialize'
559
    /home/mockbuild/rpmbuild/BUILD/ruby-2.0.0-r38509/test/openssl/test_pkey_rsa.rb:45:in `new'
560
    /home/mockbuild/rpmbuild/BUILD/ruby-2.0.0-r38509/test/openssl/test_pkey_rsa.rb:45:in `test_new'
561

    
562
  4) Error:
563
test_new_exponent_default(OpenSSL::TestPKeyRSA):
564
OpenSSL::PKey::RSAError: key too short
565
    /home/mockbuild/rpmbuild/BUILD/ruby-2.0.0-r38509/test/openssl/test_pkey_rsa.rb:52:in `initialize'
566
    /home/mockbuild/rpmbuild/BUILD/ruby-2.0.0-r38509/test/openssl/test_pkey_rsa.rb:52:in `new'
567
    /home/mockbuild/rpmbuild/BUILD/ruby-2.0.0-r38509/test/openssl/test_pkey_rsa.rb:52:in `test_new_exponent_default'
568

    
569
  5) Error:
570
test_new_with_exponent(OpenSSL::TestPKeyRSA):
571
OpenSSL::PKey::RSAError: key too short
572
    /home/mockbuild/rpmbuild/BUILD/ruby-2.0.0-r38509/test/openssl/test_pkey_rsa.rb:58:in `initialize'
573
    /home/mockbuild/rpmbuild/BUILD/ruby-2.0.0-r38509/test/openssl/test_pkey_rsa.rb:58:in `new'
574
    /home/mockbuild/rpmbuild/BUILD/ruby-2.0.0-r38509/test/openssl/test_pkey_rsa.rb:58:in `block in test_new_with_exponent'
575
    /home/mockbuild/rpmbuild/BUILD/ruby-2.0.0-r38509/test/openssl/test_pkey_rsa.rb:56:in `upto'
576
    /home/mockbuild/rpmbuild/BUILD/ruby-2.0.0-r38509/test/openssl/test_pkey_rsa.rb:56:in `test_new_with_exponent'
577

    
578
  6) Error:
579
test_padding(OpenSSL::TestPKeyRSA):
580
OpenSSL::PKey::RSAError: key too short
581
    /home/mockbuild/rpmbuild/BUILD/ruby-2.0.0-r38509/test/openssl/test_pkey_rsa.rb:8:in `initialize'
582
    /home/mockbuild/rpmbuild/BUILD/ruby-2.0.0-r38509/test/openssl/test_pkey_rsa.rb:8:in `new'
583
    /home/mockbuild/rpmbuild/BUILD/ruby-2.0.0-r38509/test/openssl/test_pkey_rsa.rb:8:in `test_padding'
584

    
585
  7) Error:
586
test_private(OpenSSL::TestPKeyRSA):
587
OpenSSL::PKey::RSAError: key too short
588
    /home/mockbuild/rpmbuild/BUILD/ruby-2.0.0-r38509/test/openssl/test_pkey_rsa.rb:34:in `initialize'
589
    /home/mockbuild/rpmbuild/BUILD/ruby-2.0.0-r38509/test/openssl/test_pkey_rsa.rb:34:in `new'
590
    /home/mockbuild/rpmbuild/BUILD/ruby-2.0.0-r38509/test/openssl/test_pkey_rsa.rb:34:in `test_private'
591

    
592
22 tests, 57 assertions, 0 failures, 7 errors, 0 skips
593

    
594
ruby -v: ruby 2.0.0dev (2012-12-20 trunk 38509) [x86_64-linux]
595
make: *** [yes-test-all] Error 7
596
./miniruby -I./lib -I. -I.ext/common  ./tool/runruby.rb --extout=.ext  -- --disable-gems "./test/runner.rb" --ruby="./miniruby -I./lib -I. -I.ext/common  ./tool/runruby.rb --extout=.ext  -- --disable-gems"  -v 'test/openssl/test_ssl_session.rb'
597
Run options: "--ruby=./miniruby -I./lib -I. -I.ext/common  ./tool/runruby.rb --extout=.ext  -- --disable-gems" -v
598

    
599
# Running tests:
600

    
601
OpenSSL::TestSSLSession#test_client_session = 0.09 s = .
602
OpenSSL::TestSSLSession#test_ctx_client_session_cb = 0.02 s = E
603
OpenSSL::TestSSLSession#test_ctx_server_session_cb = 0.02 s = E
604
OpenSSL::TestSSLSession#test_server_session = 0.38 s = .
605
OpenSSL::TestSSLSession#test_session = 0.04 s = .
606
OpenSSL::TestSSLSession#test_session_equals = 0.02 s = .
607
OpenSSL::TestSSLSession#test_session_exts_read = 0.02 s = .
608
OpenSSL::TestSSLSession#test_session_time = 0.02 s = .
609
OpenSSL::TestSSLSession#test_session_timeout = 0.02 s = .
610

    
611

    
612
Finished tests in 0.652468s, 13.7938 tests/s, 107.2849 assertions/s.
613

    
614
  1) Error:
615
test_ctx_client_session_cb(OpenSSL::TestSSLSession):
616
Errno::ECONNRESET: Connection reset by peer - SSL_connect
617
    /home/mockbuild/rpmbuild/BUILD/ruby-2.0.0-r38509/test/openssl/test_ssl_session.rb:294:in `connect'
618
    /home/mockbuild/rpmbuild/BUILD/ruby-2.0.0-r38509/test/openssl/test_ssl_session.rb:294:in `block in test_ctx_client_session_cb'
619
    /home/mockbuild/rpmbuild/BUILD/ruby-2.0.0-r38509/test/openssl/utils.rb:298:in `call'
620
    /home/mockbuild/rpmbuild/BUILD/ruby-2.0.0-r38509/test/openssl/utils.rb:298:in `start_server'
621
    /home/mockbuild/rpmbuild/BUILD/ruby-2.0.0-r38509/test/openssl/test_ssl_session.rb:290:in `test_ctx_client_session_cb'
622

    
623
  2) Error:
624
test_ctx_server_session_cb(OpenSSL::TestSSLSession):
625
Errno::ECONNRESET: Connection reset by peer - SSL_connect
626
    /home/mockbuild/rpmbuild/BUILD/ruby-2.0.0-r38509/test/openssl/test_ssl_session.rb:351:in `connect'
627
    /home/mockbuild/rpmbuild/BUILD/ruby-2.0.0-r38509/test/openssl/test_ssl_session.rb:351:in `block (2 levels) in test_ctx_server_session_cb'
628
    /home/mockbuild/rpmbuild/BUILD/ruby-2.0.0-r38509/test/openssl/test_ssl_session.rb:346:in `times'
629
    /home/mockbuild/rpmbuild/BUILD/ruby-2.0.0-r38509/test/openssl/test_ssl_session.rb:346:in `block in test_ctx_server_session_cb'
630
    /home/mockbuild/rpmbuild/BUILD/ruby-2.0.0-r38509/test/openssl/utils.rb:298:in `call'
631
    /home/mockbuild/rpmbuild/BUILD/ruby-2.0.0-r38509/test/openssl/utils.rb:298:in `start_server'
632
    /home/mockbuild/rpmbuild/BUILD/ruby-2.0.0-r38509/test/openssl/test_ssl_session.rb:344:in `test_ctx_server_session_cb'
633

    
634
9 tests, 70 assertions, 0 failures, 2 errors, 0 skips
635

    
636
ruby -v: ruby 2.0.0dev (2012-12-20 trunk 38509) [x86_64-linux]
637
make: *** [yes-test-all] Error 2
638
./miniruby -I./lib -I. -I.ext/common  ./tool/runruby.rb --extout=.ext  -- --disable-gems "./test/runner.rb" --ruby="./miniruby -I./lib -I. -I.ext/common  ./tool/runruby.rb --extout=.ext  -- --disable-gems"  -v 'test/openssl/test_x509cert.rb'
639
Run options: "--ruby=./miniruby -I./lib -I. -I.ext/common  ./tool/runruby.rb --extout=.ext  -- --disable-gems" -v
640

    
641
# Running tests:
642

    
643
OpenSSL::TestX509Certificate#test_check_private_key = 0.01 s = .
644
OpenSSL::TestX509Certificate#test_dsa_with_sha2 = 0.00 s = .
645
OpenSSL::TestX509Certificate#test_dsig_algorithm_mismatch = 0.00 s = F
646
OpenSSL::TestX509Certificate#test_extension = 0.01 s = E
647
OpenSSL::TestX509Certificate#test_public_key = 0.01 s = E
648
OpenSSL::TestX509Certificate#test_serial = 0.02 s = .
649
OpenSSL::TestX509Certificate#test_sign_and_verify = 0.01 s = E
650
OpenSSL::TestX509Certificate#test_validity = 0.03 s = .
651

    
652

    
653
Finished tests in 0.105347s, 75.9396 tests/s, 417.6679 assertions/s.
654

    
655
  1) Failure:
656
test_dsig_algorithm_mismatch(OpenSSL::TestX509Certificate) [/home/mockbuild/rpmbuild/BUILD/ruby-2.0.0-r38509/test/openssl/test_x509cert.rb:181]:
657
[OpenSSL::X509::CertificateError] exception expected, not
658
Class: <OpenSSL::Digest::DigestError>
659
Message: <"Digest initialization failed.: disabled for fips">
660
---Backtrace---
661
/home/mockbuild/rpmbuild/BUILD/ruby-2.0.0-r38509/.ext/common/openssl/digest.rb:51:in `initialize'
662
/home/mockbuild/rpmbuild/BUILD/ruby-2.0.0-r38509/.ext/common/openssl/digest.rb:51:in `block (3 levels) in <class:Digest>'
663
/home/mockbuild/rpmbuild/BUILD/ruby-2.0.0-r38509/test/openssl/test_x509cert.rb:183:in `new'
664
/home/mockbuild/rpmbuild/BUILD/ruby-2.0.0-r38509/test/openssl/test_x509cert.rb:183:in `block in test_dsig_algorithm_mismatch'
665
---------------
666

    
667
  2) Error:
668
test_public_key(OpenSSL::TestX509Certificate):
669
OpenSSL::X509::CertificateError: EVP lib
670
    /home/mockbuild/rpmbuild/BUILD/ruby-2.0.0-r38509/test/openssl/utils.rb:141:in `sign'
671
    /home/mockbuild/rpmbuild/BUILD/ruby-2.0.0-r38509/test/openssl/utils.rb:141:in `issue_cert'
672
    /home/mockbuild/rpmbuild/BUILD/ruby-2.0.0-r38509/test/openssl/test_x509cert.rb:20:in `issue_cert'
673
    /home/mockbuild/rpmbuild/BUILD/ruby-2.0.0-r38509/test/openssl/test_x509cert.rb:46:in `block in test_public_key'
674
    /home/mockbuild/rpmbuild/BUILD/ruby-2.0.0-r38509/test/openssl/test_x509cert.rb:45:in `each'
675
    /home/mockbuild/rpmbuild/BUILD/ruby-2.0.0-r38509/test/openssl/test_x509cert.rb:45:in `test_public_key'
676

    
677
  3) Error:
678
test_extension(OpenSSL::TestX509Certificate):
679
OpenSSL::Digest::DigestError: Digest initialization failed.: disabled for fips
680
    /home/mockbuild/rpmbuild/BUILD/ruby-2.0.0-r38509/.ext/common/openssl/digest.rb:51:in `initialize'
681
    /home/mockbuild/rpmbuild/BUILD/ruby-2.0.0-r38509/.ext/common/openssl/digest.rb:51:in `block (3 levels) in <class:Digest>'
682
    /home/mockbuild/rpmbuild/BUILD/ruby-2.0.0-r38509/test/openssl/test_x509cert.rb:119:in `new'
683
    /home/mockbuild/rpmbuild/BUILD/ruby-2.0.0-r38509/test/openssl/test_x509cert.rb:119:in `test_extension'
684

    
685
  4) Error:
686
test_sign_and_verify(OpenSSL::TestX509Certificate):
687
OpenSSL::Digest::DigestError: Digest initialization failed.: disabled for fips
688
    /home/mockbuild/rpmbuild/BUILD/ruby-2.0.0-r38509/.ext/common/openssl/digest.rb:51:in `initialize'
689
    /home/mockbuild/rpmbuild/BUILD/ruby-2.0.0-r38509/.ext/common/openssl/digest.rb:51:in `block (3 levels) in <class:Digest>'
690
    /home/mockbuild/rpmbuild/BUILD/ruby-2.0.0-r38509/test/openssl/test_x509cert.rb:139:in `new'
691
    /home/mockbuild/rpmbuild/BUILD/ruby-2.0.0-r38509/test/openssl/test_x509cert.rb:139:in `test_sign_and_verify'
692

    
693
8 tests, 44 assertions, 1 failures, 3 errors, 0 skips
694

    
695
ruby -v: ruby 2.0.0dev (2012-12-20 trunk 38509) [x86_64-linux]
696
make: *** [yes-test-all] Error 4
697
./miniruby -I./lib -I. -I.ext/common  ./tool/runruby.rb --extout=.ext  -- --disable-gems "./test/runner.rb" --ruby="./miniruby -I./lib -I. -I.ext/common  ./tool/runruby.rb --extout=.ext  -- --disable-gems"  -v 'test/cgi/test_cgi_session.rb'
698
md5_dgst.c(78): OpenSSL internal error, assertion failed: Digest MD5 forbidden in FIPS mode!
699
make: *** [yes-test-all] Aborted
700
./miniruby -I./lib -I. -I.ext/common  ./tool/runruby.rb --extout=.ext  -- --disable-gems "./test/runner.rb" --ruby="./miniruby -I./lib -I. -I.ext/common  ./tool/runruby.rb --extout=.ext  -- --disable-gems"  -v 'test/net/pop/test_pop.rb'
701
Run options: "--ruby=./miniruby -I./lib -I. -I.ext/common  ./tool/runruby.rb --extout=.ext  -- --disable-gems" -v
702

    
703
# Running tests:
704

    
705
TestPOP#test_apop_invalid = 0.00 s = .
706
TestPOP#test_apop_invalid_at = 0.00 s = .
707
TestPOP#test_apop_ng = md5_dgst.c(78): OpenSSL internal error, assertion failed: Digest MD5 forbidden in FIPS mode!
708
make: *** [yes-test-all] Aborted
709
./miniruby -I./lib -I. -I.ext/common  ./tool/runruby.rb --extout=.ext  -- --disable-gems "./test/runner.rb" --ruby="./miniruby -I./lib -I. -I.ext/common  ./tool/runruby.rb --extout=.ext  -- --disable-gems"  -v 'test/test_pstore.rb'
710
md5_dgst.c(78): OpenSSL internal error, assertion failed: Digest MD5 forbidden in FIPS mode!
711
make: *** [yes-test-all] Aborted
712

    
713
./miniruby -I./lib -I. -I.ext/common  ./tool/runruby.rb --extout=.ext  -- --disable-gems "./test/runner.rb" --ruby="./miniruby -I./lib -I. -I.ext/common  ./tool/runruby.rb --extout=.ext  -- --disable-gems"  -v 'test/rubygems/test_gem_security.rb'
714
Run options: "--ruby=./miniruby -I./lib -I. -I.ext/common  ./tool/runruby.rb --extout=.ext  -- --disable-gems" -v
715

    
716
# Running tests:
717

    
718
TestGemSecurity#test_class_sign_AltName = 0.04 s = .
719
TestGemSecurity#test_class_reset = 0.01 s = .
720
TestGemSecurity#test_class_re_sign = 0.01 s = .
721
TestGemSecurity#test_class_re_sign_not_self_signed = 0.01 s = .
722
TestGemSecurity#test_class_email_to_name = 0.01 s = .
723
TestGemSecurity#test_class_create_cert_self_signed = 0.01 s = .
724
TestGemSecurity#test_class_create_cert = 0.01 s = .
725
TestGemSecurity#test_class_re_sign_wrong_key = 0.01 s = .
726
TestGemSecurity#test_class_create_key = 0.01 s = E
727
TestGemSecurity#test_class_sign = 0.01 s = .
728
TestGemSecurity#test_class_create_cert_email = 0.01 s = .
729
TestGemSecurity#test_class_trust_dir = 0.00 s = .
730

    
731

    
732
Finished tests in 0.143765s, 83.4696 tests/s, 472.9943 assertions/s.
733

    
734
  1) Error:
735
test_class_create_key(TestGemSecurity):
736
OpenSSL::PKey::RSAError: key too short
737
    /home/mockbuild/rpmbuild/BUILD/ruby-2.0.0-r38509/lib/rubygems/security.rb:439:in `initialize'
738
    /home/mockbuild/rpmbuild/BUILD/ruby-2.0.0-r38509/lib/rubygems/security.rb:439:in `new'
739
    /home/mockbuild/rpmbuild/BUILD/ruby-2.0.0-r38509/lib/rubygems/security.rb:439:in `create_key'
740
    /home/mockbuild/rpmbuild/BUILD/ruby-2.0.0-r38509/test/rubygems/test_gem_security.rb:98:in `test_class_create_key'
741

    
742
12 tests, 68 assertions, 0 failures, 1 errors, 0 skips
743

    
744
ruby -v: ruby 2.0.0dev (2012-12-20 trunk 38509) [x86_64-linux]
745
make: *** [yes-test-all] Error 1
746

    
747
./miniruby -I./lib -I. -I.ext/common  ./tool/runruby.rb --extout=.ext  -- --disable-gems "./test/runner.rb" --ruby="./miniruby -I./lib -I. -I.ext/common  ./tool/runruby.rb --extout=.ext  -- --disable-gems"  -v 'test/rubygems/test_gem_remote_fetcher.rb'
748
/home/mockbuild/rpmbuild/BUILD/ruby-2.0.0-r38509/test/rubygems/test_gem_remote_fetcher.rb:916:in `initialize': BN lib (OpenSSL::PKey::DHError)
749
	from /home/mockbuild/rpmbuild/BUILD/ruby-2.0.0-r38509/test/rubygems/test_gem_remote_fetcher.rb:916:in `new'
750
	from /home/mockbuild/rpmbuild/BUILD/ruby-2.0.0-r38509/test/rubygems/test_gem_remote_fetcher.rb:916:in `singleton class'
751
	from /home/mockbuild/rpmbuild/BUILD/ruby-2.0.0-r38509/test/rubygems/test_gem_remote_fetcher.rb:904:in `<class:TestGemRemoteFetcher>'
752
	from /home/mockbuild/rpmbuild/BUILD/ruby-2.0.0-r38509/test/rubygems/test_gem_remote_fetcher.rb:23:in `<top (required)>'
753
	from /home/mockbuild/rpmbuild/BUILD/ruby-2.0.0-r38509/lib/test/unit.rb:239:in `require'
754
	from /home/mockbuild/rpmbuild/BUILD/ruby-2.0.0-r38509/lib/test/unit.rb:239:in `block in non_options'
755
	from /home/mockbuild/rpmbuild/BUILD/ruby-2.0.0-r38509/lib/test/unit.rb:233:in `each'
756
	from /home/mockbuild/rpmbuild/BUILD/ruby-2.0.0-r38509/lib/test/unit.rb:233:in `non_options'
757
	from /home/mockbuild/rpmbuild/BUILD/ruby-2.0.0-r38509/lib/test/unit.rb:52:in `process_args'
758
	from /home/mockbuild/rpmbuild/BUILD/ruby-2.0.0-r38509/lib/test/unit.rb:820:in `process_args'
759
	from /home/mockbuild/rpmbuild/BUILD/ruby-2.0.0-r38509/lib/test/unit.rb:825:in `run'
760
	from /home/mockbuild/rpmbuild/BUILD/ruby-2.0.0-r38509/lib/test/unit.rb:832:in `run'
761
	from ./test/runner.rb:17:in `<main>'
762
make: *** [yes-test-all] Error 1