Project

General

Profile

Issues

Filters

Apply Clear

# Project Tracker Status Subject Assignee Updated
16013 Ruby master Bug Feedback Bundler... hsbt (Hiroshi SHIBATA) 07/20/2019 01:34 AM Actions
16008 Ruby master Bug Open Ripper hshptn node drops information 07/16/2019 07:42 PM Actions
16007 Ruby master Bug Open Process.clock_getres matches the clock in practice for Process::CLOCK_{PROCESS,THREAD}_CPUTIME_ID FAILED fails on armv7hl 07/16/2019 06:47 AM Actions
16004 Ruby master Bug Open Kernel#lambda captured with Kernel#method doesn't create lambdas 07/15/2019 12:52 PM Actions
16002 Ruby master Bug Feedback File.writable?('/tmp/file') returns true even if it's not writable on Linux 4.19+ 07/14/2019 11:59 PM Actions
16000 Ruby master Bug Open How to avoid the need for updating dependencies manually nobu (Nobuyoshi Nakada) 07/14/2019 10:34 PM Actions
15994 Ruby master Bug Open irb miscalculates nest level when typing do keyword 07/11/2019 06:55 AM Actions
15993 Ruby master Bug Open 'require' doesn't work if there are Cyrillic chars in the path to Ruby dir 07/12/2019 10:15 AM Actions
15989 Ruby master Bug Open irb-1.1.0.pre.1 crashes on using arrow up, home and delete 07/08/2019 09:16 AM Actions
15988 Ruby master Bug Assigned Time#dst? vs "real" timezones nobu (Nobuyoshi Nakada) 07/06/2019 03:56 AM Actions
15984 Ruby master Bug Feedback deleting from a collection while iterating on it 07/04/2019 07:44 PM Actions
15982 Ruby master Bug Assigned Remove y2racc and racc2y hsbt (Hiroshi SHIBATA) 07/09/2019 05:25 AM Actions
15980 Ruby master Bug Assigned Coverage shows while/until after raise if/unless as uncovered line mame (Yusuke Endoh) 07/03/2019 03:48 AM Actions
15979 Ruby master Bug Open URI.parse does not validate components 07/03/2019 12:27 AM Actions
15977 Ruby master Bug Assigned Unobvious result value from #next_rotate_time and #previous_period_end methods of Logger::Period module sonots (Naotoshi Seo) 07/02/2019 03:03 PM Actions
15957 Ruby master Bug Open Splatting nil as **kwargs 06/25/2019 05:07 AM Actions
15956 Ruby master Bug Open `{*nil}` causes confusing error message 06/25/2019 04:55 AM Actions
15944 Ruby master Bug Open Simultaneous line feeding and scrolling doesn't work well with irb on tmux aycabta (aycabta .) 06/20/2019 04:58 AM Actions
15928 Ruby master Bug Open Constant declaration does not conform to JIS 3017:2013 06/16/2019 02:37 PM Actions
15924 Ruby master Bug Open Ripper::Lexer RuntimeError - Ripper FATAL - master/trunk 06/16/2019 01:48 PM Actions
15908 Ruby master Bug Open Detecting BOM with non-UTF encoding 06/08/2019 12:44 PM Actions
15904 Ruby master Bug Feedback Ruby crashes when executing Pronto gem with Rubocop 06/07/2019 10:08 AM Actions
15888 Ruby master Bug Feedback Segmentation fault at 0x000070000afc2450 ruby 2.5.1p57 (2018-03-29 revision 63029) [x86_64-darwin18] 05/31/2019 05:29 AM Actions
15885 Ruby master Bug Open Duplicated `:raise` tracepoint event when exception inside `load` call happens 05/29/2019 10:29 AM Actions
15882 Ruby master Bug Open OpenSSL::X509::Name.parse usage rhenium (Kazuki Yamaguchi) 06/04/2019 12:54 AM Actions
15877 Ruby master Bug Open Incorrect constant lookup result in method on cloned class 05/27/2019 09:01 PM Actions
15876 Ruby master Bug Feedback 1.to_s.encoding != Encoding.default_internal 05/31/2019 08:29 PM Actions
15867 Ruby master Bug Open Enumerable#minmax inconsistent behavior with Time ranges 05/22/2019 09:52 PM Actions
15866 Ruby master Bug Feedback [BUG] Segmentation fault at 0x0000000000000020 06/03/2019 04:18 AM Actions
15856 Ruby master Bug Assigned Idempotent performance of Kernel.require with many activated gems is slow hsbt (Hiroshi SHIBATA) 05/21/2019 09:52 PM Actions
15852 Ruby master Bug Open APPLICATION_VERIFIER_LOCKS_LOCK_IN_FREED_HEAP on exiting ruby 05/15/2019 09:52 PM Actions
15850 Ruby master Bug Open Deprecate and remove optparse/ac 05/15/2019 05:19 AM Actions
15849 Ruby master Bug Open Using hash as first positional argument, mixed with named arguments causes unexpected behavior 05/14/2019 06:51 PM Actions
15835 Ruby master Bug Feedback Path traversal symlink - WEBrick 05/08/2019 03:04 PM Actions
15834 Ruby master Bug Open Mutating the result of SortedSet.to_a mutates the original set, potentially violating the set's guarantees knu (Akinori MUSHA) 05/07/2019 06:56 PM Actions
15830 Ruby master Bug Assigned SortedSet's lazy setup causes unpredictable behaviour in subclass's initialize knu (Akinori MUSHA) 06/05/2019 02:17 AM Actions
15828 Ruby master Bug Open DOTfiles and DOTfolders aren't allowed in $HOME folder on Haiku 05/06/2019 10:42 PM Actions
15827 Ruby master Bug Open Haiku: SSL tests failing 05/05/2019 05:31 PM Actions
15819 Ruby master Bug Open cannot read document of File::NULL with "ri File::NULL" 05/03/2019 09:04 AM Actions
15816 Ruby master Bug Open String#casecmp compares uppercase characters instead of lowercase 05/09/2019 08:01 AM Actions
15812 Ruby master Bug Open Run specs from install folder? 04/30/2019 12:43 PM Actions
15807 Ruby master Bug Open Range#minmax is slow and never returns for endless ranges 06/18/2019 02:08 PM Actions
15796 Ruby master Bug Open Ramdon console crashes 04/26/2019 04:47 PM Actions
15795 Ruby master Bug Open Some test fails on Haiku 04/26/2019 01:28 PM Actions
15790 Ruby master Bug Open Strange interaction between autoload and $LOADED_FEATURES 04/24/2019 07:57 PM Actions
15787 Ruby master Bug Feedback LoadError by EPERM on read-only volume 05/05/2019 03:57 PM Actions
15784 Ruby master Bug Open RUBY_DEBUG=gc_stress dumps core 04/23/2019 09:53 AM Actions
15779 Ruby master Bug Open After NoMemoryError, ruby freezes and takes 100% CPU 05/16/2019 05:07 PM Actions
15767 Ruby master Bug Open .rvm/rubies/ruby-2.4.4/lib/ruby/2.4.0/timeout.rb:86: [BUG] Segmentation fault at 0x000000010ae58a3a 04/15/2019 08:11 AM Actions
15764 Ruby master Bug Open Whitespace and control characters should not be permitted in tokens matz (Yukihiro Matsumoto) 04/22/2019 07:48 AM Actions
15763 Ruby master Bug Open Segmentation fault in timeout.rb / sleep 06/15/2019 01:53 AM Actions
15754 Ruby master Bug Open MinGW build/compile failure with Ruby 2.5.5, but 2.6.2 & trunk ok 04/08/2019 06:11 PM Actions
15753 Ruby master Bug Open unknown keyword when passing an hash to a method that accepts a default argument and a named argument 04/08/2019 02:35 AM Actions
15749 Ruby master Bug Open Rails Sever Crashing 04/05/2019 11:52 AM Actions
15737 Ruby master Bug Open Queue#pop randomly hangs forever ko1 (Koichi Sasada) 04/02/2019 03:01 AM Actions
15735 Ruby master Bug Open Thread#handle_interrupt does not prevent Thread#kill from interrupting 03/28/2019 10:42 PM Actions
15729 Ruby master Bug Open OpenSSL::SSL::SSLSocket#connect randomly hangs ko1 (Koichi Sasada) 04/02/2019 03:01 AM Actions
15728 Ruby master Bug Feedback error compiling C - file under Ruby 04/22/2019 10:32 AM Actions
15727 Ruby master Bug Feedback [BUG] Segmentation fault at 0x0000000000000000 ruby 2.5.3p105 (2018-10-18 revision 65156) [x86_64-linux] 04/23/2019 09:03 AM Actions
15726 Ruby master Bug Open Error compiling Ruby 03/24/2019 06:02 PM Actions
15718 Ruby master Bug Open YAML raises error when dumping strings with UTF32 encoding 03/21/2019 11:33 PM Actions
15717 Ruby master Bug Open Backport #15270 to Ruby 2.5.x 04/24/2019 06:00 AM Actions
15712 Ruby master Bug Feedback DateTime#=== should be defined and compare date and time instead of just the date 03/22/2019 05:36 PM Actions
15675 Ruby master Bug Feedback "fatal - exception reentered" error after installing Ruby 2.5.5 04/23/2019 09:14 AM Actions
15674 Ruby master Bug Open Regression: ObjectSpace.allocation_sourceline produces the wrong location for allocations, it shows the end of the method instead of the line where the object was created 03/18/2019 03:49 PM Actions
15669 Ruby master Bug Open This issue was marked as resolved in 2.5.5 release note but I'm still experiencing it 03/15/2019 04:04 PM Actions
15661 Ruby master Bug Open Disallow concurrent Dir.chdir with block 03/14/2019 08:42 PM Actions
15655 Ruby master Bug Open Unable to handle Russian dirname on Windows 03/11/2019 10:08 AM Actions
15646 Ruby master Bug Open method_defined? inside method_added behaves differently for `initialize` 03/10/2019 06:25 AM Actions
15644 Ruby master Bug Open ThreadsWait problems with Thread#report_on_exception 03/13/2019 12:04 PM Actions
15639 Ruby master Bug Open [BUG] Segmentation fault at 0x000000010e82ca3a 03/05/2019 04:51 PM Actions
15638 Ruby master Bug Open Another race conditions in MonitorMixin when interrupted? 03/05/2019 10:46 AM Actions
15634 Ruby master Bug Open TracePoint seems to be skipping some methods. 03/05/2019 07:35 PM Actions
15629 Ruby master Bug Open super_method fails on binded/unbinded/cloned methods 03/01/2019 12:57 AM Actions
15627 Ruby master Bug Open Appearance of custom singleton classes 03/10/2019 04:40 PM Actions
15625 Ruby master Bug Open Module#name performance has exponential-time worst case by aliased constants 05/22/2019 09:29 AM Actions
15623 Ruby master Bug Open Ruby 2.6.1 Segmentation Fault in on Phusion Passenger server boot in dev 03/19/2019 09:40 AM Actions
15621 Ruby master Bug Open system({}, ...) breaks nonascii ENV["PATH"] on Windows 02/25/2019 08:51 AM Actions
15620 Ruby master Bug Open Block argument usage affects lambda semantic matz (Yukihiro Matsumoto) 07/15/2019 10:02 PM Actions
15613 Ruby master Bug Open Enumerator::Chain#each doesn't relay block signature nobu (Nobuyoshi Nakada) 02/22/2019 04:07 PM Actions
15608 Ruby master Bug Open What should be the correct output for Method#inspect with singleton methods? 02/28/2019 11:49 PM Actions
15601 Ruby master Bug Feedback bug in the Ruby interpreter or extension libraries. 02/13/2019 02:57 AM Actions
15599 Ruby master Bug Open Mixing autoload and require causes deadlock and incomplete definition. 02/12/2019 01:40 PM Actions
15598 Ruby master Bug Open Deadlock on mutual reference of autoloaded constants 03/20/2019 10:58 AM Actions
15589 Ruby master Bug Open `Numeric#zero?` is much slower than `== 0` k0kubun (Takashi Kokubun) 02/07/2019 01:07 AM Actions
15587 Ruby master Bug Open Thread tests failing 03/23/2019 10:06 AM Actions
15583 Ruby master Bug Open Regex: ? on quantified group {n} is interpreted as optional, should be lazy 02/16/2019 05:13 AM Actions
15579 Ruby master Bug Assigned make step when building ruby 2.4.5 on AIX 7.1 results in a Segmentation fault : ruby-2.4.5/lib/rdoc/markup/parser.rb:325 cruby-aix 02/02/2019 06:34 AM Actions
15576 Ruby master Bug Open Wrong error message from some class methods of `Dir` 01/31/2019 01:09 PM Actions
15570 Ruby master Bug Open rb_int2big signature change #14036 breaks VIM on 32b arches 01/30/2019 09:21 AM Actions
15569 Ruby master Bug Open TestResolvDNS#test_no_server always fails on usa's mswin environment ko1 (Koichi Sasada) 04/02/2019 03:01 AM Actions
15558 Ruby master Bug Open Should Exception#exception copy the backtrace? Eregon (Benoit Daloze) 06/05/2019 08:19 PM Actions
15551 Ruby master Bug Open The behavior of FIX2INT and FIX2UINT differs by platform 01/20/2019 09:21 PM Actions
15550 Ruby master Bug Assigned Windows - gem bin files - can't run from bash shell hsbt (Hiroshi SHIBATA) 03/20/2019 01:05 AM Actions
15517 Ruby master Bug Open Net::HTTP not recognizing valid UTF-8 01/20/2019 01:15 AM Actions
15509 Ruby master Bug Open TCPServer#accept isn't interrupted 01/05/2019 06:09 PM Actions
15507 Ruby master Bug Open Thread#raise is delivered to GC context 01/05/2019 06:13 PM Actions
15493 Ruby master Bug Feedback Seg Fault on 'vagrant up' Fedora29 intel 01/11/2019 08:46 AM Actions
15490 Ruby master Bug Open socket.rb - recurring segmentation faults 06/11/2019 02:55 PM Actions
15465 Ruby master Bug Feedback Tests failed on i386-cygwin 01/09/2019 07:55 AM Actions
15449 Ruby master Bug Open Range#=== is not using cover in Ruby 2.6 12/21/2018 01:58 PM Actions
15438 Ruby master Bug Open Threads can't switch faster than TIME_QUANTUM_(NSEC|USEC|MSEC) 03/25/2019 08:53 PM Actions
15433 Ruby master Bug Open OpenStruct NameError vs NoMethodError spec fails for method_missing 12/18/2018 06:25 PM Actions
15428 Ruby master Bug Open Refactor Proc#>> and #<< 01/20/2019 08:04 PM Actions
15425 Ruby master Bug Open Store MJIT header into Ruby versioned directory. 01/03/2019 03:38 PM Actions
15423 Ruby master Bug Open fork leapfrog leaks memory on FreeBSD 11.2 12/16/2018 02:28 PM Actions
15422 Ruby master Bug Open Re: [ruby-cvs:73514] normal:r66413 (trunk): thread_pthread.c: fix memory leak from fork loop leapfrog (v3) 12/16/2018 02:13 PM Actions
15417 Ruby master Bug Open Pathname case insensitive comparison 12/15/2018 04:35 AM Actions
15409 Ruby master Bug Assigned OpenStruct error when attribute is called 'method' marcandre (Marc-Andre Lafortune) 05/09/2019 03:15 PM Actions
15404 Ruby master Bug Open Endless range has inconsistent chaining behaviour 01/30/2019 09:54 PM Actions
15397 Ruby master Bug Open Ruby process doesn't release memory back to os on CentOS 12/11/2018 03:31 AM Actions
15392 Ruby master Bug Open Crash in RubyVM::InstructionSequence#to_binary 12/14/2018 01:50 PM Actions
15386 Ruby master Bug Open [PATCH] io.c (rb_io_check_char_readable): do not io_fflush buffered sockets 12/06/2018 11:38 AM Actions
15375 Ruby master Bug Open Crash report for Ruby 2.5.3p105 02/14/2019 12:39 AM Actions
15372 Ruby master Bug Open openssl 1.1.1a on Debian sid test failures rhenium (Kazuki Yamaguchi) 12/03/2018 11:48 AM Actions
15371 Ruby master Bug Open IRB with ARGV 03/22/2019 02:19 PM Actions
15368 Ruby master Bug Feedback Crash Report log information 01/17/2019 11:15 AM Actions
15367 Ruby master Bug Open IO.select is not resumed when io-object gets closed 12/03/2018 10:22 AM Actions
15359 Ruby master Bug Assigned Bundler help is not properly integrated hsbt (Hiroshi SHIBATA) 12/01/2018 01:01 AM Actions
15357 Ruby master Bug Open Proc#parameters returns incomplete type information 11/30/2018 05:34 AM Actions
15355 Ruby master Bug Open Random segmentation faults in development environment 11/28/2018 06:10 PM Actions
15334 Ruby master Bug Open child_info_fork::abort: address space needed by 'emoji_iso2022_kddi.so' on cygwin nobu (Nobuyoshi Nakada) 12/10/2018 07:14 AM Actions
15315 Ruby master Bug Open ec_switch can still lose interrupts ko1 (Koichi Sasada) 11/20/2018 09:32 AM Actions
15313 Ruby master Bug Open [PATCH] Let debuggers know when a tail call happens ko1 (Koichi Sasada) 12/05/2018 07:05 AM Actions
15310 Ruby master Bug Open [PATCH] thread_pthread.c: close race from UBF_TIMER and non-GVL-releasing thread 11/20/2018 12:50 AM Actions
15309 Ruby master Bug Assigned ECB is broken rhenium (Kazuki Yamaguchi) 03/20/2019 05:19 AM Actions
15306 Ruby master Bug Open Generate prelude.c using miniruby 11/16/2018 09:07 AM Actions
15290 Ruby master Bug Open load_from_binary Bus error on Solaris sparc nagachika (Tomoyuki Chikanaga) 11/08/2018 12:37 PM Actions
15276 Ruby master Bug Open URI.join behaviour is unintuitive 11/02/2018 03:25 AM Actions
15273 Ruby master Bug Open Ruby crashing after updating Mac OS to Mojave (10.14) 11/01/2018 09:38 AM Actions
15268 Ruby master Bug Open Solarisでtest/drb/test_drbssl.rbが落ちる openssl 11/06/2018 03:48 PM Actions
15267 Ruby master Bug Open File.basename + File.extname does not restore the original name 10/29/2018 06:25 AM Actions
15263 Ruby master Bug Open [PATCH] vm_trace.c (postponed_job_register): only hit main thread ko1 (Koichi Sasada) 10/27/2018 11:35 PM Actions
15262 Ruby master Bug Feedback WeakRef::RefError for object that is still in use 10/31/2018 10:07 AM Actions
15255 Ruby master Bug Open Change in protected handling 2.3 -> 2.4,2.5 10/25/2018 10:43 PM Actions
15253 Ruby master Bug Feedback Arduinoとの接続においてSocket.tcp_server_loop中で$stderr.puts、pなどが使用できない 10/28/2018 11:48 AM Actions
15252 Ruby master Bug Open hitting what seems like a gc segfault at random 10/24/2018 07:12 PM Actions
15247 Ruby master Bug Open Windows - TEMP folder, non 8.3 & drive, fails & errors in test-all (ruby & rdoc) 10/23/2018 05:02 PM Actions
15244 Ruby master Bug Open Method #extname return empty string if filename is dot ('.') 02/16/2019 08:01 AM Actions
15241 Ruby master Bug Open net/pop fix to use mutable strings was too eager 10/30/2018 10:17 AM Actions
15240 Ruby master Bug Open Set operations check for is_a?(Set), rather than allowing duck typing knu (Akinori MUSHA) 05/05/2019 07:27 PM Actions
15235 Ruby master Bug Open [patch] appveyor.yml - remove MinGW dll's from mswin testing PATH 10/19/2018 02:41 AM Actions
15233 Ruby master Bug Assigned Speeding Up Matrix Powers marcandre (Marc-Andre Lafortune) 10/23/2018 10:44 PM Actions
15227 Ruby master Bug Open Wrong version of ruby is used during tests 10/16/2018 02:46 PM Actions
15226 Ruby master Bug Open Resolv::DNS unable to handle responses larger than default size 10/16/2018 01:35 PM Actions
15211 Ruby master Bug Open Integer.try_convert 10/07/2018 09:23 AM Actions
15209 Ruby master Bug Open r64925 order-only-prerequisites - make targets - breaking change 10/06/2018 03:51 PM Actions
15204 Ruby master Bug Open globbing should be prevented when wildcard is surrounded by double quotes in the ruby's command line 10/05/2018 08:29 AM Actions
15188 Ruby master Bug Open Incorrect warning "assigned but unused variable" when using ripper with $VERBOSE = true 10/10/2018 11:04 AM Actions
15187 Ruby master Bug Open IPv6 x-forwarded-host results in "bad URI" error 10/01/2018 01:45 PM Actions
15179 Ruby master Bug Feedback Segfault caused by only 'loop{ x<<[] }' 10/01/2018 01:33 PM Actions
15178 Ruby master Bug Open Wrong paramaters passing to pthread_setname_np(3) 09/29/2018 03:43 PM Actions
15177 Ruby master Bug Open 起動した後にTZを変更するとTime#utcがずれることがある 10/09/2018 01:04 PM Actions
15173 Ruby master Bug Open Segmentation fault 09/28/2018 12:50 PM Actions
15170 Ruby master Bug Assigned Allow WEBrick::HTTPServlet::initialize to accept an array in server[:CGIInterpreter] normalperson (Eric Wong) 01/04/2019 03:58 AM Actions
15140 Ruby master Bug Feedback Bug in Interpreter or Extension Libraries 09/19/2018 10:26 AM Actions
15138 Ruby master Bug Open non-symbol keyword in double splat, such as **{2 => 3}, raises TypeError or not 09/18/2018 05:12 PM Actions
15097 Ruby master Bug Open Gem install fails on Ruby 2.5.1 with Cygwin (get_dns_server_list undefined) 09/10/2018 07:18 PM Actions
15082 Ruby master Bug Feedback Memory leak in net/http/response and net/http/header 06/17/2019 11:13 PM Actions
15078 Ruby master Bug Open Hash splat of empty hash should not create a positional argument. matz (Yukihiro Matsumoto) 09/19/2018 01:59 AM Actions
15072 Ruby master Bug Open thread.c:4356:5: error: implicit declaration of function ‘ubf_list_atfork’ normalperson (Eric Wong) 09/20/2018 03:32 AM Actions
15070 Ruby master Bug Feedback configure fails with (probably spurious) 'something wrong with CFLAGS="-g -O2 "' on macOS High Sierra 09/05/2018 05:17 PM Actions
15067 Ruby master Bug Open library/socket/socket/getnameinfo_spec.rb always errors with multiple IP addresses hostname 09/04/2018 06:47 AM Actions
15052 Ruby master Bug Open must not optimize `foo(**{})` out 08/31/2018 12:09 PM Actions
15045 Ruby master Bug Open Test suite fails/hangs with stronger cryptography enforcement 08/29/2018 04:16 PM Actions
15044 Ruby master Bug Open ENV encoding not UTF-8 by default 08/29/2018 06:40 PM Actions
15038 Ruby master Bug Open Appveyor MinGW - bundled gems missing? 08/28/2018 04:17 PM Actions
15034 Ruby master Bug Feedback Crash in Opensuse Software management 08/28/2018 12:12 AM Actions
15033 Ruby master Bug Open Encoding fallback uses wrong character when multiple conversions are required 08/27/2018 09:19 PM Actions
15027 Ruby master Bug Feedback When Struct#each method is overriden Struct#select and Struct#to_a use wrong collections 09/26/2018 10:24 AM Actions
15001 Ruby master Bug Open Peek causes cursor to advance when enumerating the lines of a file 08/22/2018 10:13 AM Actions
14997 Ruby master Bug Open Socket connect timeout exceeds the timeout value for 07/02/2019 10:58 AM Actions
14976 Ruby master Bug Feedback /usr/local/lib/ruby/gems/2.6.0/gems/fluentd-1.2.4/lib/fluent/event.rb:193: [BUG] Segmentation fault at 0x0000000000000000 ruby 2.6.0preview1 (2018-02-24 trunk 62554) [x86_64-linux] 08/14/2018 11:23 AM Actions
14972 Ruby master Bug Open Net::HTTP inconsistently raises EOFError when peer closes the connection 02/12/2019 05:03 AM Actions
14971 Ruby master Bug Open error: implicit declaration of function ‘rb_vm_call0 nobu (Nobuyoshi Nakada) 09/06/2018 03:53 AM Actions
14963 Ruby master Bug Open Since r64107, on Solaris, spec test of rb_io_wait_readable hangs up 08/03/2018 02:49 PM Actions
14961 Ruby master Bug Feedback Segfault when running RSpec / Capybara / Rails 08/03/2018 08:42 AM Actions
14957 Ruby master Bug Open MinGW, gcc 8.2.0, bootstraptest test_thread.rb - failure ? 08/03/2018 02:46 PM Actions
14943 Ruby master Bug Open ruby 2.4 doesn't work with jemalloc 5.1.0 properly. 07/27/2018 10:22 AM Actions
14922 Ruby master Bug Assigned Resolv getaddresses ignores AAAA records for IPv6 akr (Akira Tanaka) 07/25/2018 07:44 AM Actions
14910 Ruby master Bug Feedback /usr/local/Cellar/ruby/2.5.1/lib/ruby/2.5.0/x86_64-darwin17/openssl.bundle: [BUG] Segmentation fault at 0x0000000000000001 07/13/2018 01:15 AM Actions
14909 Ruby master Bug Feedback Method call with object that has to_hash method crashes (method with splat and keyword arguments) 07/13/2018 03:18 PM Actions
14906 Ruby master Bug Open MinGW failure - TestIO#test_copy_stream_no_busy_wait 07/12/2018 03:52 AM Actions
14900 Ruby master Bug Open Extra allocation in String#byteslice 07/08/2018 11:35 AM Actions
14895 Ruby master Bug Open Inconsistent constant names when using const_set on a singleton class 07/05/2018 09:10 PM Actions
14891 Ruby master Bug Open Pathname#join has different behaviour to File.join 07/13/2018 04:58 AM Actions
14889 Ruby master Bug Open TracePoint for :line never seems to trigger on argument list. Maybe by design? 07/01/2018 03:59 PM Actions
14884 Ruby master Bug Feedback msys2 mingw32 'rake' has unexpected text at top of file 07/04/2018 11:20 PM Actions
14879 Ruby master Bug Open Time#+ and Time#- do not preserve receiver's utc_offset if ENV['TZ'] is modified after receiver is created 06/19/2019 07:55 PM Actions
14874 Ruby master Bug Open Segmentation fault under Cygwin 06/27/2018 02:33 PM Actions
14870 Ruby master Bug Open Both TracePoint's :call and :c_call filters seem to skip a lot of builtin methods nobu (Nobuyoshi Nakada) 06/26/2018 02:26 PM Actions
14849 Ruby master Bug Feedback rbenv install 2.4.0 on AWS EC2 on AMI linux box 06/18/2018 12:21 AM Actions
14843 Ruby master Bug Assigned [BUG] Illegal instruction at 0x000000010c7acc0a tenderlovemaking (Aaron Patterson) 06/16/2018 09:35 PM Actions
14838 Ruby master Bug Open RegexpError with double "s" in look-behind assertion in case-insensitive unicode regexp 06/09/2018 04:04 PM Actions
14835 Ruby master Bug Open Impossible to know whether an exception was rescued or not using TracePoint 06/08/2018 08:58 AM Actions
14826 Ruby master Bug Open make: *** [.ext/include/sparc-solaris2.10/rb_mjit_min_header-2.6.0.h] Error 1 on Solaris 10 with very old gcc3 06/05/2018 02:02 PM Actions
14824 Ruby master Bug Open Endless Range Support in irb 06/05/2018 10:45 AM Actions
14823 Ruby master Bug Feedback Endless Range Excluding End 06/05/2018 02:31 PM Actions
14817 Ruby master Bug Assigned TracePoint#parameters for bmethod's return event should return the same value as its Method#parameters ko1 (Koichi Sasada) 07/15/2019 02:51 AM Actions
14810 Ruby master Bug Feedback Segfault during travis build (Ruby trunk 63545) 06/17/2019 11:31 PM Actions
(1-200/2307) Per page: 50, 100, 200, 500

Also available in: Atom CSV PDF