Project

General

Profile

Issues

Filters

Apply Clear

# Project Tracker Status Subject Assignee Updated
16175 Ruby master Bug Open Object#clone(freeze: true) is inconsistent with Object#clone(freeze: false) 09/22/2019 09:59 AM Actions
16173 Ruby master Bug Open ENV.delete returns nil when name does not exist and block given 09/21/2019 05:11 PM Actions
16169 Ruby master Bug Open rescue in a method argument 09/18/2019 11:49 AM Actions
16162 Ruby master Bug Feedback Resque::DirtyExit - Child process received unhandled signal (You may have encountered a bug in the Ruby interpreter or extension libraries) 09/14/2019 07:23 AM Actions
16161 Ruby master Bug Open tailcall_optimization may be disabled after r67315 09/12/2019 09:43 AM Actions
16159 Ruby master Bug Open Off by 1 errors from time_params tests 09/11/2019 05:35 PM Actions
16158 Ruby master Bug Open "st" Character Sequence In Regex Look-Behind Causes Illegal Pattern Error When Combined With POSIX Bracket Expressions And Case Insensitivity Flag 09/17/2019 09:37 AM Actions
16154 Ruby master Bug Open lib/delegate.rb issues keyword argument warnings 09/21/2019 08:54 PM Actions
16151 Ruby master Bug Open [PATCH] Fix a class of fstring related use-after-free 09/19/2019 08:31 PM Actions
16149 Ruby master Bug Feedback Segfault during page reload in rails 09/06/2019 09:01 PM Actions
16145 Ruby master Bug Open regexp match error if mixing /i, character classes, and utf8 09/06/2019 05:52 AM Actions
16143 Ruby master Bug Open BOM UTF-8 is not removed after rewind 09/05/2019 01:57 PM Actions
16138 Ruby master Bug Open Backport Struct.new empty option hash fix to 2.5 and 2.6 09/04/2019 09:35 AM Actions
16135 Ruby master Bug Feedback Segmentation fault in Ruby 2.6.1 09/20/2019 04:29 PM Actions
16132 Ruby master Bug Open Ruby 2.7 IRB crashes after pressing Insert and Delete 09/01/2019 06:48 AM Actions
16127 Ruby master Bug Open Delegates to BasicObject do not work 09/02/2019 05:12 AM Actions
16121 Ruby master Bug Open Stop making a redundant hash copy in Hash#dup ko1 (Koichi Sasada) 09/20/2019 08:35 AM Actions
16116 Ruby master Bug Open ruby2.6.3(x86/x64) use win32ole could not new Object, return 0x80070057 08/22/2019 12:01 PM Actions
16114 Ruby master Bug Open Naming of "beginless range" 09/19/2019 05:56 AM Actions
16110 Ruby master Bug Open Doesn't detect deadlock on Ruby 2.4 and 2.5 on Windows 08/19/2019 02:28 PM Actions
16100 Ruby master Bug Open Visibility modifiers don't call super correctly when overridden in alternative ways 08/17/2019 01:54 AM Actions
16092 Ruby master Bug Feedback [doc] precedence of modifier-rescue 08/09/2019 06:51 PM Actions
16044 Ruby master Bug Open Float::ROUNDS (FLT_ROUNDS) should not be a constant. 08/06/2019 05:13 PM Actions
16043 Ruby master Bug Open `$LOAD_PATH.resolve_feature_path` should not raise 08/04/2019 01:43 PM Actions
16034 Ruby master Bug Open Backport 5d33f787169bcc3594d2264726695d58c4a06899 to Ruby 2.6 08/02/2019 12:05 AM Actions
16033 Ruby master Bug Open test_callinfo_unreachable_path Bus Error on Solaris sparc 08/01/2019 01:58 PM Actions
16031 Ruby master Bug Open Inconsistency between Date::strptime and Time::strptime at the end of a month 07/31/2019 07:27 PM Actions
16030 Ruby master Bug Open test_memsize fails on x32 ABI: Unsupported RVALUE_SIZE=24 07/31/2019 07:29 AM Actions
16013 Ruby master Bug Feedback Bundler... hsbt (Hiroshi SHIBATA) 07/20/2019 01:34 AM Actions
16008 Ruby master Bug Open Ripper hshptn node drops information nobu (Nobuyoshi Nakada) 07/30/2019 07:34 AM Actions
16007 Ruby master Bug Assigned Process.clock_getres matches the clock in practice for Process::CLOCK_{PROCESS,THREAD}_CPUTIME_ID FAILED fails on armv7hl Eregon (Benoit Daloze) 09/09/2019 10:23 AM Actions
16004 Ruby master Bug Open Kernel#lambda captured with Kernel#method doesn't create lambdas 07/15/2019 12:52 PM Actions
16002 Ruby master Bug Feedback File.writable?('/tmp/file') returns true even if it's not writable on Linux 4.19+ 07/14/2019 11:59 PM Actions
15993 Ruby master Bug Open 'require' doesn't work if there are Cyrillic chars in the path to Ruby dir 08/01/2019 08:25 PM Actions
15982 Ruby master Bug Assigned Remove y2racc and racc2y hsbt (Hiroshi SHIBATA) 08/19/2019 04:24 PM Actions
15980 Ruby master Bug Assigned Coverage shows while/until after raise if/unless as uncovered line mame (Yusuke Endoh) 07/03/2019 03:48 AM Actions
15979 Ruby master Bug Open URI.parse does not validate components 07/03/2019 12:27 AM Actions
15977 Ruby master Bug Assigned Unobvious result value from #next_rotate_time and #previous_period_end methods of Logger::Period module sonots (Naotoshi Seo) 07/30/2019 05:39 AM Actions
15944 Ruby master Bug Open Simultaneous line feeding and scrolling doesn't work well with irb on tmux aycabta (aycabta .) 06/20/2019 04:58 AM Actions
15928 Ruby master Bug Open Constant declaration does not conform to JIS 3017:2013 06/16/2019 02:37 PM Actions
15882 Ruby master Bug Open OpenSSL::X509::Name.parse usage rhenium (Kazuki Yamaguchi) 06/04/2019 12:54 AM Actions
15856 Ruby master Bug Assigned Idempotent performance of Kernel.require with many activated gems is slow hsbt (Hiroshi SHIBATA) 05/21/2019 09:52 PM Actions
15852 Ruby master Bug Open APPLICATION_VERIFIER_LOCKS_LOCK_IN_FREED_HEAP on exiting ruby 05/15/2019 09:52 PM Actions
15834 Ruby master Bug Open Mutating the result of SortedSet.to_a mutates the original set, potentially violating the set's guarantees knu (Akinori MUSHA) 05/07/2019 06:56 PM Actions
15828 Ruby master Bug Open DOTfiles and DOTfolders aren't allowed in $HOME folder on Haiku 05/06/2019 10:42 PM Actions
15827 Ruby master Bug Open Haiku: SSL tests failing 05/05/2019 05:31 PM Actions
15819 Ruby master Bug Open cannot read document of File::NULL with "ri File::NULL" 05/03/2019 09:04 AM Actions
15816 Ruby master Bug Open String#casecmp compares uppercase characters instead of lowercase 05/09/2019 08:01 AM Actions
15796 Ruby master Bug Open Ramdon console crashes 04/26/2019 04:47 PM Actions
15795 Ruby master Bug Open Some test fails on Haiku 04/26/2019 01:28 PM Actions
15790 Ruby master Bug Open Strange interaction between autoload and $LOADED_FEATURES 04/24/2019 07:57 PM Actions
15787 Ruby master Bug Feedback LoadError by EPERM on read-only volume 05/05/2019 03:57 PM Actions
15779 Ruby master Bug Open After NoMemoryError, ruby freezes and takes 100% CPU 05/16/2019 05:07 PM Actions
15764 Ruby master Bug Open Whitespace and control characters should not be permitted in tokens matz (Yukihiro Matsumoto) 04/22/2019 07:48 AM Actions
15763 Ruby master Bug Open Segmentation fault in timeout.rb / sleep 06/15/2019 01:53 AM Actions
15754 Ruby master Bug Open MinGW build/compile failure with Ruby 2.5.5, but 2.6.2 & trunk ok 04/08/2019 06:11 PM Actions
15749 Ruby master Bug Open Rails Sever Crashing 04/05/2019 11:52 AM Actions
15737 Ruby master Bug Open Queue#pop randomly hangs forever ko1 (Koichi Sasada) 04/02/2019 03:01 AM Actions
15735 Ruby master Bug Open Thread#handle_interrupt does not prevent Thread#kill from interrupting 03/28/2019 10:42 PM Actions
15729 Ruby master Bug Open OpenSSL::SSL::SSLSocket#connect randomly hangs ko1 (Koichi Sasada) 04/02/2019 03:01 AM Actions
15718 Ruby master Bug Open YAML raises error when dumping strings with UTF32 encoding 03/21/2019 11:33 PM Actions
15717 Ruby master Bug Open Backport #15270 to Ruby 2.5.x 04/24/2019 06:00 AM Actions
15712 Ruby master Bug Feedback DateTime#=== should be defined and compare date and time instead of just the date 03/22/2019 05:36 PM Actions
15674 Ruby master Bug Open Regression: ObjectSpace.allocation_sourceline produces the wrong location for allocations, it shows the end of the method instead of the line where the object was created 03/18/2019 03:49 PM Actions
15669 Ruby master Bug Open This issue was marked as resolved in 2.5.5 release note but I'm still experiencing it 03/15/2019 04:04 PM Actions
15661 Ruby master Bug Open Disallow concurrent Dir.chdir with block 03/14/2019 08:42 PM Actions
15655 Ruby master Bug Open Unable to handle Russian dirname on Windows 03/11/2019 10:08 AM Actions
15646 Ruby master Bug Open method_defined? inside method_added behaves differently for `initialize` 03/10/2019 06:25 AM Actions
15644 Ruby master Bug Open ThreadsWait problems with Thread#report_on_exception 03/13/2019 12:04 PM Actions
15634 Ruby master Bug Open TracePoint seems to be skipping some methods. 03/05/2019 07:35 PM Actions
15629 Ruby master Bug Open super_method fails on binded/unbinded/cloned methods 03/01/2019 12:57 AM Actions
15627 Ruby master Bug Open Appearance of custom singleton classes 03/10/2019 04:40 PM Actions
15623 Ruby master Bug Open Ruby 2.6.1 Segmentation Fault in on Phusion Passenger server boot in dev 03/19/2019 09:40 AM Actions
15621 Ruby master Bug Open system({}, ...) breaks nonascii ENV["PATH"] on Windows 02/25/2019 08:51 AM Actions
15620 Ruby master Bug Assigned Block argument usage affects lambda semantic ko1 (Koichi Sasada) 07/30/2019 07:30 AM Actions
15613 Ruby master Bug Open Enumerator::Chain#each doesn't relay block signature nobu (Nobuyoshi Nakada) 08/28/2019 11:46 PM Actions
15608 Ruby master Bug Open What should be the correct output for Method#inspect with singleton methods? 02/28/2019 11:49 PM Actions
15599 Ruby master Bug Open Mixing autoload and require causes deadlock and incomplete definition. 02/12/2019 01:40 PM Actions
15598 Ruby master Bug Open Deadlock on mutual reference of autoloaded constants 03/20/2019 10:58 AM Actions
15589 Ruby master Bug Open `Numeric#zero?` is much slower than `== 0` k0kubun (Takashi Kokubun) 02/07/2019 01:07 AM Actions
15587 Ruby master Bug Open Thread tests failing 03/23/2019 10:06 AM Actions
15579 Ruby master Bug Assigned make step when building ruby 2.4.5 on AIX 7.1 results in a Segmentation fault : ruby-2.4.5/lib/rdoc/markup/parser.rb:325 cruby-aix 02/02/2019 06:34 AM Actions
15576 Ruby master Bug Open Wrong error message from some class methods of `Dir` 01/31/2019 01:09 PM Actions
15570 Ruby master Bug Open rb_int2big signature change #14036 breaks VIM on 32b arches 01/30/2019 09:21 AM Actions
15569 Ruby master Bug Open TestResolvDNS#test_no_server always fails on usa's mswin environment ko1 (Koichi Sasada) 04/02/2019 03:01 AM Actions
15551 Ruby master Bug Open The behavior of FIX2INT and FIX2UINT differs by platform 07/30/2019 08:55 PM Actions
15550 Ruby master Bug Assigned Windows - gem bin files - can't run from bash shell hsbt (Hiroshi SHIBATA) 03/20/2019 01:05 AM Actions
15517 Ruby master Bug Open Net::HTTP not recognizing valid UTF-8 01/20/2019 01:15 AM Actions
15507 Ruby master Bug Open Thread#raise is delivered to GC context 01/05/2019 06:13 PM Actions
15465 Ruby master Bug Feedback Tests failed on i386-cygwin 01/09/2019 07:55 AM Actions
15438 Ruby master Bug Open Threads can't switch faster than TIME_QUANTUM_(NSEC|USEC|MSEC) 03/25/2019 08:53 PM Actions
15433 Ruby master Bug Open OpenStruct NameError vs NoMethodError spec fails for method_missing 12/18/2018 06:25 PM Actions
15428 Ruby master Bug Open Refactor Proc#>> and #<< 01/20/2019 08:04 PM Actions
15425 Ruby master Bug Open Store MJIT header into Ruby versioned directory. 01/03/2019 03:38 PM Actions
15423 Ruby master Bug Open fork leapfrog leaks memory on FreeBSD 11.2 12/16/2018 02:28 PM Actions
15422 Ruby master Bug Open Re: [ruby-cvs:73514] normal:r66413 (trunk): thread_pthread.c: fix memory leak from fork loop leapfrog (v3) 12/16/2018 02:13 PM Actions
15417 Ruby master Bug Open Pathname case insensitive comparison 12/15/2018 04:35 AM Actions
15409 Ruby master Bug Assigned OpenStruct error when attribute is called 'method' marcandre (Marc-Andre Lafortune) 05/09/2019 03:15 PM Actions
15404 Ruby master Bug Open Endless range has inconsistent chaining behaviour 01/30/2019 09:54 PM Actions
15386 Ruby master Bug Open [PATCH] io.c (rb_io_check_char_readable): do not io_fflush buffered sockets 12/06/2018 11:38 AM Actions
15372 Ruby master Bug Open openssl 1.1.1a on Debian sid test failures rhenium (Kazuki Yamaguchi) 12/03/2018 11:48 AM Actions
15367 Ruby master Bug Open IO.select is not resumed when io-object gets closed 12/03/2018 10:22 AM Actions
15359 Ruby master Bug Assigned Bundler help is not properly integrated hsbt (Hiroshi SHIBATA) 12/01/2018 01:01 AM Actions
15355 Ruby master Bug Feedback Random segmentation faults in development environment 08/28/2019 01:15 AM Actions
15334 Ruby master Bug Open child_info_fork::abort: address space needed by 'emoji_iso2022_kddi.so' on cygwin nobu (Nobuyoshi Nakada) 12/10/2018 07:14 AM Actions
15315 Ruby master Bug Open ec_switch can still lose interrupts ko1 (Koichi Sasada) 11/20/2018 09:32 AM Actions
15313 Ruby master Bug Open [PATCH] Let debuggers know when a tail call happens ko1 (Koichi Sasada) 12/05/2018 07:05 AM Actions
15310 Ruby master Bug Open [PATCH] thread_pthread.c: close race from UBF_TIMER and non-GVL-releasing thread 11/20/2018 12:50 AM Actions
15276 Ruby master Bug Open URI.join behaviour is unintuitive 11/02/2018 03:25 AM Actions
15273 Ruby master Bug Feedback Ruby crashing after updating Mac OS to Mojave (10.14) 08/28/2019 01:16 AM Actions
15268 Ruby master Bug Open Solarisでtest/drb/test_drbssl.rbが落ちる openssl 11/06/2018 03:48 PM Actions
15267 Ruby master Bug Open File.basename + File.extname does not restore the original name 08/13/2019 11:49 PM Actions
15263 Ruby master Bug Open [PATCH] vm_trace.c (postponed_job_register): only hit main thread ko1 (Koichi Sasada) 10/27/2018 11:35 PM Actions
15262 Ruby master Bug Feedback WeakRef::RefError for object that is still in use 10/31/2018 10:07 AM Actions
15253 Ruby master Bug Feedback Arduinoとの接続においてSocket.tcp_server_loop中で$stderr.puts、pなどが使用できない 10/28/2018 11:48 AM Actions
15247 Ruby master Bug Open Windows - TEMP folder, non 8.3 & drive, fails & errors in test-all (ruby & rdoc) 10/23/2018 05:02 PM Actions
15244 Ruby master Bug Feedback Method #extname return empty string if filename is dot ('.') 09/02/2019 09:42 AM Actions
15227 Ruby master Bug Open Wrong version of ruby is used during tests 10/16/2018 02:46 PM Actions
15209 Ruby master Bug Open r64925 order-only-prerequisites - make targets - breaking change 10/06/2018 03:51 PM Actions
15204 Ruby master Bug Open globbing should be prevented when wildcard is surrounded by double quotes in the ruby's command line 10/05/2018 08:29 AM Actions
15188 Ruby master Bug Open Incorrect warning "assigned but unused variable" when using ripper with $VERBOSE = true 08/27/2019 07:02 PM Actions
15187 Ruby master Bug Open IPv6 x-forwarded-host results in "bad URI" error 08/27/2019 05:24 AM Actions
15179 Ruby master Bug Feedback Segfault caused by only 'loop{ x<<[] }' 10/01/2018 01:33 PM Actions
15178 Ruby master Bug Open Wrong paramaters passing to pthread_setname_np(3) 09/29/2018 03:43 PM Actions
15177 Ruby master Bug Open 起動した後にTZを変更するとTime#utcがずれることがある 10/09/2018 01:04 PM Actions
15173 Ruby master Bug Feedback Segmentation fault 08/27/2019 04:46 AM Actions
15097 Ruby master Bug Open Gem install fails on Ruby 2.5.1 with Cygwin (get_dns_server_list undefined) 09/10/2018 07:18 PM Actions
15072 Ruby master Bug Open thread.c:4356:5: error: implicit declaration of function ‘ubf_list_atfork’ normalperson (Eric Wong) 09/20/2018 03:32 AM Actions
15052 Ruby master Bug Open must not optimize `foo(**{})` out 08/31/2018 12:09 PM Actions
15044 Ruby master Bug Open ENV encoding not UTF-8 by default 08/29/2018 06:40 PM Actions
15038 Ruby master Bug Open Appveyor MinGW - bundled gems missing? 08/28/2018 04:17 PM Actions
15033 Ruby master Bug Open Encoding fallback uses wrong character when multiple conversions are required 08/27/2018 09:19 PM Actions
15027 Ruby master Bug Feedback When Struct#each method is overriden Struct#select and Struct#to_a use wrong collections 09/26/2018 10:24 AM Actions
14997 Ruby master Bug Open Socket connect timeout exceeds the timeout value for 07/02/2019 10:58 AM Actions
14972 Ruby master Bug Open Net::HTTP inconsistently raises EOFError when peer closes the connection 08/12/2019 09:13 PM Actions
14971 Ruby master Bug Open error: implicit declaration of function ‘rb_vm_call0 nobu (Nobuyoshi Nakada) 09/06/2018 03:53 AM Actions
14963 Ruby master Bug Open Since r64107, on Solaris, spec test of rb_io_wait_readable hangs up 08/03/2018 02:49 PM Actions
14957 Ruby master Bug Open MinGW, gcc 8.2.0, bootstraptest test_thread.rb - failure ? 08/03/2018 02:46 PM Actions
14906 Ruby master Bug Open MinGW failure - TestIO#test_copy_stream_no_busy_wait 07/12/2018 03:52 AM Actions
14900 Ruby master Bug Open Extra allocation in String#byteslice 07/08/2018 11:35 AM Actions
14895 Ruby master Bug Open Inconsistent constant names when using const_set on a singleton class 07/05/2018 09:10 PM Actions
14891 Ruby master Bug Open Pathname#join has different behaviour to File.join 07/13/2018 04:58 AM Actions
14889 Ruby master Bug Open TracePoint for :line never seems to trigger on argument list. Maybe by design? 07/01/2018 03:59 PM Actions
14884 Ruby master Bug Feedback msys2 mingw32 'rake' has unexpected text at top of file 07/04/2018 11:20 PM Actions
14874 Ruby master Bug Open Segmentation fault under Cygwin 06/27/2018 02:33 PM Actions
14870 Ruby master Bug Open Both TracePoint's :call and :c_call filters seem to skip a lot of builtin methods nobu (Nobuyoshi Nakada) 06/26/2018 02:26 PM Actions
14843 Ruby master Bug Assigned [BUG] Illegal instruction at 0x000000010c7acc0a tenderlovemaking (Aaron Patterson) 06/16/2018 09:35 PM Actions
14838 Ruby master Bug Open RegexpError with double "s" in look-behind assertion in case-insensitive unicode regexp 06/09/2018 04:04 PM Actions
14835 Ruby master Bug Open Impossible to know whether an exception was rescued or not using TracePoint 06/08/2018 08:58 AM Actions
14826 Ruby master Bug Open make: *** [.ext/include/sparc-solaris2.10/rb_mjit_min_header-2.6.0.h] Error 1 on Solaris 10 with very old gcc3 06/05/2018 02:02 PM Actions
14824 Ruby master Bug Open Endless Range Support in irb 06/05/2018 10:45 AM Actions
14823 Ruby master Bug Feedback Endless Range Excluding End 06/05/2018 02:31 PM Actions
14817 Ruby master Bug Assigned TracePoint#parameters for bmethod's return event should return the same value as its Method#parameters ko1 (Koichi Sasada) 07/15/2019 02:51 AM Actions
14804 Ruby master Bug Open GzipReader cannot read Freebase dump (but gzcat/zless can) 06/01/2018 10:45 PM Actions
14761 Ruby master Bug Open TestThread#test_join_limits hangs up on Solaris 10 with gcc 05/16/2018 05:23 AM Actions
14755 Ruby master Bug Open Aborted (core dumped) 05/12/2018 06:20 PM Actions
14745 Ruby master Bug Open High memory usage when using String#replace with IO.copy_stream 05/18/2018 06:52 PM Actions
14744 Ruby master Bug Open Refinements modules have a superclass matz (Yukihiro Matsumoto) 05/09/2018 09:09 AM Actions
14743 Ruby master Bug Open Some links broken in README 05/09/2018 05:41 AM Actions
14737 Ruby master Bug Assigned Split default gems into separate directory structure hsbt (Hiroshi SHIBATA) 09/11/2019 02:48 PM Actions
14732 Ruby master Bug Open CGI.unescape returns different instance between Ruby 2.3 and 2.4 05/03/2018 01:33 AM Actions
14727 Ruby master Bug Assigned TestQueue#test_queue_with_trap always timeout on Windows10 ko1 (Koichi Sasada) 05/01/2018 02:59 AM Actions
14726 Ruby master Bug Open wrong message when superclass is not a Class 05/07/2018 06:39 AM Actions
14716 Ruby master Bug Open SecureRandom throwing an error in Ruby 2.5.1 08/30/2019 01:41 PM Actions
14704 Ruby master Bug Open Module#ancestors looks wrong when a module is both included and prepended in the same class. 04/20/2018 03:23 PM Actions
14682 Ruby master Bug Feedback Error [BUG] unexpected THREAD_KILLED 08/26/2019 07:37 PM Actions
14681 Ruby master Bug Open `syswrite': stream closed in another thread (IOError) 04/22/2018 12:12 AM Actions
14679 Ruby master Bug Assigned StdLib gems should properly specify their dependencies hsbt (Hiroshi SHIBATA) 04/11/2018 01:14 PM Actions
14678 Ruby master Bug Feedback Segmentation fault in pg 10/28/2018 02:50 PM Actions
14671 Ruby master Bug Open Refining Module#refine itself introduces strange state 04/10/2018 06:27 AM Actions
14663 Ruby master Bug Open getting "killed string.c" rdoc failed while trying to make ruby-2_5_1 04/04/2018 10:03 PM Actions
14662 Ruby master Bug Open Stack consistency error in 2.5.1 04/20/2018 01:40 PM Actions
14640 Ruby master Bug Open [win32] File.realpath treats a relative path with a drive letter as an absolute path. cruby-windows 12/10/2018 07:09 AM Actions
14635 Ruby master Bug Feedback Float#round(n) returns a wrong result when n is big 03/27/2018 01:57 PM Actions
14631 Ruby master Bug Open Add support for long paths in Windows 10 when support is enabled in the OS 03/26/2018 11:43 AM Actions
14626 Ruby master Bug Assigned One failing test on trunk 58fbe69a5b and OSX ko1 (Koichi Sasada) 03/26/2018 12:53 PM Actions
14616 Ruby master Bug Feedback Segmentation fault in net/http/response 08/26/2019 07:32 PM Actions
14607 Ruby master Bug Open Fix use of the rb_profile_frames start parameter 04/27/2018 12:30 AM Actions
14596 Ruby master Bug Open Ruby master is broken with bootsnap 03/23/2018 06:21 AM Actions
14591 Ruby master Bug Open Files with invalid multi-byte characters will cause Find::find() to raise EINVAL exception 08/27/2019 10:20 AM Actions
14582 Ruby master Bug Open Unable to use `method__entry` and `method_return` tracing probes since 2.5 06/05/2018 03:42 AM Actions
14570 Ruby master Bug Open Wired behavior of File.expand_path() on Windows 03/03/2018 12:13 AM Actions
14563 Ruby master Bug Open irb in irb raises a FATAL error 06/19/2019 09:38 PM Actions
14560 Ruby master Bug Feedback Segmentation fault near the end of large Rails test suite 08/26/2019 05:28 PM Actions
14558 Ruby master Bug Open "Backtrace in reverse order" always upsets my brain! 02/28/2018 09:41 PM Actions
14543 Ruby master Bug Assigned `make commit` show error of `common-srcs` nobu (Nobuyoshi Nakada) 06/02/2018 04:17 AM Actions
14541 Ruby master Bug Open Class variables have broken semantics, let's fix them 01/03/2019 03:26 PM Actions
14505 Ruby master Bug Feedback IO.popen / Open3.popen2 / backtick subprocess remains blocked 02/22/2018 07:11 AM Actions
14480 Ruby master Bug Open miniruby crashing when compiled with -O2 or -O1 on aarch64 04/10/2018 12:04 AM Actions
14479 Ruby master Bug Open Exceptions raised from a :call tracepoint can sometimes be "rescued" inside the method 02/15/2018 03:09 AM Actions
14474 Ruby master Bug Open skip "TestException#test_thread_signal_location" as known bug 12/10/2018 07:09 AM Actions
14471 Ruby master Bug Open DRb mixing up function return values between PIDs after fork() 02/13/2018 05:14 PM Actions
14466 Ruby master Bug Assigned Errno::ECONNRESET or Errno::EPIPE raised instead of HTTPResponse returned when POSTing with large body naruse (Yui NARUSE) 06/20/2019 08:04 PM Actions
14456 Ruby master Bug Open Dir.glob with FNM_CASEFOLD gives ArgumentError: invalid byte sequence in UTF-8 02/07/2018 08:36 PM Actions
14437 Ruby master Bug Open Integer == doesn't work with coerce since 2.4 (and != since 1.9). Should it? 02/04/2018 02:38 PM Actions
14434 Ruby master Bug Open IO#reopen fails after EPIPE 02/02/2018 10:32 AM Actions
14429 Ruby master Bug Assigned Overzealous escaping of + in Shellwords knu (Akinori MUSHA) 06/20/2019 08:27 PM Actions
14422 Ruby master Bug Open Ruby configuration options should not be reused for gem builds 03/05/2018 03:32 PM Actions
14418 Ruby master Bug Open ruby 2.5 slow regexp execution 01/30/2018 07:32 AM Actions
14413 Ruby master Bug Feedback `-n` and `-p` flags break when stdout is closed 01/29/2018 02:17 AM Actions
(1-200/1764) Per page: 50, 100, 200, 500

Also available in: Atom CSV PDF