Project

General

Profile

Issues

Filters

Apply Clear

# Project Tracker Status Subject Assignee Updated
16008 Ruby master Bug Open Ripper hshptn node drops information 07/16/2019 07:42 PM Actions
16007 Ruby master Bug Open Process.clock_getres matches the clock in practice for Process::CLOCK_{PROCESS,THREAD}_CPUTIME_ID FAILED fails on armv7hl 07/16/2019 06:47 AM Actions
16005 Ruby master Feature Open A variation of Time.iso8601 that can parse yyyy-MM-dd HH:mm:ss 07/16/2019 02:38 PM Actions
16004 Ruby master Bug Open Kernel#lambda captured with Kernel#method doesn't create lambdas 07/15/2019 12:52 PM Actions
16003 Ruby master Feature Assigned Remove doc/etc.rd.ja? znz (Kazuhiro NISHIYAMA) 07/16/2019 01:02 AM Actions
16002 Ruby master Bug Feedback File.writable?('/tmp/file') returns true even if it's not writable on Linux 4.19+ 07/14/2019 11:59 PM Actions
16001 Ruby master Feature Open Provide an alias to Kernel#caller_locations(1,1) and Kernel#caller(1,1) 07/15/2019 09:52 PM Actions
16000 Ruby master Bug Open How to avoid the need for updating dependencies manually nobu (Nobuyoshi Nakada) 07/14/2019 10:34 PM Actions
15999 Ruby master Feature Open KeyError#inspect does not contain receiver and key 07/14/2019 07:31 AM Actions
15998 Ruby master Feature Feedback Allow String#-@ to deduplicate tainted string, but return an untainted one 07/13/2019 10:28 AM Actions
15997 Ruby master Feature Open Improve performance of fiber creation by using pool allocation strategy. ko1 (Koichi Sasada) 07/17/2019 01:57 AM Actions
15996 Ruby master Misc Open DevelopersMeeting20190820Japan 07/11/2019 12:39 PM Actions
15994 Ruby master Bug Open irb miscalculates nest level when typing do keyword 07/11/2019 06:55 AM Actions
15993 Ruby master Bug Open 'require' doesn't work if there are Cyrillic chars in the path to Ruby dir 07/12/2019 10:15 AM Actions
15991 Ruby master Feature Open Allow questionmarks in variable names 07/09/2019 11:18 PM Actions
15989 Ruby master Bug Open irb-1.1.0.pre.1 crashes on using arrow up, home and delete 07/08/2019 09:16 AM Actions
15988 Ruby master Bug Assigned Time#dst? vs "real" timezones nobu (Nobuyoshi Nakada) 07/06/2019 03:56 AM Actions
15984 Ruby master Bug Feedback deleting from a collection while iterating on it 07/04/2019 07:44 PM Actions
15983 Ruby master Feature Open Can we have a similar syntax (string interpolation) the way V language has? 07/04/2019 07:45 AM Actions
15982 Ruby master Bug Assigned Remove y2racc and racc2y hsbt (Hiroshi SHIBATA) 07/09/2019 05:25 AM Actions
15980 Ruby master Bug Assigned Coverage shows while/until after raise if/unless as uncovered line mame (Yusuke Endoh) 07/03/2019 03:48 AM Actions
15979 Ruby master Bug Open URI.parse does not validate components 07/03/2019 12:27 AM Actions
15977 Ruby master Bug Assigned Unobvious result value from #next_rotate_time and #previous_period_end methods of Logger::Period module sonots (Naotoshi Seo) 07/02/2019 03:03 PM Actions
15976 Ruby master Feature Open Add Array#overlap? for whether the intersection of 2 arrays is non empty? 07/02/2019 09:05 PM Actions
15975 Ruby master Feature Open Add Array#pluck 07/17/2019 02:54 AM Actions
15973 Ruby master Feature Open Make it so Kernel#lambda always return a lambda 07/17/2019 09:20 PM Actions
15964 Ruby master Feature Open Support for RFC2389 in Net::FTP 06/28/2019 10:35 AM Actions
15963 Ruby master Feature Open Add *_start and *_running methods to VM_COLLECT_USAGE_DETAILS API 06/27/2019 09:16 PM Actions
15961 Ruby master Feature Open Always warn for URI.{,un}{escape,encode} akira (akira yamada) 06/27/2019 04:34 PM Actions
15958 Ruby master Feature Assigned Time#inspect with frac matz (Yukihiro Matsumoto) 07/11/2019 05:43 AM Actions
15957 Ruby master Bug Open Splatting nil as **kwargs 06/25/2019 05:07 AM Actions
15956 Ruby master Bug Open `{*nil}` causes confusing error message 06/25/2019 04:55 AM Actions
15955 Ruby master Feature Open UnboundMethod#apply 06/28/2019 10:25 AM Actions
15948 Ruby master Feature Open ENV.update takes multiple hashes as Hash#update 06/21/2019 07:35 AM Actions
15945 Ruby master Feature Open Option to truncate in `String#ljust`, `String#rjust`, and `String#center` 06/20/2019 02:39 PM Actions
15944 Ruby master Bug Open Simultaneous line feeding and scrolling doesn't work well with irb on tmux aycabta (aycabta .) 06/20/2019 04:58 AM Actions
15940 Ruby master Feature Open Coerce symbols internal fstrings in UTF8 rather than ASCII to better share memory with string literals 07/12/2019 03:06 PM Actions
15939 Ruby master Feature Assigned Dump symbols reference to their fstr in ObjectSpace.dump() ko1 (Koichi Sasada) 07/15/2019 12:24 AM Actions
15936 Ruby master Feature Open on_error in lieu of rescue, raise 06/21/2019 07:05 PM Actions
15931 Ruby master Feature Open encoding for CESU-8 naruse (Yui NARUSE) 07/14/2019 05:21 AM Actions
15928 Ruby master Bug Open Constant declaration does not conform to JIS 3017:2013 06/16/2019 02:37 PM Actions
15927 Ruby master Feature Open Allow string keys to be used for String#% and sprintf methods 06/17/2019 07:13 AM Actions
15925 Ruby master Misc Assigned Speed up SortedSet#min, #max, #sum etc.? knu (Akinori MUSHA) 06/18/2019 08:39 AM Actions
15924 Ruby master Bug Open Ripper::Lexer RuntimeError - Ripper FATAL - master/trunk 06/16/2019 01:48 PM Actions
15923 Ruby master Feature Open New independent string without memcpy 07/09/2019 02:22 PM Actions
15922 Ruby master Feature Open Enumerable#partition(pattern) 06/14/2019 03:40 AM Actions
15921 Ruby master Feature Open R-assign (rightward-assignment) operator 06/17/2019 12:56 PM Actions
15919 Ruby master Feature Open Offset parameter for `Integer#times` 06/15/2019 01:00 AM Actions
15918 Ruby master Feature Open Pattern matching for Set 06/12/2019 11:38 PM Actions
15917 Ruby master Feature Open Pattern matching for Struct 06/12/2019 11:38 PM Actions
15915 Ruby master Feature Open `@1` cannot get from meta-programming 06/12/2019 12:13 PM Actions
15914 Ruby master Feature Open mkmf without libruby 06/12/2019 12:43 PM Actions
15912 Ruby master Feature Open Allow some reentrancy during TracePoint events 06/13/2019 11:41 PM Actions
15909 Ruby master Feature Open Improve Thread#exit documentation 06/09/2019 12:05 AM Actions
15908 Ruby master Bug Open Detecting BOM with non-UTF encoding 06/08/2019 12:44 PM Actions
15905 Ruby master Misc Feedback [Documentation] [Request for the wiki at https://bugs.ruby-lang.org/projects/ruby-trunk/wiki] - Consider adding more information to statically compiled ruby variants 06/06/2019 03:07 PM Actions
15904 Ruby master Bug Feedback Ruby crashes when executing Pronto gem with Rubocop 06/07/2019 10:08 AM Actions
15902 Ruby master Feature Open Add a specialized instruction for `.nil?` 06/05/2019 04:55 PM Actions
15901 Ruby master Feature Open Enumerator::Lazy#eager matz (Yukihiro Matsumoto) 06/13/2019 10:03 PM Actions
15899 Ruby master Feature Open String#before and String#after 07/09/2019 06:34 PM Actions
15897 Ruby master Feature Open `it` as a default block parameter matz (Yukihiro Matsumoto) 07/11/2019 01:46 PM Actions
15896 Ruby master Feature Open Symbol#+ 06/03/2019 06:43 PM Actions
15888 Ruby master Bug Feedback Segmentation fault at 0x000070000afc2450 ruby 2.5.1p57 (2018-03-29 revision 63029) [x86_64-darwin18] 05/31/2019 05:29 AM Actions
15885 Ruby master Bug Open Duplicated `:raise` tracepoint event when exception inside `load` call happens 05/29/2019 10:29 AM Actions
15882 Ruby master Bug Open OpenSSL::X509::Name.parse usage rhenium (Kazuki Yamaguchi) 06/04/2019 12:54 AM Actions
15881 Ruby master Feature Open Optimize deconstruct in pattern matching 06/22/2019 07:32 AM Actions
15879 Ruby master Feature Open Proposal: Time#to_i accepts :unit keyword 05/28/2019 05:28 AM Actions
15878 Ruby master Feature Open Make exit faster by not running GC 06/04/2019 05:00 AM Actions
15877 Ruby master Bug Open Incorrect constant lookup result in method on cloned class 05/27/2019 09:01 PM Actions
15876 Ruby master Bug Feedback 1.to_s.encoding != Encoding.default_internal 05/31/2019 08:29 PM Actions
15869 Ruby master Feature Open Add abs to Matrix marcandre (Marc-Andre Lafortune) 05/23/2019 10:45 PM Actions
15868 Ruby master Feature Open Implement `File.absolute_path?` 05/25/2019 12:48 PM Actions
15867 Ruby master Bug Open Enumerable#minmax inconsistent behavior with Time ranges 05/22/2019 09:52 PM Actions
15866 Ruby master Bug Feedback [BUG] Segmentation fault at 0x0000000000000020 06/03/2019 04:18 AM Actions
15865 Ruby master Feature Open `<expr> in <pattern>` expression matz (Yukihiro Matsumoto) 07/11/2019 04:20 AM Actions
15864 Ruby master Feature Open Proposal: Add methods to determine if it is an infinite range 05/22/2019 08:56 AM Actions
15861 Ruby master Feature Open Correctly parse `file:c:/path/to/file` URIs 05/18/2019 10:58 PM Actions
15856 Ruby master Bug Assigned Idempotent performance of Kernel.require with many activated gems is slow hsbt (Hiroshi SHIBATA) 05/21/2019 09:52 PM Actions
15854 Ruby master Feature Open Tracing instance variable assignment 05/21/2019 08:38 AM Actions
15852 Ruby master Bug Open APPLICATION_VERIFIER_LOCKS_LOCK_IN_FREED_HEAP on exiting ruby 05/15/2019 09:52 PM Actions
15851 Ruby master Misc Open stdlib extension gems - building/testing on Windows 05/15/2019 03:06 PM Actions
15850 Ruby master Bug Open Deprecate and remove optparse/ac 05/15/2019 05:19 AM Actions
15849 Ruby master Bug Open Using hash as first positional argument, mixed with named arguments causes unexpected behavior 05/14/2019 06:51 PM Actions
15840 Ruby master Feature Open configuration path search 05/11/2019 01:24 PM Actions
15837 Ruby master Feature Open Module#name_components matz (Yukihiro Matsumoto) 05/08/2019 10:29 AM Actions
15835 Ruby master Bug Feedback Path traversal symlink - WEBrick 05/08/2019 03:04 PM Actions
15834 Ruby master Bug Open Mutating the result of SortedSet.to_a mutates the original set, potentially violating the set's guarantees knu (Akinori MUSHA) 05/07/2019 06:56 PM Actions
15833 Ruby master Feature Open Some refactors for shared-root array 05/15/2019 09:05 PM Actions
15830 Ruby master Bug Assigned SortedSet's lazy setup causes unpredictable behaviour in subclass's initialize knu (Akinori MUSHA) 06/05/2019 02:17 AM Actions
15829 Ruby master Feature Open Object#then_if(condition){} 05/11/2019 12:11 PM Actions
15828 Ruby master Bug Open DOTfiles and DOTfolders aren't allowed in $HOME folder on Haiku 05/06/2019 10:42 PM Actions
15827 Ruby master Bug Open Haiku: SSL tests failing 05/05/2019 05:31 PM Actions
15824 Ruby master Feature Open respond_to pattern for pattern match 05/22/2019 08:57 AM Actions
15822 Ruby master Feature Open Add Hash#except 05/06/2019 06:26 PM Actions
15819 Ruby master Bug Open cannot read document of File::NULL with "ri File::NULL" 05/03/2019 09:04 AM Actions
15817 Ruby master Feature Open Warnings for undef_method and remove_method on initialize() 05/02/2019 09:11 AM Actions
15816 Ruby master Bug Open String#casecmp compares uppercase characters instead of lowercase 05/09/2019 08:01 AM Actions
15815 Ruby master Feature Open Add option to raise NoMethodError for OpenStruct 05/01/2019 05:47 PM Actions
15812 Ruby master Bug Open Run specs from install folder? 04/30/2019 12:43 PM Actions
15811 Ruby master Feature Open Propsing new method for comparing equality of 2 (float) numbers relatively 05/09/2019 10:22 AM Actions
15807 Ruby master Bug Open Range#minmax is slow and never returns for endless ranges 06/18/2019 02:08 PM Actions
15806 Ruby master Misc Open Explicitly initialise encodings on init to remove branches on encoding lookup 04/27/2019 11:41 PM Actions
15805 Ruby master Misc Open Let memory sizes of the various IMEMO object types be reflected correctly 04/27/2019 11:36 PM Actions
15804 Ruby master Feature Open A generic method to resolve the indexing on a sequence 04/28/2019 12:54 PM Actions
15802 Ruby master Misc Open Reduce the minimum string buffer size from 127 to 63 bytes 07/11/2019 09:24 AM Actions
15796 Ruby master Bug Open Ramdon console crashes 04/26/2019 04:47 PM Actions
15795 Ruby master Bug Open Some test fails on Haiku 04/26/2019 01:28 PM Actions
15790 Ruby master Bug Open Strange interaction between autoload and $LOADED_FEATURES 04/24/2019 07:57 PM Actions
15787 Ruby master Bug Feedback LoadError by EPERM on read-only volume 05/05/2019 03:57 PM Actions
15784 Ruby master Bug Open RUBY_DEBUG=gc_stress dumps core 04/23/2019 09:53 AM Actions
15781 Ruby master Feature Open Unify Method List Introspection? 04/21/2019 11:16 PM Actions
15779 Ruby master Bug Open After NoMemoryError, ruby freezes and takes 100% CPU 05/16/2019 05:07 PM Actions
15778 Ruby master Feature Open Expose an API to pry-open the stack frames in Ruby ko1 (Koichi Sasada) 07/14/2019 06:05 AM Actions
15771 Ruby master Feature Open Add `String#split` option to set split_type string when a single space separator 04/18/2019 11:15 PM Actions
15767 Ruby master Bug Open .rvm/rubies/ruby-2.4.4/lib/ruby/2.4.0/timeout.rb:86: [BUG] Segmentation fault at 0x000000010ae58a3a 04/15/2019 08:11 AM Actions
15764 Ruby master Bug Open Whitespace and control characters should not be permitted in tokens matz (Yukihiro Matsumoto) 04/22/2019 07:48 AM Actions
15763 Ruby master Bug Open Segmentation fault in timeout.rb / sleep 06/15/2019 01:53 AM Actions
15754 Ruby master Bug Open MinGW build/compile failure with Ruby 2.5.5, but 2.6.2 & trunk ok 04/08/2019 06:11 PM Actions
15753 Ruby master Bug Open unknown keyword when passing an hash to a method that accepts a default argument and a named argument 04/08/2019 02:35 AM Actions
15752 Ruby master Feature Open A dedicated module for experimental features 04/17/2019 08:27 AM Actions
15749 Ruby master Bug Open Rails Sever Crashing 04/05/2019 11:52 AM Actions
15748 Ruby master Misc Open [Documentation] Suggestion to adjust Object.html#method-i-instance_variable_set 04/04/2019 02:03 PM Actions
15747 Ruby master Feature Feedback `(..1).last(2)` should return array but raise TypeError 04/04/2019 01:02 AM Actions
15744 Ruby master Misc Open Improvement needed to documentation of 'Literals' 06/24/2019 02:27 AM Actions
15743 Ruby master Feature Open RubyVM should be renamed to CRuby 04/08/2019 09:53 AM Actions
15739 Ruby master Misc Open Improvements needed to documentation of Hash#dig, Array#dig and OpenStruct#dig 03/30/2019 06:40 PM Actions
15737 Ruby master Bug Open Queue#pop randomly hangs forever ko1 (Koichi Sasada) 04/02/2019 03:01 AM Actions
15735 Ruby master Bug Open Thread#handle_interrupt does not prevent Thread#kill from interrupting 03/28/2019 10:42 PM Actions
15734 Ruby master Feature Open Parsing of shorthand IPv4 addresses compatible with inet_aton 03/28/2019 05:50 PM Actions
15729 Ruby master Bug Open OpenSSL::SSL::SSLSocket#connect randomly hangs ko1 (Koichi Sasada) 04/02/2019 03:01 AM Actions
15728 Ruby master Bug Feedback error compiling C - file under Ruby 04/22/2019 10:32 AM Actions
15727 Ruby master Bug Feedback [BUG] Segmentation fault at 0x0000000000000000 ruby 2.5.3p105 (2018-10-18 revision 65156) [x86_64-linux] 04/23/2019 09:03 AM Actions
15726 Ruby master Bug Open Error compiling Ruby 03/24/2019 06:02 PM Actions
15724 Ruby master Feature Open Optionally suppress output from IRB for assignment expressions 03/27/2019 08:43 PM Actions
15723 Ruby master Misc Feedback Reconsider numbered parameters matz (Yukihiro Matsumoto) 07/14/2019 11:20 AM Actions
15722 Ruby master Feature Open `Kernel#case?` 03/22/2019 05:11 PM Actions
15721 Ruby master Feature Open optimize comparison of special const 03/22/2019 06:25 AM Actions
15718 Ruby master Bug Open YAML raises error when dumping strings with UTF32 encoding 03/21/2019 11:33 PM Actions
15717 Ruby master Bug Open Backport #15270 to Ruby 2.5.x 04/24/2019 06:00 AM Actions
15712 Ruby master Bug Feedback DateTime#=== should be defined and compare date and time instead of just the date 03/22/2019 05:36 PM Actions
15675 Ruby master Bug Feedback "fatal - exception reentered" error after installing Ruby 2.5.5 04/23/2019 09:14 AM Actions
15674 Ruby master Bug Open Regression: ObjectSpace.allocation_sourceline produces the wrong location for allocations, it shows the end of the method instead of the line where the object was created 03/18/2019 03:49 PM Actions
15669 Ruby master Bug Open This issue was marked as resolved in 2.5.5 release note but I'm still experiencing it 03/15/2019 04:04 PM Actions
15668 Ruby master Feature Open stdlib: Date - Time should return the difference in days 03/15/2019 07:09 AM Actions
15667 Ruby master Feature Open Introduce malloc_trim(0) in full gc cycles 04/01/2019 09:32 AM Actions
15663 Ruby master Feature Open Documenting autoload semantics 04/20/2019 01:44 AM Actions
15661 Ruby master Bug Open Disallow concurrent Dir.chdir with block 03/14/2019 08:42 PM Actions
15657 Ruby master Feature Assigned Make webrick to bundled gems hsbt (Hiroshi SHIBATA) 03/22/2019 10:10 AM Actions
15655 Ruby master Bug Open Unable to handle Russian dirname on Windows 03/11/2019 10:08 AM Actions
15654 Ruby master Misc Open Documentation for Complex is wrong or misleading 03/11/2019 11:55 AM Actions
15646 Ruby master Bug Open method_defined? inside method_added behaves differently for `initialize` 03/10/2019 06:25 AM Actions
15644 Ruby master Bug Open ThreadsWait problems with Thread#report_on_exception 03/13/2019 12:04 PM Actions
15639 Ruby master Bug Open [BUG] Segmentation fault at 0x000000010e82ca3a 03/05/2019 04:51 PM Actions
15638 Ruby master Bug Open Another race conditions in MonitorMixin when interrupted? 03/05/2019 10:46 AM Actions
15634 Ruby master Bug Open TracePoint seems to be skipping some methods. 03/05/2019 07:35 PM Actions
15632 Ruby master Feature Feedback Dynamic method references 03/18/2019 08:24 PM Actions
15631 Ruby master Feature Open Let round_capa for ID table not allocate excess capacity for power of 2 ints >= 4 ko1 (Koichi Sasada) 07/11/2019 07:34 AM Actions
15629 Ruby master Bug Open super_method fails on binded/unbinded/cloned methods 03/01/2019 12:57 AM Actions
15628 Ruby master Feature Open init_inetsock_internal should fallback to IPv4 if IPv6 is unreachable 03/21/2019 04:24 PM Actions
15627 Ruby master Bug Open Appearance of custom singleton classes 03/10/2019 04:40 PM Actions
15625 Ruby master Bug Open Module#name performance has exponential-time worst case by aliased constants 05/22/2019 09:29 AM Actions
15623 Ruby master Bug Open Ruby 2.6.1 Segmentation Fault in on Phusion Passenger server boot in dev 03/19/2019 09:40 AM Actions
15621 Ruby master Bug Open system({}, ...) breaks nonascii ENV["PATH"] on Windows 02/25/2019 08:51 AM Actions
15620 Ruby master Bug Open Block argument usage affects lambda semantic matz (Yukihiro Matsumoto) 07/15/2019 10:02 PM Actions
15613 Ruby master Bug Open Enumerator::Chain#each doesn't relay block signature nobu (Nobuyoshi Nakada) 02/22/2019 04:07 PM Actions
15612 Ruby master Feature Feedback A construct to restrict the scope of local variables 02/20/2019 01:55 AM Actions
15609 Ruby master Feature Open Kernel#sleep returns Float instead of Integer 02/18/2019 07:02 AM Actions
15608 Ruby master Bug Open What should be the correct output for Method#inspect with singleton methods? 02/28/2019 11:49 PM Actions
15606 Ruby master Feature Feedback Precedence of -@ and +@ 02/16/2019 06:02 AM Actions
15605 Ruby master Misc Open json library needs more frequent releases 06/12/2019 11:43 PM Actions
15602 Ruby master Feature Open Eliminate recording full-width hash value for small Hash 03/21/2019 02:42 AM Actions
15601 Ruby master Bug Feedback bug in the Ruby interpreter or extension libraries. 02/13/2019 02:57 AM Actions
15599 Ruby master Bug Open Mixing autoload and require causes deadlock and incomplete definition. 02/12/2019 01:40 PM Actions
15598 Ruby master Bug Open Deadlock on mutual reference of autoloaded constants 03/20/2019 10:58 AM Actions
15592 Ruby master Feature Open mode where "autoload" behaves like an immediate "require" 02/10/2019 03:20 PM Actions
15590 Ruby master Feature Open Add dups to Array to find duplicates 02/08/2019 10:00 AM Actions
15589 Ruby master Bug Open `Numeric#zero?` is much slower than `== 0` k0kubun (Takashi Kokubun) 02/07/2019 01:07 AM Actions
15588 Ruby master Feature Open String#each_chunk and #chunks 06/17/2019 04:16 AM Actions
15587 Ruby master Bug Open Thread tests failing 03/23/2019 10:06 AM Actions
15583 Ruby master Bug Open Regex: ? on quantified group {n} is interpreted as optional, should be lazy 02/16/2019 05:13 AM Actions
15580 Ruby master Feature Open Proposal: method addition to class String called .indices ( String#indices ) 02/06/2019 09:35 AM Actions
15579 Ruby master Bug Assigned make step when building ruby 2.4.5 on AIX 7.1 results in a Segmentation fault : ruby-2.4.5/lib/rdoc/markup/parser.rb:325 cruby-aix 02/02/2019 06:34 AM Actions
15576 Ruby master Bug Open Wrong error message from some class methods of `Dir` 01/31/2019 01:09 PM Actions
15574 Ruby master Feature Open Prohibit to pass a block on super() implicitly matz (Yukihiro Matsumoto) 02/15/2019 11:46 AM Actions
15573 Ruby master Feature Open Permit zero step in Numeric#step and Range#step mrkn (Kenta Murata) 02/08/2019 01:03 AM Actions
15571 Ruby master Feature Open Add methods: iroot, root, and roots 01/30/2019 06:17 PM Actions
15570 Ruby master Bug Open rb_int2big signature change #14036 breaks VIM on 32b arches 01/30/2019 09:21 AM Actions
15569 Ruby master Bug Open TestResolvDNS#test_no_server always fails on usa's mswin environment ko1 (Koichi Sasada) 04/02/2019 03:01 AM Actions
15568 Ruby master Misc Open TracePoint(:raise)#parameters raises RuntimeError 01/27/2019 12:02 AM Actions
15565 Ruby master Feature Open Circular dependency warnings - suggestions/ideas to improve the output from ruby 01/25/2019 11:36 PM Actions
15563 Ruby master Feature Open #dig that throws an exception if an key doesn't exist 06/13/2019 08:08 AM Actions
15562 Ruby master Feature Open `String#split` option to suppress the initial empty substring 01/28/2019 03:32 AM Actions
15560 Ruby master Feature Open Add support for read/write offsets. 01/26/2019 11:03 AM Actions
15559 Ruby master Feature Open Logical XOR (^^) operator 01/25/2019 04:14 AM Actions
15558 Ruby master Bug Open Should Exception#exception copy the backtrace? Eregon (Benoit Daloze) 06/05/2019 08:19 PM Actions
15557 Ruby master Feature Open A new class that stores a condition and the previous receiver 01/27/2019 05:22 AM Actions
15554 Ruby master Feature Open warn/error passing a block to a method which never use a block matz (Yukihiro Matsumoto) 05/28/2019 08:39 PM Actions
15553 Ruby master Feature Open Addrinfo.getaddrinfo supports timeout 04/03/2019 10:40 AM Actions
15551 Ruby master Bug Open The behavior of FIX2INT and FIX2UINT differs by platform 01/20/2019 09:21 PM Actions
15550 Ruby master Bug Assigned Windows - gem bin files - can't run from bash shell hsbt (Hiroshi SHIBATA) 03/20/2019 01:05 AM Actions
15549 Ruby master Feature Open Enumerable#to_reader (or anything enumerable, Enumerator, lazy enums, enum_for results) 01/24/2019 12:21 PM Actions
15547 Ruby master Feature Open deprecate iterator? 01/19/2019 10:38 AM Actions
15541 Ruby master Feature Open Add alias symbolize_keys for symbolize_names kwarg for JSON.parse 01/23/2019 05:10 PM Actions
15527 Ruby master Feature Open Redesign of timezone object requirements 02/02/2019 11:15 AM Actions
15526 Ruby master Feature Open New way to destruct an object hash 01/14/2019 03:45 PM Actions
15523 Ruby master Feature Open Let `Range#begin` and `Range#end` be aliases of Range#first and Range#last 01/15/2019 03:53 AM Actions
15517 Ruby master Bug Open Net::HTTP not recognizing valid UTF-8 01/20/2019 01:15 AM Actions
15514 Ruby master Misc Open Add documentation for implicit array decomposition 01/10/2019 04:43 PM Actions
15510 Ruby master Misc Open Easter egg in Thread.handle_interrupt 01/05/2019 11:53 PM Actions
15509 Ruby master Bug Open TCPServer#accept isn't interrupted 01/05/2019 06:09 PM Actions
15507 Ruby master Bug Open Thread#raise is delivered to GC context 01/05/2019 06:13 PM Actions
15504 Ruby master Feature Open Freeze all Range object matz (Yukihiro Matsumoto) 06/23/2019 04:47 AM Actions
15496 Ruby master Feature Open Extract between string as standard String api 01/09/2019 08:25 AM Actions
15493 Ruby master Bug Feedback Seg Fault on 'vagrant up' Fedora29 intel 01/11/2019 08:46 AM Actions
15492 Ruby master Feature Open Let #dig take a "default value" block like Hash#fetch does 01/01/2019 11:17 PM Actions
15490 Ruby master Bug Open socket.rb - recurring segmentation faults 06/11/2019 02:55 PM Actions
15487 Ruby master Misc Assigned Clarify default gems maintanance policy hsbt (Hiroshi SHIBATA) 12/30/2018 08:42 PM Actions
15486 Ruby master Misc Feedback Default gems README.md hsbt (Hiroshi SHIBATA) 03/11/2019 12:19 PM Actions
15477 Ruby master Feature Open Proc#arity returns -1 for composed lambda Procs of known arguments 03/15/2019 12:39 PM Actions
15465 Ruby master Bug Feedback Tests failed on i386-cygwin 01/09/2019 07:55 AM Actions
15463 Ruby master Feature Open oneshot coverage does not allow counting code lines without coverage 12/25/2018 12:52 PM Actions
15458 CommonRuby Feature Open Automatic Exception#cause print in IRB 12/24/2018 07:07 AM Actions
15456 Ruby master Feature Open Adopt some kind of consistent versioning mechanism 02/07/2019 06:26 PM Actions
15449 Ruby master Bug Open Range#=== is not using cover in Ruby 2.6 12/21/2018 01:58 PM Actions
15446 Ruby master Feature Open Add a method `String#each_match` to the Ruby core 02/06/2019 08:00 AM Actions
15445 Ruby master Feature Open Reject '.123' in Float() method matz (Yukihiro Matsumoto) 01/10/2019 07:59 AM Actions
15438 Ruby master Bug Open Threads can't switch faster than TIME_QUANTUM_(NSEC|USEC|MSEC) 03/25/2019 08:53 PM Actions
15435 Ruby master Feature Open Float の Infinity に生成済みの値を使用する 12/20/2018 02:27 PM Actions
15433 Ruby master Bug Open OpenStruct NameError vs NoMethodError spec fails for method_missing 12/18/2018 06:25 PM Actions
15431 Ruby master Misc Open Hashes and arrays should not require commas to seperate values when using new lines 12/18/2018 11:05 AM Actions
15428 Ruby master Bug Open Refactor Proc#>> and #<< 01/20/2019 08:04 PM Actions
15425 Ruby master Bug Open Store MJIT header into Ruby versioned directory. 01/03/2019 03:38 PM Actions
15423 Ruby master Bug Open fork leapfrog leaks memory on FreeBSD 11.2 12/16/2018 02:28 PM Actions
15422 Ruby master Bug Open Re: [ruby-cvs:73514] normal:r66413 (trunk): thread_pthread.c: fix memory leak from fork loop leapfrog (v3) 12/16/2018 02:13 PM Actions
15419 CommonRuby Feature Open Allow Kernel#tap to be invoked with arguments like Kernel#send 12/16/2018 08:02 PM Actions
15418 Ruby master Misc Open Date.parse('2018') 12/15/2018 09:17 PM Actions
15417 Ruby master Bug Open Pathname case insensitive comparison 12/15/2018 04:35 AM Actions
15413 Ruby master Feature Open unmarkable C stack (3rd stack) 12/15/2018 01:13 AM Actions
15409 Ruby master Bug Assigned OpenStruct error when attribute is called 'method' marcandre (Marc-Andre Lafortune) 05/09/2019 03:15 PM Actions
15408 Ruby master Feature Open Deprecate object_id and _id2ref headius (Charles Nutter) 03/19/2019 04:02 PM Actions
15404 Ruby master Bug Open Endless range has inconsistent chaining behaviour 01/30/2019 09:54 PM Actions
15402 Ruby master Misc Open Shrinking excess retained memory of container types on promotion to uncollectible 12/11/2018 08:43 PM Actions
15397 Ruby master Bug Open Ruby process doesn't release memory back to os on CentOS 12/11/2018 03:31 AM Actions
15393 Ruby master Feature Open Add compilation flags to freeze Array and Hash literals 01/15/2019 12:15 AM Actions
15392 Ruby master Bug Open Crash in RubyVM::InstructionSequence#to_binary 12/14/2018 01:50 PM Actions
15386 Ruby master Bug Open [PATCH] io.c (rb_io_check_char_readable): do not io_fflush buffered sockets 12/06/2018 11:38 AM Actions
15381 Ruby master Feature Open Let double splat call `to_hash` implicitly 12/05/2018 12:58 PM Actions
15380 Ruby master Feature Open faster method lookup for Array#all? #none? #one? 12/05/2018 10:11 PM Actions
15375 Ruby master Bug Open Crash report for Ruby 2.5.3p105 02/14/2019 12:39 AM Actions
15372 Ruby master Bug Open openssl 1.1.1a on Debian sid test failures rhenium (Kazuki Yamaguchi) 12/03/2018 11:48 AM Actions
15371 Ruby master Bug Open IRB with ARGV 03/22/2019 02:19 PM Actions
15368 Ruby master Bug Feedback Crash Report log information 01/17/2019 11:15 AM Actions
15367 Ruby master Bug Open IO.select is not resumed when io-object gets closed 12/03/2018 10:22 AM Actions
15363 Ruby master Feature Open Case insensitive file systems - add info to CONFIG or somewhere? 12/03/2018 04:30 AM Actions
15359 Ruby master Bug Assigned Bundler help is not properly integrated hsbt (Hiroshi SHIBATA) 12/01/2018 01:01 AM Actions
15357 Ruby master Bug Open Proc#parameters returns incomplete type information 11/30/2018 05:34 AM Actions
15355 Ruby master Bug Open Random segmentation faults in development environment 11/28/2018 06:10 PM Actions
15353 Ruby master Feature Open Support client certificates with TLS 1.3 and OpenSSL 1.1.1 01/16/2019 04:32 PM Actions
15352 Ruby master Feature Open Mandatory block parameters 11/28/2018 12:19 PM Actions
15350 Ruby master Feature Open [PATCH] thread_sync.c (queue_sleep): remove deadlock checking 12/05/2018 08:42 AM Actions
15344 CommonRuby Feature Feedback Being proactive about Ruby security 12/16/2018 09:52 PM Actions
15338 Ruby master Feature Open Provide way for C extensions to query if global variable is defined 11/25/2018 09:32 AM Actions
15334 Ruby master Bug Open child_info_fork::abort: address space needed by 'emoji_iso2022_kddi.so' on cygwin nobu (Nobuyoshi Nakada) 12/10/2018 07:14 AM Actions
15330 Ruby master Feature Open autoload_relative matz (Yukihiro Matsumoto) 02/07/2019 06:01 PM Actions
15315 Ruby master Bug Open ec_switch can still lose interrupts ko1 (Koichi Sasada) 11/20/2018 09:32 AM Actions
15313 Ruby master Bug Open [PATCH] Let debuggers know when a tail call happens ko1 (Koichi Sasada) 12/05/2018 07:05 AM Actions
15310 Ruby master Bug Open [PATCH] thread_pthread.c: close race from UBF_TIMER and non-GVL-releasing thread 11/20/2018 12:50 AM Actions
15309 Ruby master Bug Assigned ECB is broken rhenium (Kazuki Yamaguchi) 03/20/2019 05:19 AM Actions
15306 Ruby master Bug Open Generate prelude.c using miniruby 11/16/2018 09:07 AM Actions
15305 Ruby master Misc Open [PATCH] include/ruby/ruby.h (RB_ALLOCV*): remove GC guard nobu (Nobuyoshi Nakada) 11/15/2018 11:04 PM Actions
15302 Ruby master Feature Open Proc#with and Proc#by, for partial function application and currying 11/23/2018 10:16 AM Actions
15298 Ruby master Misc Open Inconsistent date errors 11/12/2018 10:46 PM Actions
15290 Ruby master Bug Open load_from_binary Bus error on Solaris sparc nagachika (Tomoyuki Chikanaga) 11/08/2018 12:37 PM Actions
15281 Ruby master Feature Assigned Speed up Set#intersect with size check. knu (Akinori MUSHA) 05/21/2019 01:09 PM Actions
15277 Ruby master Feature Open at_exec matz (Yukihiro Matsumoto) 11/04/2018 03:25 PM Actions
15276 Ruby master Bug Open URI.join behaviour is unintuitive 11/02/2018 03:25 AM Actions
15273 Ruby master Bug Open Ruby crashing after updating Mac OS to Mojave (10.14) 11/01/2018 09:38 AM Actions
15268 Ruby master Bug Open Solarisでtest/drb/test_drbssl.rbが落ちる openssl 11/06/2018 03:48 PM Actions
15267 Ruby master Bug Open File.basename + File.extname does not restore the original name 10/29/2018 06:25 AM Actions
15265 Ruby master Misc Open Documentation for `Object#instance_variable_set` is inaccurate and pejorative 10/29/2018 06:40 AM Actions
15263 Ruby master Bug Open [PATCH] vm_trace.c (postponed_job_register): only hit main thread ko1 (Koichi Sasada) 10/27/2018 11:35 PM Actions
15262 Ruby master Bug Feedback WeakRef::RefError for object that is still in use 10/31/2018 10:07 AM Actions
15261 Ruby master Feature Open Expose rl_variable_value as Readline.variable_value 10/29/2018 12:08 PM Actions
15255 Ruby master Bug Open Change in protected handling 2.3 -> 2.4,2.5 10/25/2018 10:43 PM Actions
15253 Ruby master Bug Feedback Arduinoとの接続においてSocket.tcp_server_loop中で$stderr.puts、pなどが使用できない 10/28/2018 11:48 AM Actions
15252 Ruby master Bug Open hitting what seems like a gc segfault at random 10/24/2018 07:12 PM Actions
15249 Ruby master Misc Open Documentation for attr_accessor and attr_reader should be corrected 10/23/2018 08:09 PM Actions
15247 Ruby master Bug Open Windows - TEMP folder, non 8.3 & drive, fails & errors in test-all (ruby & rdoc) 10/23/2018 05:02 PM Actions
15244 Ruby master Bug Open Method #extname return empty string if filename is dot ('.') 02/16/2019 08:01 AM Actions
15241 Ruby master Bug Open net/pop fix to use mutable strings was too eager 10/30/2018 10:17 AM Actions
15240 Ruby master Bug Open Set operations check for is_a?(Set), rather than allowing duck typing knu (Akinori MUSHA) 05/05/2019 07:27 PM Actions
15239 Ruby master Misc Open [patch] test-spec win32ole suke (Masaki Suketa) 10/28/2018 07:19 AM Actions
15236 Ruby master Feature Open add support for hash shorthand 06/09/2019 04:22 AM Actions
15235 Ruby master Bug Open [patch] appveyor.yml - remove MinGW dll's from mswin testing PATH 10/19/2018 02:41 AM Actions
15233 Ruby master Bug Assigned Speeding Up Matrix Powers marcandre (Marc-Andre Lafortune) 10/23/2018 10:44 PM Actions
15227 Ruby master Bug Open Wrong version of ruby is used during tests 10/16/2018 02:46 PM Actions
15226 Ruby master Bug Open Resolv::DNS unable to handle responses larger than default size 10/16/2018 01:35 PM Actions
15225 Ruby master Feature Open OpenStruct: Recursively converting child Hash objects to OpenStruct objects. 10/16/2018 05:18 AM Actions
15224 Ruby master Misc Open [DOCs] Minor inconsistency in class Array #initialize_copy - https://ruby-doc.org/core-2.5.1/Array.html#method-i-initialize_copy 10/13/2018 02:26 PM Actions
15222 Ruby master Feature Open Add a way to distinguish between Struct classes with and without keyword initializer 10/11/2018 01:16 PM Actions
15217 Ruby master Feature Open Add Resolv.current_resolver 10/08/2018 11:18 PM Actions
15215 Ruby master Feature Open HTTPS server name indication (SNI): explicit server_name in Net::HTTP 12/16/2018 06:53 PM Actions
15211 Ruby master Bug Open Integer.try_convert 10/07/2018 09:23 AM Actions
15209 Ruby master Bug Open r64925 order-only-prerequisites - make targets - breaking change 10/06/2018 03:51 PM Actions
15204 Ruby master Bug Open globbing should be prevented when wildcard is surrounded by double quotes in the ruby's command line 10/05/2018 08:29 AM Actions
15202 Ruby master Misc Open Adding Coverity Scan to CI to see the result casually 10/25/2018 10:50 AM Actions
15198 Ruby master Feature Open Array#intersect? 10/08/2018 05:10 PM Actions
15192 Ruby master Feature Open Introduce a new "shortcut assigning" syntax to convenient setup instance variables matz (Yukihiro Matsumoto) 01/07/2019 05:04 PM Actions
15188 Ruby master Bug Open Incorrect warning "assigned but unused variable" when using ripper with $VERBOSE = true 10/10/2018 11:04 AM Actions
15187 Ruby master Bug Open IPv6 x-forwarded-host results in "bad URI" error 10/01/2018 01:45 PM Actions
15179 Ruby master Bug Feedback Segfault caused by only 'loop{ x<<[] }' 10/01/2018 01:33 PM Actions
15178 Ruby master Bug Open Wrong paramaters passing to pthread_setname_np(3) 09/29/2018 03:43 PM Actions
15177 Ruby master Bug Open 起動した後にTZを変更するとTime#utcがずれることがある 10/09/2018 01:04 PM Actions
15173 Ruby master Bug Open Segmentation fault 09/28/2018 12:50 PM Actions
15172 Ruby master Feature Open Performance: create method(s) to mimic __builtin_ctz compiler directive functionality 12/28/2018 05:11 PM Actions
15171 Ruby master Feature Open [patch] Use OpenSSL 1.1.1 for Appveyor MinGW build 12/03/2018 02:18 PM Actions
15170 Ruby master Bug Assigned Allow WEBrick::HTTPServlet::initialize to accept an array in server[:CGIInterpreter] normalperson (Eric Wong) 01/04/2019 03:58 AM Actions
15166 Ruby master Feature Assigned 2.5 times faster implementation than current gcd implmentation watson1978 (Shizuo Fujita) 04/26/2019 09:12 PM Actions
15151 Ruby master Feature Open String#slice!(0,..) creates a duplicate of original string 06/20/2019 03:37 PM Actions
15149 Ruby master Feature Open extend string format to nil safe 09/25/2018 03:22 AM Actions
15145 Ruby master Feature Open chained mappings proposal 09/22/2018 12:06 AM Actions
15140 Ruby master Bug Feedback Bug in Interpreter or Extension Libraries 09/19/2018 10:26 AM Actions
15138 Ruby master Bug Open non-symbol keyword in double splat, such as **{2 => 3}, raises TypeError or not 09/18/2018 05:12 PM Actions
15136 Ruby master Misc Open Fix -Wparentheses warnings 09/20/2018 09:41 AM Actions
15123 Ruby master Feature Open Enumerable#compact proposal matz (Yukihiro Matsumoto) 05/20/2019 07:23 AM Actions
15112 Ruby master Feature Open Introducing the short form of `STDERR.puts expr.inspect`. matz (Yukihiro Matsumoto) 10/12/2018 02:02 AM Actions
15097 Ruby master Bug Open Gem install fails on Ruby 2.5.1 with Cygwin (get_dns_server_list undefined) 09/10/2018 07:18 PM Actions
15093 Ruby master Feature Open Retrive Array elements with infinite ranges specified by Float::INFINITY 09/09/2018 02:01 PM Actions
15082 Ruby master Bug Feedback Memory leak in net/http/response and net/http/header 06/17/2019 11:13 PM Actions
15078 Ruby master Bug Open Hash splat of empty hash should not create a positional argument. matz (Yukihiro Matsumoto) 09/19/2018 01:59 AM Actions
15074 Ruby master Feature Open Create 'official' C API documentation on ruby-doc.org 09/12/2018 09:12 PM Actions
15072 Ruby master Bug Open thread.c:4356:5: error: implicit declaration of function ‘ubf_list_atfork’ normalperson (Eric Wong) 09/20/2018 03:32 AM Actions
15070 Ruby master Bug Feedback configure fails with (probably spurious) 'something wrong with CFLAGS="-g -O2 "' on macOS High Sierra 09/05/2018 05:17 PM Actions
15067 Ruby master Bug Open library/socket/socket/getnameinfo_spec.rb always errors with multiple IP addresses hostname 09/04/2018 06:47 AM Actions
15052 Ruby master Bug Open must not optimize `foo(**{})` out 08/31/2018 12:09 PM Actions
15049 Ruby master Feature Feedback [Request] Easily access all keyword arguments within a method 10/15/2018 05:36 PM Actions
15047 Ruby master Feature Assigned Documentation and more functions for Hash functions in C API docs 03/20/2019 01:24 AM Actions
15045 Ruby master Bug Open Test suite fails/hangs with stronger cryptography enforcement 08/29/2018 04:16 PM Actions
15044 Ruby master Bug Open ENV encoding not UTF-8 by default 08/29/2018 06:40 PM Actions
15038 Ruby master Bug Open Appveyor MinGW - bundled gems missing? 08/28/2018 04:17 PM Actions
15036 CommonRuby Feature Open after upgrade when run apt upgrade metasploit 08/28/2018 08:19 AM Actions
15034 Ruby master Bug Feedback Crash in Opensuse Software management 08/28/2018 12:12 AM Actions
15033 Ruby master Bug Open Encoding fallback uses wrong character when multiple conversions are required 08/27/2018 09:19 PM Actions
15031 Ruby master Feature Open T_RANGE for testing whether object is a Range 08/27/2018 11:45 AM Actions
15027 Ruby master Bug Feedback When Struct#each method is overriden Struct#select and Struct#to_a use wrong collections 09/26/2018 10:24 AM Actions
15024 Ruby master Feature Open Support block in Array#join 08/25/2018 05:05 AM Actions
15017 Ruby master Feature Open Provide extended information about Signal 08/22/2018 05:42 AM Actions
15012 Ruby master Misc Open Testing on latest version gcc on Travis CI 09/16/2018 12:04 PM Actions
15007 Ruby master Misc Open Let all Init_xxx and extension APIs frequently called from init code paths be considered cold naruse (Yui NARUSE) 12/06/2018 11:05 AM Actions
15006 Ruby master Feature Open [PATCH] io.c: use copy_file_range with every types of files 08/21/2018 07:52 PM Actions
15001 Ruby master Bug Open Peek causes cursor to advance when enumerating the lines of a file 08/22/2018 10:13 AM Actions
14997 Ruby master Bug Open Socket connect timeout exceeds the timeout value for 07/02/2019 10:58 AM Actions
14982 Ruby master Feature Open Improve namespace system in ruby to avoiding top-level names chaos matz (Yukihiro Matsumoto) 06/28/2019 02:03 PM Actions
14976 Ruby master Bug Feedback /usr/local/lib/ruby/gems/2.6.0/gems/fluentd-1.2.4/lib/fluent/event.rb:193: [BUG] Segmentation fault at 0x0000000000000000 ruby 2.6.0preview1 (2018-02-24 trunk 62554) [x86_64-linux] 08/14/2018 11:23 AM Actions
14975 Ruby master Feature Open String#append without changing receiver's encoding ioquatix (Samuel Williams) 01/26/2019 11:02 AM Actions
14973 Ruby master Feature Open Proposal of percent literal to expand Hash 01/30/2019 07:13 PM Actions
14972 Ruby master Bug Open Net::HTTP inconsistently raises EOFError when peer closes the connection 02/12/2019 05:03 AM Actions
14971 Ruby master Bug Open error: implicit declaration of function ‘rb_vm_call0 nobu (Nobuyoshi Nakada) 09/06/2018 03:53 AM Actions
14967 Ruby master Feature Open Any type 08/07/2018 05:08 PM Actions
14963 Ruby master Bug Open Since r64107, on Solaris, spec test of rb_io_wait_readable hangs up 08/03/2018 02:49 PM Actions
14961 Ruby master Bug Feedback Segfault when running RSpec / Capybara / Rails 08/03/2018 08:42 AM Actions
14957 Ruby master Bug Open MinGW, gcc 8.2.0, bootstraptest test_thread.rb - failure ? 08/03/2018 02:46 PM Actions
14955 Ruby master Feature Open [PATCH] gc.c: use MADV_FREE to release most of the heap page body 08/14/2018 03:04 AM Actions
14951 Ruby master Feature Open New operator to evaluate truthy/falsy/logical equivalence 08/02/2018 07:16 AM Actions
14943 Ruby master Bug Open ruby 2.4 doesn't work with jemalloc 5.1.0 properly. 07/27/2018 10:22 AM Actions
14938 Ruby master Feature Open Provide API to get same result as ruby -wc 08/06/2018 06:27 PM Actions
14932 Ruby master Feature Open Dynamically adjust method cache size at runtime 07/22/2018 10:45 PM Actions
14931 Ruby master Feature Open [DOC] exception keyword argument is not documented in some methods 07/22/2018 08:53 AM Actions
14927 Ruby master Feature Open Loading multiple files at once matz (Yukihiro Matsumoto) 09/18/2018 12:38 AM Actions
14925 Ruby master Feature Open Kernel#assert(expression) 07/20/2018 02:39 PM Actions
14922 Ruby master Bug Assigned Resolv getaddresses ignores AAAA records for IPv6 akr (Akira Tanaka) 07/25/2018 07:44 AM Actions
14919 Ruby master Feature Open Add String#byteinsert 07/18/2018 01:29 PM Actions
14917 Ruby master Misc Assigned Add RDoc documents to tar ball aycabta (aycabta .) 07/21/2018 09:29 AM Actions
14916 Ruby master Feature Open Proposal to add Array#=== 08/09/2018 04:06 AM Actions
14914 Ruby master Feature Open Add BasicObject#instance_exec_with_block 08/09/2018 02:30 PM Actions
14912 Ruby master Feature Assigned Introduce pattern matching syntax ktsj (Kazuki Tsujimoto) 06/27/2019 12:20 AM Actions
14910 Ruby master Bug Feedback /usr/local/Cellar/ruby/2.5.1/lib/ruby/2.5.0/x86_64-darwin17/openssl.bundle: [BUG] Segmentation fault at 0x0000000000000001 07/13/2018 01:15 AM Actions
14909 Ruby master Bug Feedback Method call with object that has to_hash method crashes (method with splat and keyword arguments) 07/13/2018 03:18 PM Actions
14906 Ruby master Bug Open MinGW failure - TestIO#test_copy_stream_no_busy_wait 07/12/2018 03:52 AM Actions
14904 Ruby master Feature Open Make it possible to run instance_eval with zero-arguments lambda 07/11/2018 05:03 AM Actions
14901 Ruby master Misc Assigned [PATCH] do not block SIGCHLD in normal Ruby Threads normalperson (Eric Wong) 07/08/2018 07:22 PM Actions
14900 Ruby master Bug Open Extra allocation in String#byteslice 07/08/2018 11:35 AM Actions
14896 Ruby master Feature Open Expose Net::HTTPResponse socket for integration with libraries expecting an IO 07/04/2018 10:05 PM Actions
14895 Ruby master Bug Open Inconsistent constant names when using const_set on a singleton class 07/05/2018 09:10 PM Actions
14891 Ruby master Bug Open Pathname#join has different behaviour to File.join 07/13/2018 04:58 AM Actions
14889 Ruby master Bug Open TracePoint for :line never seems to trigger on argument list. Maybe by design? 07/01/2018 03:59 PM Actions
14884 Ruby master Bug Feedback msys2 mingw32 'rake' has unexpected text at top of file 07/04/2018 11:20 PM Actions
14879 Ruby master Bug Open Time#+ and Time#- do not preserve receiver's utc_offset if ENV['TZ'] is modified after receiver is created 06/19/2019 07:55 PM Actions
14874 Ruby master Bug Open Segmentation fault under Cygwin 06/27/2018 02:33 PM Actions
14870 Ruby master Bug Open Both TracePoint's :call and :c_call filters seem to skip a lot of builtin methods nobu (Nobuyoshi Nakada) 06/26/2018 02:26 PM Actions
14869 Ruby master Feature Open Proposal to add Hash#=== 08/09/2018 04:03 AM Actions
14859 Ruby master Feature Open [PATCH] implement Timeout in VM ko1 (Koichi Sasada) 07/22/2018 07:42 AM Actions
14855 Ruby master Feature Open Binding#irb の中では、呼び出し元の __FILE__ と __dir__ をとりたい 06/19/2018 01:09 PM Actions
14851 Ruby master Misc Open [PATCH] thread_pthread.c: remove non-sleepy timer thread implementation 07/06/2018 09:22 PM Actions
14849 Ruby master Bug Feedback rbenv install 2.4.0 on AWS EC2 on AMI linux box 06/18/2018 12:21 AM Actions
14844 Ruby master Feature Open Future of RubyVM::AST? yui-knk (Kaneko Yuichiro) 05/22/2019 10:15 AM Actions
14843 Ruby master Bug Assigned [BUG] Illegal instruction at 0x000000010c7acc0a tenderlovemaking (Aaron Patterson) 06/16/2018 09:35 PM Actions
14838 Ruby master Bug Open RegexpError with double "s" in look-behind assertion in case-insensitive unicode regexp 06/09/2018 04:04 PM Actions
14835 Ruby master Bug Open Impossible to know whether an exception was rescued or not using TracePoint 06/08/2018 08:58 AM Actions
14833 Ruby master Feature Open Add RubyVM::AST::Node#pretty_print 06/07/2018 02:56 PM Actions
14826 Ruby master Bug Open make: *** [.ext/include/sparc-solaris2.10/rb_mjit_min_header-2.6.0.h] Error 1 on Solaris 10 with very old gcc3 06/05/2018 02:02 PM Actions
14825 Ruby master Misc Open When redefining `attr_xx` methods the visibility becomes `public` 06/05/2018 05:57 AM Actions
14824 Ruby master Bug Open Endless Range Support in irb 06/05/2018 10:45 AM Actions
14823 Ruby master Bug Feedback Endless Range Excluding End 06/05/2018 02:31 PM Actions
14819 Ruby master Feature Open Efficient cstring to RVALUE typecasting for c extension gems 06/06/2018 09:13 PM Actions
14817 Ruby master Bug Assigned TracePoint#parameters for bmethod's return event should return the same value as its Method#parameters ko1 (Koichi Sasada) 07/15/2019 02:51 AM Actions
14813 Ruby master Feature Open [PATCH] gc.c: make gc_enter+gc_exit pairs dtrace probes, too ko1 (Koichi Sasada) 12/17/2018 07:42 AM Actions
14811 Ruby master Feature Open Dynamically extend Ruby VM stack 06/05/2018 07:59 AM Actions
14810 Ruby master Bug Feedback Segfault during travis build (Ruby trunk 63545) 06/17/2019 11:31 PM Actions
14804 Ruby master Bug Open GzipReader cannot read Freebase dump (but gzcat/zless can) 06/01/2018 10:45 PM Actions
14801 Ruby master Feature Open New method 'show_stack' to show Ruby stack(s) when program is running 06/01/2018 09:45 AM Actions
14800 Ruby master Bug Open Zlib::GzipReader#read does not support 2nd argument 05/31/2018 02:32 PM Actions
14794 Ruby master Feature Open Primitive arrays (Ruby 3x3) 05/30/2018 01:58 PM Actions
14792 Ruby master Feature Feedback Multiple RubyVM in one process to make real multi-threading. 05/29/2018 03:12 PM Actions
14788 Ruby master Feature Open `Hash#keys` Could Accept a Block 05/28/2018 04:04 PM Actions
14785 Ruby master Feature Open Parse guard statements like regular conditionals 05/25/2018 05:46 AM Actions
14784 Ruby master Feature Open Comparable#clamp with a range 04/30/2019 04:38 PM Actions
14783 Ruby master Feature Open String#chars_at / String#bytes_at 05/24/2018 01:18 PM Actions
14781 Ruby master Feature Feedback Enumerator.generate 03/22/2019 07:25 AM Actions
14778 Ruby master Feature Feedback Make Object#dup accept a block 05/27/2018 07:52 AM Actions
14777 Ruby master Feature Open Add Range#offset ? 05/19/2018 03:50 PM Actions
14771 Ruby master Feature Open Add method to create DNS resource from data string 05/17/2018 10:43 PM Actions
14770 Ruby master Misc Open [META] DevelopersMeeting 05/17/2018 12:28 PM Actions
14768 Ruby master Misc Open Add documentation for || and && 05/17/2018 09:45 AM Actions
14766 Ruby master Feature Open Indicate `find_all` and `select` methods are aliases. 05/16/2018 11:36 PM Actions
14761 Ruby master Bug Open TestThread#test_join_limits hangs up on Solaris 10 with gcc 05/16/2018 05:23 AM Actions
14760 Ruby master Misc Open cross-thread IO#close semantics matz (Yukihiro Matsumoto) 05/17/2018 08:21 AM Actions
14759 Ruby master Feature Open [PATCH] set M_ARENA_MAX for glibc malloc 03/15/2019 06:54 AM Actions
14758 Ruby master Feature Open Add a first-class support for isolated bounded packages / modules / contexts 05/18/2018 09:13 AM Actions
14755 Ruby master Bug Open Aborted (core dumped) 05/12/2018 06:20 PM Actions
14752 Ruby master Bug Open abort during build full build log 05/12/2018 12:17 AM Actions
14745 Ruby master Bug Open High memory usage when using String#replace with IO.copy_stream 05/18/2018 06:52 PM Actions
14744 Ruby master Bug Open Refinements modules have a superclass matz (Yukihiro Matsumoto) 05/09/2018 09:09 AM Actions
14743 Ruby master Bug Open Some links broken in README 05/09/2018 05:41 AM Actions
14740 Ruby master Bug Open You may have encountered a bug in the Ruby interpreter or extension libraries. Bug reports are welcome. 05/07/2018 08:47 AM Actions
14737 Ruby master Bug Assigned Split default gems into separate directory structure hsbt (Hiroshi SHIBATA) 05/05/2018 11:15 AM Actions
14736 Ruby master Feature Open Thread selector for flexible cooperative fiber based concurrency 05/01/2019 11:03 PM Actions
14735 Ruby master Misc Open thread-safe operations in a hash could be documented 05/04/2018 01:09 PM Actions
14732 Ruby master Bug Open CGI.unescape returns different instance between Ruby 2.3 and 2.4 05/03/2018 01:33 AM Actions
14727 Ruby master Bug Assigned TestQueue#test_queue_with_trap always timeout on Windows10 ko1 (Koichi Sasada) 05/01/2018 02:59 AM Actions
14726 Ruby master Bug Open wrong message when superclass is not a Class 05/07/2018 06:39 AM Actions
14724 Ruby master Feature Open chains of inequalities matz (Yukihiro Matsumoto) 05/19/2018 01:06 AM Actions
14723 Ruby master Feature Open [WIP] sleepy GC 05/18/2018 09:13 AM Actions
14722 Ruby master Feature Open python's buffer protocol clone 09/21/2018 04:14 AM Actions
14718 Ruby master Feature Open Use jemalloc by default? 03/15/2019 06:50 AM Actions
14716 Ruby master Bug Open SecureRandom throwing an error in Ruby 2.5.1 03/03/2019 10:33 AM Actions
14715 Ruby master Bug Open Pathname#== should compare by #realpath instead of #to_s 04/26/2018 12:37 PM Actions
14714 Ruby master Bug Open Ruby 2.5.1 Segmentation Fault in GC 12/31/2018 07:24 PM Actions
14710 Ruby master Feature Open I'd like to know from C API that "It has only one reference to Ruby object" to determine whether it is a temporary object. 04/24/2018 11:28 PM Actions
14706 Ruby master Feature Open Atomic Integer incr/decr 04/24/2018 09:53 AM Actions
14704 Ruby master Bug Open Module#ancestors looks wrong when a module is both included and prepended in the same class. 04/20/2018 03:23 PM Actions
14701 Ruby master Feature Open If the object is not frozen, I want to be able to redefine the compound assignment operator. 04/16/2019 11:19 PM Actions
14695 Ruby master Bug Open [2.5.1] `===` is 1.77x slower than `match?` 04/18/2018 07:57 AM Actions
14692 Ruby master Misc Open Question: Ruby stdlib's Option Parser nobu (Nobuyoshi Nakada) 04/22/2018 05:53 AM Actions
14685 Ruby master Feature Open IRB doesn't print exception cause 04/13/2018 03:20 PM Actions
14682 Ruby master Bug Open Error [BUG] unexpected THREAD_KILLED 04/12/2018 07:09 AM Actions
14681 Ruby master Bug Open `syswrite': stream closed in another thread (IOError) 04/22/2018 12:12 AM Actions
14679 Ruby master Bug Assigned StdLib gems should properly specify their dependencies hsbt (Hiroshi SHIBATA) 04/11/2018 01:14 PM Actions
14678 Ruby master Bug Feedback Segmentation fault in pg 10/28/2018 02:50 PM Actions
14673 Ruby master Misc Open Documentation for `Array#drop` / `drop_while` unclear in regard to modification 04/10/2018 09:51 AM Actions
14672 Ruby master Feature Open Introduce a Date.safe_parse method 04/18/2018 10:11 AM Actions
14671 Ruby master Bug Open Refining Module#refine itself introduces strange state 04/10/2018 06:27 AM Actions
14669 Ruby master Feature Open Regexp does not expose the amount of capture groups. 04/08/2018 11:11 AM Actions
14667 Ruby master Bug Feedback Segmentation fault in Ruby during iOS automation 04/06/2018 11:52 PM Actions
14663 Ruby master Bug Open getting "killed string.c" rdoc failed while trying to make ruby-2_5_1 04/04/2018 10:03 PM Actions
14662 Ruby master Bug Open Stack consistency error in 2.5.1 04/20/2018 01:40 PM Actions
14659 Ruby master Bug Open segfault in ConditionVariable#broadcast and ConditionVariable#signal 06/27/2018 07:32 AM Actions
14640 Ruby master Bug Open [win32] File.realpath treats a relative path with a drive letter as an absolute path. cruby-windows 12/10/2018 07:09 AM Actions
14636 Ruby master Feature Open `Hash` has a method for accessing the shortest path towards a certain key 03/28/2018 09:42 AM Actions
14635 Ruby master Bug Feedback Float#round(n) returns a wrong result when n is big 03/27/2018 01:57 PM Actions
14631 Ruby master Bug Open Add support for long paths in Windows 10 when support is enabled in the OS 03/26/2018 11:43 AM Actions
14626 Ruby master Bug Assigned One failing test on trunk 58fbe69a5b and OSX ko1 (Koichi Sasada) 03/26/2018 12:53 PM Actions
14625 Ruby master Feature Open yield_self accepts an argument, calling to_proc 03/30/2018 06:52 AM Actions
14624 Ruby master Feature Open #{nil} allocates a fresh empty string each time 04/21/2018 11:12 AM Actions
14618 Ruby master Feature Open Add display width method to String for CLI 03/21/2018 04:00 AM Actions
14616 Ruby master Bug Open Segmentation fault in net/http/response 03/21/2018 04:44 PM Actions
14615 Ruby master Feature Open Consider introducing shortcut to check Net::HTTP response type 03/19/2018 05:43 AM Actions
14614 Ruby master Bug Feedback Error when running `make update-gems` 06/20/2019 05:45 PM Actions
14612 Ruby master Bug Assigned IPv6 address inconsistency (downcase vs. upcase) akr (Akira Tanaka) 06/20/2019 06:00 PM Actions
14609 Ruby master Feature Open `Kernel#p` without args shows the receiver matz (Yukihiro Matsumoto) 03/11/2019 04:59 AM Actions
14607 Ruby master Bug Open Fix use of the rb_profile_frames start parameter 04/27/2018 12:30 AM Actions
14606 Ruby master Feature Open Change begin-else-end without rescue from warning to syntax error 03/16/2018 01:22 AM Actions
14605 Ruby master Bug Open Remove `original_iseq` from `rb_iseq_constant_body` 04/09/2018 09:21 PM Actions
14602 Ruby master Feature Open Version of dig that raises error if a key is not present 03/14/2018 01:01 PM Actions
14601 Ruby master Bug Open test-all & ruby/test_m17n_comb.rb - fixup 03/13/2018 03:18 PM Actions
14596 Ruby master Bug Open Ruby master is broken with bootsnap 03/23/2018 06:21 AM Actions
14593 Ruby master Feature Open Add `Enumerator#concat` 03/08/2018 09:15 PM Actions
14591 Ruby master Bug Open Files with invalid multi-byte characters will cause Find::find() to raise EINVAL exception 03/08/2018 10:25 PM Actions
14585 Ruby master Feature Open Array#each_pair 03/11/2018 11:38 PM Actions
14583 Ruby master Bug Feedback #method() is reporting the wrong self in exception 03/07/2018 08:23 PM Actions
14582 Ruby master Bug Open Unable to use `method__entry` and `method_return` tracing probes since 2.5 06/05/2018 03:42 AM Actions
14580 Ruby master Feature Open Hash#store accepts a block 03/08/2018 11:59 AM Actions
14574 Ruby master Feature Open percent literals and binary encoding strings 03/04/2018 07:38 AM Actions
14573 Ruby master Bug Open rb_ary_or doesn't check objects hash when the array contains less than SMALL_ARRAY_LEN 03/21/2018 03:01 PM Actions
14570 Ruby master Bug Open Wired behavior of File.expand_path() on Windows 03/03/2018 12:13 AM Actions
14569 Ruby master Bug Feedback Ruby dumps core involving XML file 06/20/2019 06:14 PM Actions
14565 Ruby master Feature Open Simpler, one-liner, failsafe require in ruby? [Suggested names: require_failsafe, require_safe, require_try, require_add) 03/01/2018 05:56 PM Actions
14564 Ruby master Feature Open `dig` opposite method 03/07/2018 11:24 PM Actions
14563 Ruby master Bug Open irb in irb raises a FATAL error 06/19/2019 09:38 PM Actions
14560 Ruby master Bug Open Segmentation fault near the end of large Rails test suite 03/06/2018 04:22 AM Actions
(1-500/2398) Per page: 50, 100, 200, 500

Also available in: Atom CSV PDF