From 03/17/2010 to 03/23/2010


09:36 AM Bug #2727: make: *** [encdb.h] Aborted
make test でも同じ状態だったので、該当部分を見て最小ケースを調べてみると catch した時点で落ちているようです。

% make test

znz (Kazuhiro NISHIYAMA)
02:37 AM Bug #2727: make: *** [encdb.h] Aborted
minirubyが壊れているように思えるので、make test していただけませんか。
naruse (Yui NARUSE)
12:19 AM Bug #2727: make: *** [encdb.h] Aborted
Ubuntu 10.04β x86_64, gcc version 4.4.3 (Ubuntu 4.4.3-2ubuntu2) で試してみましたが再現しませんでした。gccのバージョンとCPUアーキの両方に差異があるの...
kosaki (Motohiro KOSAKI)


12:47 AM Backport #2564 (Closed): [patch] re-initialize timer_thread_{lock,cond} after fork
Thanks for the feedback. Closing.
rogerdpack (Roger Pack)


05:23 PM Bug #2986 (Third Party's Issue): segmentation fault
using latest gruff gem 0.3.6 with ruby 1.9.1p378 installed via RVM and rails 2.3.5 on Mac OS X Snow Leopard ...
harry (Harry Hornreich)


06:11 PM Backport #2564: [patch] re-initialize timer_thread_{lock,cond} after fork
The folks who experienced this bug do not experience it anymore. I assume it was kernel bug. This ticket can ...
alk (Aliaksey Kandratsenka)
11:29 AM Bug #2980 (Third Party's Issue): Segmentation fault with ruby 1.9.1p376 and yajl-ruby-0.7.4 on opensuse x64
While I was testing yajl library I get a segmentation fault. The error is attached on error.txt and the json ...
koteo (Koldo Oteo)
12:22 AM Bug #2977 (Third Party's Issue): Segmaentation fault

naruse (Yui NARUSE)
12:21 AM Bug #2977: Segmaentation fault
Please search before posting:
luislavena (Luis Lavena)
12:15 AM Bug #2977 (Third Party's Issue): Segmaentation fault
I was running an Rails rake task on Netbean 6.8 IDE Windows XP Pro and following error message appeared. I am...
kayalemao (kay gutberlet)


12:17 AM Bug #2966: CSV reports illegal quoting on line ...
The bug you have found is fixed in the new FasterCSV 1.5.3 gem.
JEG2 (James Gray)

Also available in: Atom