Project

General

Profile

Activity

From 03/18/2010 to 03/24/2010

03/24/2010

11:30 PM Bug #3002: Hardcoded "gcc" in generated Ruby Makefile
=begin
Other points for consideration:

1) The requested fix is to update configure.in and/or Makefile.in to cre...
jonforums (Jon Forums)
09:53 AM Bug #3002: Hardcoded "gcc" in generated Ruby Makefile
=begin
Thank you Yui,

The question is why the usage of hardcoded gcc data in LDSHARED:

C:\Users\Luis>ruby ...
luislavena (Luis Lavena)
09:43 AM Bug #3002: Hardcoded "gcc" in generated Ruby Makefile
=begin
extconf.rb uses runnning ruby's RbConfig::MAKEFILE_CONFIG.

Also note that you can specify compiler when ...
naruse (Yui NARUSE)
09:13 AM Bug #3002: Hardcoded "gcc" in generated Ruby Makefile
=begin
darix,

I would disagree on your statement.

A Makefile generated by configure (autoconf) has the opt...
luislavena (Luis Lavena)
08:06 AM Bug #3002: Hardcoded "gcc" in generated Ruby Makefile
=begin
On 2010-03-24 07:27:41 +0900, Jon Forums wrote:
> Bug #3002: Hardcoded "gcc" in generated Ruby Makefile
> h...
darix (Marcus Rückert)
07:27 AM Bug #3002 (Closed): Hardcoded "gcc" in generated Ruby Makefile
=begin
In the configure generated Ruby Makefile on my mingw/windows system I get

CC = gcc
...
LDSHARED = gc...
jonforums (Jon Forums)
11:08 PM Bug #3006 (Closed): Compiling ext/etc problems (windows)
=begin
This is while compiling ruby for windows (i386 & x86_64) using Visual Studio 8 (2005).

I get the followi...
docwhat (Christian Höltje)
03:08 PM Bug #2727: make: *** [encdb.h] Aborted
=begin
いくつかの環境で試してみたところ、Fedora 11 の「gcc version 4.4.1 20090725 (Red Hat 4.4.1-2) (GCC)」(gcc-4.4.1-2.fc11.i586) でも再現し...
znz (Kazuhiro NISHIYAMA)
10:37 AM Bug #2980 (Third Party's Issue): Segmentation fault with ruby 1.9.1p376 and yajl-ruby-0.7.4 on opensuse x64
=begin
Use yajl-ruby 0.7.5.
=end
naruse (Yui NARUSE)
06:30 AM Bug #3000: Open SSL Segfaults
=begin
Okay, I thought this seemed familiar....

bug #1678 and bug #405 are also the same problem. This should ...
docwhat (Christian Höltje)
06:20 AM Bug #3000 (Closed): Open SSL Segfaults
=begin
According the OpenSSL docs, we need to set the store->ex_data.sk to NULL before doing a verify on an x509 sto...
docwhat (Christian Höltje)
06:12 AM Bug #2999 (Rejected): _WIN32 already has tzname and daylight defined.
=begin
I had to change line 129 from:
#if !defined(OS2) && defined(HAVE_TZNAME)
to:
#if !defined(OS2) && defin...
docwhat (Christian Höltje)

03/23/2010

09:36 AM Bug #2727: make: *** [encdb.h] Aborted
=begin
make test でも同じ状態だったので、該当部分を見て最小ケースを調べてみると catch した時点で落ちているようです。

% make test

sample/test.rb:assignme...
znz (Kazuhiro NISHIYAMA)
02:37 AM Bug #2727: make: *** [encdb.h] Aborted
=begin
minirubyが壊れているように思えるので、make test していただけませんか。
そこまでいけば実行可能なはずなので。
=end
naruse (Yui NARUSE)
12:19 AM Bug #2727: make: *** [encdb.h] Aborted
=begin
Ubuntu 10.04β x86_64, gcc version 4.4.3 (Ubuntu 4.4.3-2ubuntu2) で試してみましたが再現しませんでした。gccのバージョンとCPUアーキの両方に差異があるの...
kosaki (Motohiro KOSAKI)

03/20/2010

12:47 AM Backport #2564 (Closed): [patch] re-initialize timer_thread_{lock,cond} after fork
=begin
Thanks for the feedback. Closing.
=end
rogerdpack (Roger Pack)

03/19/2010

05:23 PM Bug #2986 (Third Party's Issue): segmentation fault
=begin
using latest gruff gem 0.3.6 with ruby 1.9.1p378 installed via RVM and rails 2.3.5 on Mac OS X Snow Leopard ...
harry (Harry Hornreich)

03/18/2010

06:11 PM Backport #2564: [patch] re-initialize timer_thread_{lock,cond} after fork
=begin
The folks who experienced this bug do not experience it anymore. I assume it was kernel bug. This ticket can ...
alk (Aliaksey Kandratsenka)
11:29 AM Bug #2980 (Third Party's Issue): Segmentation fault with ruby 1.9.1p376 and yajl-ruby-0.7.4 on opensuse x64
=begin
While I was testing yajl library I get a segmentation fault. The error is attached on error.txt and the json ...
koteo (Koldo Oteo)
12:22 AM Bug #2977 (Third Party's Issue): Segmaentation fault
=begin

=end
naruse (Yui NARUSE)
12:21 AM Bug #2977: Segmaentation fault
=begin
Please search before posting:

http://redmine.ruby-lang.org/issues/show/2753
http://redmine.ruby-lang.o...
luislavena (Luis Lavena)
12:15 AM Bug #2977 (Third Party's Issue): Segmaentation fault
=begin
I was running an Rails rake task on Netbean 6.8 IDE Windows XP Pro and following error message appeared. I am...
kayalemao (kay gutberlet)
 

Also available in: Atom