Project

General

Profile

Bug #277 ยป config.log

roberto (Ollivier Robert), 07/15/2008 09:44 PM

 
This file contains any messages produced by compilers while
running configure, to aid debugging if configure makes a mistake.

It was created by configure, which was
generated by GNU Autoconf 2.61. Invocation command line was

$ ../configure CC=gcc-mp-4.2 CFLAGS=-O -pipe -I/opt/local/include LDFLAGS=-L/opt/local/lib --no-create --no-recursion

## --------- ##
## Platform. ##
## --------- ##

hostname = roberto-al.eurocontrol.fr
uname -m = i386
uname -r = 8.11.1
uname -s = Darwin
uname -v = Darwin Kernel Version 8.11.1: Wed Oct 10 18:23:28 PDT 2007; root:xnu-792.25.20~1/RELEASE_I386

/usr/bin/uname -p = i386
/bin/uname -X = unknown

/bin/arch = unknown
/usr/bin/arch -k = unknown
/usr/convex/getsysinfo = unknown
/usr/bin/hostinfo = Mach kernel version:
Darwin Kernel Version 8.11.1: Wed Oct 10 18:23:28 PDT 2007; root:xnu-792.25.20~1/RELEASE_I386
Kernel configured for up to 2 processors.
2 processors are physically available.
2 processors are logically available.
Processor type: i486 (Intel 80486)
Processors active: 0 1
Primary memory available: 2.00 gigabytes
Default processor set: 99 tasks, 366 threads, 2 processors
Load average: 1.54, Mach factor: 0.53
/bin/machine = unknown
/usr/bin/oslevel = unknown
/bin/universe = unknown

PATH: /opt/local/bin
PATH: /opt/local/sbin
PATH: /usr/local/bin
PATH: /usr/local/sbin
PATH: /opt/local/bin
PATH: /Volumes/Users/roberto/shell
PATH: /opt/local/sbin
PATH: /usr/X11R6/bin
PATH: /usr/local/bin
PATH: /usr/bin
PATH: /bin
PATH: /usr/sbin
PATH: /sbin
PATH: .
PATH: /Volumes/Users/roberto/Shell
PATH: .


## ----------- ##
## Core tests. ##
## ----------- ##

configure:1939: checking build system type
configure:1957: result: i686-apple-darwin8.11.1
configure:1979: checking host system type
configure:1994: result: i686-apple-darwin8.11.1
configure:2016: checking target system type
configure:2031: result: i686-apple-darwin8.11.1
configure:2241: checking for gcc
configure:2268: result: gcc-mp-4.2
configure:2506: checking for C compiler version
configure:2513: gcc-mp-4.2 --version >&5
gcc-mp-4.2 (GCC) 4.2.2
Copyright (C) 2007 Free Software Foundation, Inc.
This is free software; see the source for copying conditions. There is NO
warranty; not even for MERCHANTABILITY or FITNESS FOR A PARTICULAR PURPOSE.

configure:2516: $? = 0
configure:2523: gcc-mp-4.2 -v >&5
Using built-in specs.
Target: i386-apple-darwin8.11.1
Configured with: ../gcc-4.2.2/configure --prefix=/opt/local --enable-languages=c,c++,java,objc,obj-c++,fortran --libdir=/opt/local/lib/gcc42 --includedir=/opt/local/include/gcc42 --infodir=/opt/local/share/info --mandir=/opt/local/share/man --with-local-prefix=/opt/local --with-system-zlib --disable-nls --disable-multilib --program-suffix=-mp-4.2 --with-gxx-include-dir=/opt/local/include/gcc42/c++/ --with-gmp=/opt/local --with-mpfr=/opt/local
Thread model: posix
gcc version 4.2.2
configure:2526: $? = 0
configure:2533: gcc-mp-4.2 -V >&5
gcc-mp-4.2: '-V' option must have argument
configure:2536: $? = 1
configure:2559: checking for C compiler default output file name
configure:2586: gcc-mp-4.2 -O -pipe -I/opt/local/include -L/opt/local/lib conftest.c >&5
configure:2589: $? = 0
configure:2627: result: a.out
configure:2644: checking whether the C compiler works
configure:2654: ./a.out
configure:2657: $? = 0
configure:2674: result: yes
configure:2681: checking whether we are cross compiling
configure:2683: result: no
configure:2686: checking for suffix of executables
configure:2693: gcc-mp-4.2 -o conftest -O -pipe -I/opt/local/include -L/opt/local/lib conftest.c >&5
configure:2696: $? = 0
configure:2720: result:
configure:2726: checking for suffix of object files
configure:2752: gcc-mp-4.2 -c -O -pipe -I/opt/local/include conftest.c >&5
configure:2755: $? = 0
configure:2778: result: o
configure:2782: checking whether we are using the GNU C compiler
configure:2811: gcc-mp-4.2 -c -O -pipe -I/opt/local/include conftest.c >&5
configure:2817: $? = 0
configure:2834: result: yes
configure:2839: checking whether gcc-mp-4.2 accepts -g
configure:2869: gcc-mp-4.2 -c -g conftest.c >&5
configure:2875: $? = 0
configure:2974: result: yes
configure:2991: checking for gcc-mp-4.2 option to accept ISO C89
configure:3065: gcc-mp-4.2 -c -O -pipe -I/opt/local/include conftest.c >&5
configure:3071: $? = 0
configure:3094: result: none needed
configure:3170: checking for g++
configure:3186: found /usr/bin/g++
configure:3197: result: g++
configure:3228: checking for C++ compiler version
configure:3235: g++ --version >&5
i686-apple-darwin8-g++-4.0.1 (GCC) 4.0.1 (Apple Computer, Inc. build 5370)
Copyright (C) 2005 Free Software Foundation, Inc.
This is free software; see the source for copying conditions. There is NO
warranty; not even for MERCHANTABILITY or FITNESS FOR A PARTICULAR PURPOSE.

configure:3238: $? = 0
configure:3245: g++ -v >&5
Using built-in specs.
Target: i686-apple-darwin8
Configured with: /var/tmp/gcc/gcc-5370~2/src/configure --disable-checking -enable-werror --prefix=/usr --mandir=/share/man --enable-languages=c,objc,c++,obj-c++ --program-transform-name=/^[cg][^.-]*$/s/$/-4.0/ --with-gxx-include-dir=/include/c++/4.0.0 --with-slibdir=/usr/lib --build=powerpc-apple-darwin8 --with-arch=nocona --with-tune=generic --program-prefix= --host=i686-apple-darwin8 --target=i686-apple-darwin8
Thread model: posix
gcc version 4.0.1 (Apple Computer, Inc. build 5370)
configure:3248: $? = 0
configure:3255: g++ -V >&5
g++: argument to `-V' is missing
configure:3258: $? = 1
configure:3261: checking whether we are using the GNU C++ compiler
configure:3290: g++ -c conftest.cpp >&5
configure:3296: $? = 0
configure:3313: result: yes
configure:3318: checking whether g++ accepts -g
configure:3348: g++ -c -g conftest.cpp >&5
configure:3354: $? = 0
configure:3453: result: yes
configure:3482: checking how to run the C preprocessor
configure:3522: gcc-mp-4.2 -E conftest.c
configure:3528: $? = 0
configure:3559: gcc-mp-4.2 -E conftest.c
conftest.c:9:28: error: ac_nonexistent.h: No such file or directory
configure:3565: $? = 1
configure: failed program was:
| /* confdefs.h. */
| #define PACKAGE_NAME ""
| #define PACKAGE_TARNAME ""
| #define PACKAGE_VERSION ""
| #define PACKAGE_STRING ""
| #define PACKAGE_BUGREPORT ""
| #define USE_BUILTIN_FRAME_ADDRESS 1
| /* end confdefs.h. */
| #include <ac_nonexistent.h>
configure:3598: result: gcc-mp-4.2 -E
configure:3627: gcc-mp-4.2 -E conftest.c
configure:3633: $? = 0
configure:3664: gcc-mp-4.2 -E conftest.c
conftest.c:9:28: error: ac_nonexistent.h: No such file or directory
configure:3670: $? = 1
configure: failed program was:
| /* confdefs.h. */
| #define PACKAGE_NAME ""
| #define PACKAGE_TARNAME ""
| #define PACKAGE_VERSION ""
| #define PACKAGE_STRING ""
| #define PACKAGE_BUGREPORT ""
| #define USE_BUILTIN_FRAME_ADDRESS 1
| /* end confdefs.h. */
| #include <ac_nonexistent.h>
configure:3708: checking for grep that handles long lines and -e
configure:3782: result: /usr/bin/grep
configure:3787: checking for egrep
configure:3865: result: /usr/bin/grep -E
configure:3871: checking whether gcc-mp-4.2 needs -traditional
conftest.c:9:20: error: termio.h: No such file or directory
configure:3913: result: no
configure:3926: checking whether the linker is GNU ld
configure:3938: result: no
configure:3942: checking whether gcc-mp-4.2 -E accepts -o
configure:3962: gcc-mp-4.2 -E -o conftest.i conftest.c
configure:3968: $? = 0
configure:3985: result: yes
configure:4096: checking for ranlib
configure:4112: found /usr/bin/ranlib
configure:4123: result: ranlib
configure:4192: checking for ar
configure:4208: found /usr/bin/ar
configure:4219: result: ar
configure:4334: checking for as
configure:4350: found /usr/bin/as
configure:4361: result: as
configure:4947: checking whether ln -s works
configure:4951: result: yes
configure:4958: checking whether make sets $(MAKE)
configure:4979: result: yes
configure:5001: checking for a BSD-compatible install
configure:5057: result: /usr/bin/install -c
configure:5071: checking for AIX
configure:5093: result: no
configure:5099: checking for ANSI C header files
configure:5129: gcc-mp-4.2 -c -O -pipe -I/opt/local/include conftest.c >&5
configure:5135: $? = 0
configure:5231: gcc-mp-4.2 -o conftest -O -pipe -I/opt/local/include -L/opt/local/lib conftest.c >&5
configure:5234: $? = 0
configure:5240: ./conftest
configure:5243: $? = 0
configure:5260: result: yes
configure:5284: checking for sys/types.h
configure:5305: gcc-mp-4.2 -c -O -pipe -I/opt/local/include conftest.c >&5
configure:5311: $? = 0
configure:5327: result: yes
configure:5284: checking for sys/stat.h
configure:5305: gcc-mp-4.2 -c -O -pipe -I/opt/local/include conftest.c >&5
configure:5311: $? = 0
configure:5327: result: yes
configure:5284: checking for stdlib.h
configure:5305: gcc-mp-4.2 -c -O -pipe -I/opt/local/include conftest.c >&5
configure:5311: $? = 0
configure:5327: result: yes
configure:5284: checking for string.h
configure:5305: gcc-mp-4.2 -c -O -pipe -I/opt/local/include conftest.c >&5
configure:5311: $? = 0
configure:5327: result: yes
configure:5284: checking for memory.h
configure:5305: gcc-mp-4.2 -c -O -pipe -I/opt/local/include conftest.c >&5
configure:5311: $? = 0
configure:5327: result: yes
configure:5284: checking for strings.h
configure:5305: gcc-mp-4.2 -c -O -pipe -I/opt/local/include conftest.c >&5
configure:5311: $? = 0
configure:5327: result: yes
configure:5284: checking for inttypes.h
configure:5305: gcc-mp-4.2 -c -O -pipe -I/opt/local/include conftest.c >&5
configure:5311: $? = 0
configure:5327: result: yes
configure:5284: checking for stdint.h
configure:5305: gcc-mp-4.2 -c -O -pipe -I/opt/local/include conftest.c >&5
configure:5311: $? = 0
configure:5327: result: yes
configure:5284: checking for unistd.h
configure:5305: gcc-mp-4.2 -c -O -pipe -I/opt/local/include conftest.c >&5
configure:5311: $? = 0
configure:5327: result: yes
configure:5349: checking minix/config.h usability
configure:5366: gcc-mp-4.2 -c -O -pipe -I/opt/local/include conftest.c >&5
conftest.c:52:26: error: minix/config.h: No such file or directory
configure:5372: $? = 1
configure: failed program was:
| /* confdefs.h. */
| #define PACKAGE_NAME ""
| #define PACKAGE_TARNAME ""
| #define PACKAGE_VERSION ""
| #define PACKAGE_STRING ""
| #define PACKAGE_BUGREPORT ""
| #define USE_BUILTIN_FRAME_ADDRESS 1
| #define STDC_HEADERS 1
| #define HAVE_SYS_TYPES_H 1
| #define HAVE_SYS_STAT_H 1
| #define HAVE_STDLIB_H 1
| #define HAVE_STRING_H 1
| #define HAVE_MEMORY_H 1
| #define HAVE_STRINGS_H 1
| #define HAVE_INTTYPES_H 1
| #define HAVE_STDINT_H 1
| #define HAVE_UNISTD_H 1
| /* end confdefs.h. */
| #include <stdio.h>
| #ifdef HAVE_SYS_TYPES_H
| # include <sys/types.h>
| #endif
| #ifdef HAVE_SYS_STAT_H
| # include <sys/stat.h>
| #endif
| #ifdef STDC_HEADERS
| # include <stdlib.h>
| # include <stddef.h>
| #else
| # ifdef HAVE_STDLIB_H
| # include <stdlib.h>
| # endif
| #endif
| #ifdef HAVE_STRING_H
| # if !defined STDC_HEADERS && defined HAVE_MEMORY_H
| # include <memory.h>
| # endif
| # include <string.h>
| #endif
| #ifdef HAVE_STRINGS_H
| # include <strings.h>
| #endif
| #ifdef HAVE_INTTYPES_H
| # include <inttypes.h>
| #endif
| #ifdef HAVE_STDINT_H
| # include <stdint.h>
| #endif
| #ifdef HAVE_UNISTD_H
| # include <unistd.h>
| #endif
| #include <minix/config.h>
configure:5386: result: no
configure:5390: checking minix/config.h presence
configure:5405: gcc-mp-4.2 -E conftest.c
conftest.c:19:26: error: minix/config.h: No such file or directory
configure:5411: $? = 1
configure: failed program was:
| /* confdefs.h. */
| #define PACKAGE_NAME ""
| #define PACKAGE_TARNAME ""
| #define PACKAGE_VERSION ""
| #define PACKAGE_STRING ""
| #define PACKAGE_BUGREPORT ""
| #define USE_BUILTIN_FRAME_ADDRESS 1
| #define STDC_HEADERS 1
| #define HAVE_SYS_TYPES_H 1
| #define HAVE_SYS_STAT_H 1
| #define HAVE_STDLIB_H 1
| #define HAVE_STRING_H 1
| #define HAVE_MEMORY_H 1
| #define HAVE_STRINGS_H 1
| #define HAVE_INTTYPES_H 1
| #define HAVE_STDINT_H 1
| #define HAVE_UNISTD_H 1
| /* end confdefs.h. */
| #include <minix/config.h>
configure:5425: result: no
configure:5453: checking for minix/config.h
configure:5460: result: no
configure:5510: checking for special C compiler options needed for large files
configure:5603: result: no
configure:5609: checking for _FILE_OFFSET_BITS value needed for large files
configure:5644: gcc-mp-4.2 -c -O -pipe -I/opt/local/include conftest.c >&5
configure:5650: $? = 0
configure:5718: result: no
configure:5864: checking for long long
configure:5894: gcc-mp-4.2 -c -O -pipe -I/opt/local/include conftest.c >&5
configure:5900: $? = 0
configure:5915: result: yes
configure:5925: checking for off_t
configure:5955: gcc-mp-4.2 -c -O -pipe -I/opt/local/include conftest.c >&5
configure:5961: $? = 0
configure:5976: result: yes
configure:5988: checking for int
configure:6018: gcc-mp-4.2 -c -O -pipe -I/opt/local/include conftest.c >&5
configure:6024: $? = 0
configure:6039: result: yes
configure:6046: checking size of int
configure:6348: gcc-mp-4.2 -o conftest -O -pipe -I/opt/local/include -L/opt/local/lib conftest.c >&5
configure:6351: $? = 0
configure:6357: ./conftest
configure:6360: $? = 0
configure:6383: result: 4
configure:6393: checking for short
configure:6423: gcc-mp-4.2 -c -O -pipe -I/opt/local/include conftest.c >&5
configure:6429: $? = 0
configure:6444: result: yes
configure:6451: checking size of short
configure:6753: gcc-mp-4.2 -o conftest -O -pipe -I/opt/local/include -L/opt/local/lib conftest.c >&5
configure:6756: $? = 0
configure:6762: ./conftest
configure:6765: $? = 0
configure:6788: result: 2
configure:6798: checking for long
configure:6828: gcc-mp-4.2 -c -O -pipe -I/opt/local/include conftest.c >&5
configure:6834: $? = 0
configure:6849: result: yes
configure:6856: checking size of long
configure:7158: gcc-mp-4.2 -o conftest -O -pipe -I/opt/local/include -L/opt/local/lib conftest.c >&5
configure:7161: $? = 0
configure:7167: ./conftest
configure:7170: $? = 0
configure:7193: result: 4
configure:7203: checking for long long
configure:7254: result: yes
configure:7261: checking size of long long
configure:7563: gcc-mp-4.2 -o conftest -O -pipe -I/opt/local/include -L/opt/local/lib conftest.c >&5
configure:7566: $? = 0
configure:7572: ./conftest
configure:7575: $? = 0
configure:7598: result: 8
configure:7608: checking for __int64
configure:7638: gcc-mp-4.2 -c -O -pipe -I/opt/local/include conftest.c >&5
conftest.c:58: error: expected '=', ',', ';', 'asm' or '__attribute__' before 'ac__type_new_'
conftest.c: In function 'main':
conftest.c:62: error: 'ac__type_new_' undeclared (first use in this function)
conftest.c:62: error: (Each undeclared identifier is reported only once
conftest.c:62: error: for each function it appears in.)
conftest.c:62: error: expected expression before ')' token
configure:7644: $? = 1
configure: failed program was:
| /* confdefs.h. */
| #define PACKAGE_NAME ""
| #define PACKAGE_TARNAME ""
| #define PACKAGE_VERSION ""
| #define PACKAGE_STRING ""
| #define PACKAGE_BUGREPORT ""
| #define USE_BUILTIN_FRAME_ADDRESS 1
| #define STDC_HEADERS 1
| #define HAVE_SYS_TYPES_H 1
| #define HAVE_SYS_STAT_H 1
| #define HAVE_STDLIB_H 1
| #define HAVE_STRING_H 1
| #define HAVE_MEMORY_H 1
| #define HAVE_STRINGS_H 1
| #define HAVE_INTTYPES_H 1
| #define HAVE_STDINT_H 1
| #define HAVE_UNISTD_H 1
| #define HAVE_LONG_LONG 1
| #define HAVE_OFF_T 1
| #define SIZEOF_INT 4
| #define SIZEOF_SHORT 2
| #define SIZEOF_LONG 4
| #define SIZEOF_LONG_LONG 8
| /* end confdefs.h. */
| #include <stdio.h>
| #ifdef HAVE_SYS_TYPES_H
| # include <sys/types.h>
| #endif
| #ifdef HAVE_SYS_STAT_H
| # include <sys/stat.h>
| #endif
| #ifdef STDC_HEADERS
| # include <stdlib.h>
| # include <stddef.h>
| #else
| # ifdef HAVE_STDLIB_H
| # include <stdlib.h>
| # endif
| #endif
| #ifdef HAVE_STRING_H
| # if !defined STDC_HEADERS && defined HAVE_MEMORY_H
| # include <memory.h>
| # endif
| # include <string.h>
| #endif
| #ifdef HAVE_STRINGS_H
| # include <strings.h>
| #endif
| #ifdef HAVE_INTTYPES_H
| # include <inttypes.h>
| #endif
| #ifdef HAVE_STDINT_H
| # include <stdint.h>
| #endif
| #ifdef HAVE_UNISTD_H
| # include <unistd.h>
| #endif
| typedef __int64 ac__type_new_;
| int
| main ()
| {
| if ((ac__type_new_ *) 0)
| return 0;
| if (sizeof (ac__type_new_))
| return 0;
| ;
| return 0;
| }
configure:7659: result: no
configure:7666: checking size of __int64
configure:7968: gcc-mp-4.2 -o conftest -O -pipe -I/opt/local/include -L/opt/local/lib conftest.c >&5
conftest.c:58: error: expected '=', ',', ';', 'asm' or '__attribute__' before 'ac__type_sizeof_'
conftest.c: In function 'longval':
conftest.c:59: error: 'ac__type_sizeof_' undeclared (first use in this function)
conftest.c:59: error: (Each undeclared identifier is reported only once
conftest.c:59: error: for each function it appears in.)
conftest.c: In function 'ulongval':
conftest.c:60: error: 'ac__type_sizeof_' undeclared (first use in this function)
conftest.c: In function 'main':
conftest.c:70: error: 'ac__type_sizeof_' undeclared (first use in this function)
configure:7971: $? = 1
configure: program exited with status 1
configure: failed program was:
| /* confdefs.h. */
| #define PACKAGE_NAME ""
| #define PACKAGE_TARNAME ""
| #define PACKAGE_VERSION ""
| #define PACKAGE_STRING ""
| #define PACKAGE_BUGREPORT ""
| #define USE_BUILTIN_FRAME_ADDRESS 1
| #define STDC_HEADERS 1
| #define HAVE_SYS_TYPES_H 1
| #define HAVE_SYS_STAT_H 1
| #define HAVE_STDLIB_H 1
| #define HAVE_STRING_H 1
| #define HAVE_MEMORY_H 1
| #define HAVE_STRINGS_H 1
| #define HAVE_INTTYPES_H 1
| #define HAVE_STDINT_H 1
| #define HAVE_UNISTD_H 1
| #define HAVE_LONG_LONG 1
| #define HAVE_OFF_T 1
| #define SIZEOF_INT 4
| #define SIZEOF_SHORT 2
| #define SIZEOF_LONG 4
| #define SIZEOF_LONG_LONG 8
| /* end confdefs.h. */
| #include <stdio.h>
| #ifdef HAVE_SYS_TYPES_H
| # include <sys/types.h>
| #endif
| #ifdef HAVE_SYS_STAT_H
| # include <sys/stat.h>
| #endif
| #ifdef STDC_HEADERS
| # include <stdlib.h>
| # include <stddef.h>
| #else
| # ifdef HAVE_STDLIB_H
| # include <stdlib.h>
| # endif
| #endif
| #ifdef HAVE_STRING_H
| # if !defined STDC_HEADERS && defined HAVE_MEMORY_H
| # include <memory.h>
| # endif
| # include <string.h>
| #endif
| #ifdef HAVE_STRINGS_H
| # include <strings.h>
| #endif
| #ifdef HAVE_INTTYPES_H
| # include <inttypes.h>
| #endif
| #ifdef HAVE_STDINT_H
| # include <stdint.h>
| #endif
| #ifdef HAVE_UNISTD_H
| # include <unistd.h>
| #endif
| typedef __int64 ac__type_sizeof_;
| static long int longval () { return (long int) (sizeof (ac__type_sizeof_)); }
| static unsigned long int ulongval () { return (long int) (sizeof (ac__type_sizeof_)); }
| #include <stdio.h>
| #include <stdlib.h>
| int
| main ()
| {
|
| FILE *f = fopen ("conftest.val", "w");
| if (! f)
| return 1;
| if (((long int) (sizeof (ac__type_sizeof_))) < 0)
| {
| long int i = longval ();
| if (i != ((long int) (sizeof (ac__type_sizeof_))))
| return 1;
| fprintf (f, "%ld\n", i);
| }
| else
| {
| unsigned long int i = ulongval ();
| if (i != ((long int) (sizeof (ac__type_sizeof_))))
| return 1;
| fprintf (f, "%lu\n", i);
| }
| return ferror (f) || fclose (f) != 0;
|
| ;
| return 0;
| }
configure:8003: result: 0
configure:8013: checking for off_t
configure:8064: result: yes
configure:8071: checking size of off_t
configure:8373: gcc-mp-4.2 -o conftest -O -pipe -I/opt/local/include -L/opt/local/lib conftest.c >&5
configure:8376: $? = 0
configure:8382: ./conftest
configure:8385: $? = 0
configure:8408: result: 8
configure:8418: checking for void*
configure:8448: gcc-mp-4.2 -c -O -pipe -I/opt/local/include conftest.c >&5
configure:8454: $? = 0
configure:8469: result: yes
configure:8476: checking size of void*
configure:8778: gcc-mp-4.2 -o conftest -O -pipe -I/opt/local/include -L/opt/local/lib conftest.c >&5
configure:8781: $? = 0
configure:8787: ./conftest
configure:8790: $? = 0
configure:8813: result: 4
configure:8823: checking for float
configure:8853: gcc-mp-4.2 -c -O -pipe -I/opt/local/include conftest.c >&5
configure:8859: $? = 0
configure:8874: result: yes
configure:8881: checking size of float
configure:9183: gcc-mp-4.2 -o conftest -O -pipe -I/opt/local/include -L/opt/local/lib conftest.c >&5
configure:9186: $? = 0
configure:9192: ./conftest
configure:9195: $? = 0
configure:9218: result: 4
configure:9228: checking for double
configure:9258: gcc-mp-4.2 -c -O -pipe -I/opt/local/include conftest.c >&5
configure:9264: $? = 0
configure:9279: result: yes
configure:9286: checking size of double
configure:9588: gcc-mp-4.2 -o conftest -O -pipe -I/opt/local/include -L/opt/local/lib conftest.c >&5
configure:9591: $? = 0
configure:9597: ./conftest
configure:9600: $? = 0
configure:9623: result: 8
configure:9633: checking for time_t
configure:9663: gcc-mp-4.2 -c -O -pipe -I/opt/local/include conftest.c >&5
configure:9669: $? = 0
configure:9684: result: yes
configure:9691: checking size of time_t
configure:9993: gcc-mp-4.2 -o conftest -O -pipe -I/opt/local/include -L/opt/local/lib conftest.c >&5
configure:9996: $? = 0
configure:10002: ./conftest
configure:10005: $? = 0
configure:10028: result: 4
configure:10040: checking for pid_t
configure:10070: gcc-mp-4.2 -c -O -pipe -I/opt/local/include conftest.c >&5
configure:10076: $? = 0
configure:10091: result: yes
configure:10105: checking for convertible type of pid_t
configure:10136: gcc-mp-4.2 -c -O -pipe -I/opt/local/include conftest.c >&5
conftest.c: In function 'main':
conftest.c:69: error: size of array 'test_array' is negative
configure:10142: $? = 1
configure: failed program was:
| /* confdefs.h. */
| #define PACKAGE_NAME ""
| #define PACKAGE_TARNAME ""
| #define PACKAGE_VERSION ""
| #define PACKAGE_STRING ""
| #define PACKAGE_BUGREPORT ""
| #define USE_BUILTIN_FRAME_ADDRESS 1
| #define STDC_HEADERS 1
| #define HAVE_SYS_TYPES_H 1
| #define HAVE_SYS_STAT_H 1
| #define HAVE_STDLIB_H 1
| #define HAVE_STRING_H 1
| #define HAVE_MEMORY_H 1
| #define HAVE_STRINGS_H 1
| #define HAVE_INTTYPES_H 1
| #define HAVE_STDINT_H 1
| #define HAVE_UNISTD_H 1
| #define HAVE_LONG_LONG 1
| #define HAVE_OFF_T 1
| #define SIZEOF_INT 4
| #define SIZEOF_SHORT 2
| #define SIZEOF_LONG 4
| #define SIZEOF_LONG_LONG 8
| #define SIZEOF___INT64 0
| #define SIZEOF_OFF_T 8
| #define SIZEOF_VOIDP 4
| #define SIZEOF_FLOAT 4
| #define SIZEOF_DOUBLE 8
| #define SIZEOF_TIME_T 4
| #define rb_pid_t pid_t
| /* end confdefs.h. */
| #include <stdio.h>
| #ifdef HAVE_SYS_TYPES_H
| # include <sys/types.h>
| #endif
| #ifdef HAVE_SYS_STAT_H
| # include <sys/stat.h>
| #endif
| #ifdef STDC_HEADERS
| # include <stdlib.h>
| # include <stddef.h>
| #else
| # ifdef HAVE_STDLIB_H
| # include <stdlib.h>
| # endif
| #endif
| #ifdef HAVE_STRING_H
| # if !defined STDC_HEADERS && defined HAVE_MEMORY_H
| # include <memory.h>
| # endif
| # include <string.h>
| #endif
| #ifdef HAVE_STRINGS_H
| # include <strings.h>
| #endif
| #ifdef HAVE_INTTYPES_H
| # include <inttypes.h>
| #endif
| #ifdef HAVE_STDINT_H
| # include <stdint.h>
| #endif
| #ifdef HAVE_UNISTD_H
| # include <unistd.h>
| #endif
|
| int
| main ()
| {
| static int test_array [1 - 2 * !((rb_pid_t)-1 > 0)];
| test_array [0] = 0
|
| ;
| return 0;
| }
configure:10181: gcc-mp-4.2 -c -O -pipe -I/opt/local/include conftest.c >&5
conftest.c: In function 'main':
conftest.c:69: error: size of array 'test_array' is negative
configure:10187: $? = 1
configure: failed program was:
| /* confdefs.h. */
| #define PACKAGE_NAME ""
| #define PACKAGE_TARNAME ""
| #define PACKAGE_VERSION ""
| #define PACKAGE_STRING ""
| #define PACKAGE_BUGREPORT ""
| #define USE_BUILTIN_FRAME_ADDRESS 1
| #define STDC_HEADERS 1
| #define HAVE_SYS_TYPES_H 1
| #define HAVE_SYS_STAT_H 1
| #define HAVE_STDLIB_H 1
| #define HAVE_STRING_H 1
| #define HAVE_MEMORY_H 1
| #define HAVE_STRINGS_H 1
| #define HAVE_INTTYPES_H 1
| #define HAVE_STDINT_H 1
| #define HAVE_UNISTD_H 1
| #define HAVE_LONG_LONG 1
| #define HAVE_OFF_T 1
| #define SIZEOF_INT 4
| #define SIZEOF_SHORT 2
| #define SIZEOF_LONG 4
| #define SIZEOF_LONG_LONG 8
| #define SIZEOF___INT64 0
| #define SIZEOF_OFF_T 8
| #define SIZEOF_VOIDP 4
| #define SIZEOF_FLOAT 4
| #define SIZEOF_DOUBLE 8
| #define SIZEOF_TIME_T 4
| #define rb_pid_t pid_t
| /* end confdefs.h. */
| #include <stdio.h>
| #ifdef HAVE_SYS_TYPES_H
| # include <sys/types.h>
| #endif
| #ifdef HAVE_SYS_STAT_H
| # include <sys/stat.h>
| #endif
| #ifdef STDC_HEADERS
| # include <stdlib.h>
| # include <stddef.h>
| #else
| # ifdef HAVE_STDLIB_H
| # include <stdlib.h>
| # endif
| #endif
| #ifdef HAVE_STRING_H
| # if !defined STDC_HEADERS && defined HAVE_MEMORY_H
| # include <memory.h>
| # endif
| # include <string.h>
| #endif
| #ifdef HAVE_STRINGS_H
| # include <strings.h>
| #endif
| #ifdef HAVE_INTTYPES_H
| # include <inttypes.h>
| #endif
| #ifdef HAVE_STDINT_H
| # include <stdint.h>
| #endif
| #ifdef HAVE_UNISTD_H
| # include <unistd.h>
| #endif
|
| int
| main ()
| {
| static int test_array [1 - 2 * !(sizeof(rb_pid_t) > sizeof(long))];
| test_array [0] = 0
|
| ;
| return 0;
| }
configure:10227: gcc-mp-4.2 -c -O -pipe -I/opt/local/include conftest.c >&5
configure:10233: $? = 0
configure:10253: result: LONG
configure:10264: checking for uid_t
configure:10294: gcc-mp-4.2 -c -O -pipe -I/opt/local/include conftest.c >&5
configure:10300: $? = 0
configure:10315: result: yes
configure:10329: checking for convertible type of uid_t
configure:10360: gcc-mp-4.2 -c -O -pipe -I/opt/local/include conftest.c >&5
configure:10366: $? = 0
configure:10405: gcc-mp-4.2 -c -O -pipe -I/opt/local/include conftest.c >&5
conftest.c: In function 'main':
conftest.c:72: error: size of array 'test_array' is negative
configure:10411: $? = 1
configure: failed program was:
| /* confdefs.h. */
| #define PACKAGE_NAME ""
| #define PACKAGE_TARNAME ""
| #define PACKAGE_VERSION ""
| #define PACKAGE_STRING ""
| #define PACKAGE_BUGREPORT ""
| #define USE_BUILTIN_FRAME_ADDRESS 1
| #define STDC_HEADERS 1
| #define HAVE_SYS_TYPES_H 1
| #define HAVE_SYS_STAT_H 1
| #define HAVE_STDLIB_H 1
| #define HAVE_STRING_H 1
| #define HAVE_MEMORY_H 1
| #define HAVE_STRINGS_H 1
| #define HAVE_INTTYPES_H 1
| #define HAVE_STDINT_H 1
| #define HAVE_UNISTD_H 1
| #define HAVE_LONG_LONG 1
| #define HAVE_OFF_T 1
| #define SIZEOF_INT 4
| #define SIZEOF_SHORT 2
| #define SIZEOF_LONG 4
| #define SIZEOF_LONG_LONG 8
| #define SIZEOF___INT64 0
| #define SIZEOF_OFF_T 8
| #define SIZEOF_VOIDP 4
| #define SIZEOF_FLOAT 4
| #define SIZEOF_DOUBLE 8
| #define SIZEOF_TIME_T 4
| #define rb_pid_t pid_t
| #define PIDT2NUM(v) LONG2NUM(v)
| #define NUM2PIDT(v) NUM2LONG(v)
| #define rb_uid_t uid_t
| /* end confdefs.h. */
| #include <stdio.h>
| #ifdef HAVE_SYS_TYPES_H
| # include <sys/types.h>
| #endif
| #ifdef HAVE_SYS_STAT_H
| # include <sys/stat.h>
| #endif
| #ifdef STDC_HEADERS
| # include <stdlib.h>
| # include <stddef.h>
| #else
| # ifdef HAVE_STDLIB_H
| # include <stdlib.h>
| # endif
| #endif
| #ifdef HAVE_STRING_H
| # if !defined STDC_HEADERS && defined HAVE_MEMORY_H
| # include <memory.h>
| # endif
| # include <string.h>
| #endif
| #ifdef HAVE_STRINGS_H
| # include <strings.h>
| #endif
| #ifdef HAVE_INTTYPES_H
| # include <inttypes.h>
| #endif
| #ifdef HAVE_STDINT_H
| # include <stdint.h>
| #endif
| #ifdef HAVE_UNISTD_H
| # include <unistd.h>
| #endif
|
| int
| main ()
| {
| static int test_array [1 - 2 * !(sizeof(rb_uid_t) > sizeof(long))];
| test_array [0] = 0
|
| ;
| return 0;
| }
configure:10451: gcc-mp-4.2 -c -O -pipe -I/opt/local/include conftest.c >&5
configure:10457: $? = 0
configure:10477: result: ULONG
configure:10488: checking for gid_t
configure:10518: gcc-mp-4.2 -c -O -pipe -I/opt/local/include conftest.c >&5
configure:10524: $? = 0
configure:10539: result: yes
configure:10553: checking for convertible type of gid_t
configure:10584: gcc-mp-4.2 -c -O -pipe -I/opt/local/include conftest.c >&5
configure:10590: $? = 0
configure:10629: gcc-mp-4.2 -c -O -pipe -I/opt/local/include conftest.c >&5
conftest.c: In function 'main':
conftest.c:75: error: size of array 'test_array' is negative
configure:10635: $? = 1
configure: failed program was:
| /* confdefs.h. */
| #define PACKAGE_NAME ""
| #define PACKAGE_TARNAME ""
| #define PACKAGE_VERSION ""
| #define PACKAGE_STRING ""
| #define PACKAGE_BUGREPORT ""
| #define USE_BUILTIN_FRAME_ADDRESS 1
| #define STDC_HEADERS 1
| #define HAVE_SYS_TYPES_H 1
| #define HAVE_SYS_STAT_H 1
| #define HAVE_STDLIB_H 1
| #define HAVE_STRING_H 1
| #define HAVE_MEMORY_H 1
| #define HAVE_STRINGS_H 1
| #define HAVE_INTTYPES_H 1
| #define HAVE_STDINT_H 1
| #define HAVE_UNISTD_H 1
| #define HAVE_LONG_LONG 1
| #define HAVE_OFF_T 1
| #define SIZEOF_INT 4
| #define SIZEOF_SHORT 2
| #define SIZEOF_LONG 4
| #define SIZEOF_LONG_LONG 8
| #define SIZEOF___INT64 0
| #define SIZEOF_OFF_T 8
| #define SIZEOF_VOIDP 4
| #define SIZEOF_FLOAT 4
| #define SIZEOF_DOUBLE 8
| #define SIZEOF_TIME_T 4
| #define rb_pid_t pid_t
| #define PIDT2NUM(v) LONG2NUM(v)
| #define NUM2PIDT(v) NUM2LONG(v)
| #define rb_uid_t uid_t
| #define UIDT2NUM(v) ULONG2NUM(v)
| #define NUM2UIDT(v) NUM2ULONG(v)
| #define rb_gid_t gid_t
| /* end confdefs.h. */
| #include <stdio.h>
| #ifdef HAVE_SYS_TYPES_H
| # include <sys/types.h>
| #endif
| #ifdef HAVE_SYS_STAT_H
| # include <sys/stat.h>
| #endif
| #ifdef STDC_HEADERS
| # include <stdlib.h>
| # include <stddef.h>
| #else
| # ifdef HAVE_STDLIB_H
| # include <stdlib.h>
| # endif
| #endif
| #ifdef HAVE_STRING_H
| # if !defined STDC_HEADERS && defined HAVE_MEMORY_H
| # include <memory.h>
| # endif
| # include <string.h>
| #endif
| #ifdef HAVE_STRINGS_H
| # include <strings.h>
| #endif
| #ifdef HAVE_INTTYPES_H
| # include <inttypes.h>
| #endif
| #ifdef HAVE_STDINT_H
| # include <stdint.h>
| #endif
| #ifdef HAVE_UNISTD_H
| # include <unistd.h>
| #endif
|
| int
| main ()
| {
| static int test_array [1 - 2 * !(sizeof(rb_gid_t) > sizeof(long))];
| test_array [0] = 0
|
| ;
| return 0;
| }
configure:10675: gcc-mp-4.2 -c -O -pipe -I/opt/local/include conftest.c >&5
configure:10681: $? = 0
configure:10701: result: ULONG
configure:10713: checking for prototypes
configure:10739: gcc-mp-4.2 -c -O -pipe -I/opt/local/include conftest.c >&5
configure:10745: $? = 0
configure:10760: result: yes
configure:10769: checking token paste string
configure:10795: gcc-mp-4.2 -c -O -pipe -I/opt/local/include conftest.c >&5
configure:10801: $? = 0
configure:10816: result: ansi
configure:10830: checking stringization
configure:10868: gcc-mp-4.2 -c -O -pipe -I/opt/local/include conftest.c >&5
configure:10874: $? = 0
configure:10891: result: #expr
configure:10908: checking string literal concatenation
configure:10941: gcc-mp-4.2 -c -O -pipe -I/opt/local/include conftest.c >&5
configure:10947: $? = 0
configure:10963: result: yes
configure:10972: checking for variable length prototypes and stdarg.h
configure:11008: gcc-mp-4.2 -c -O -pipe -I/opt/local/include conftest.c >&5
configure:11014: $? = 0
configure:11029: result: yes
configure:11040: checking for noreturn function attribute
configure:11075: gcc-mp-4.2 -c -O -pipe -I/opt/local/include conftest.c >&5
configure:11081: $? = 0
configure:11103: result: __attribute__ ((noreturn)) x
configure:11112: checking for deprecated function attribute
configure:11147: gcc-mp-4.2 -c -O -pipe -I/opt/local/include conftest.c >&5
configure:11153: $? = 0
configure:11175: result: __attribute__ ((deprecated)) x
configure:11184: checking for noinline function attribute
configure:11219: gcc-mp-4.2 -c -O -pipe -I/opt/local/include conftest.c >&5
configure:11225: $? = 0
configure:11247: result: __attribute__ ((noinline)) x
configure:11256: checking for stdcall function attribute
configure:11291: gcc-mp-4.2 -c -O -pipe -I/opt/local/include conftest.c >&5
configure:11297: $? = 0
configure:11319: result: __attribute__ ((stdcall)) x
configure:11328: checking for cdecl function attribute
configure:11363: gcc-mp-4.2 -c -O -pipe -I/opt/local/include conftest.c >&5
configure:11369: $? = 0
configure:11391: result: __attribute__ ((cdecl)) x
configure:11400: checking for fastcall function attribute
configure:11435: gcc-mp-4.2 -c -O -pipe -I/opt/local/include conftest.c >&5
configure:11441: $? = 0
configure:11463: result: __attribute__ ((fastcall)) x
configure:11473: checking for RUBY_EXTERN
configure:11501: gcc-mp-4.2 -c -O -pipe -I/opt/local/include conftest.c >&5
conftest.c:50: warning: 'dllimport' attribute directive ignored
conftest.c: In function 'main':
conftest.c:54: error: 'rb_cv_ruby_extern' undeclared (first use in this function)
conftest.c:54: error: (Each undeclared identifier is reported only once
conftest.c:54: error: for each function it appears in.)
conftest.c:54: error: break statement not within loop or switch
configure:11507: $? = 1
configure: failed program was:
| /* confdefs.h. */
| #define PACKAGE_NAME ""
| #define PACKAGE_TARNAME ""
| #define PACKAGE_VERSION ""
| #define PACKAGE_STRING ""
| #define PACKAGE_BUGREPORT ""
| #define USE_BUILTIN_FRAME_ADDRESS 1
| #define STDC_HEADERS 1
| #define HAVE_SYS_TYPES_H 1
| #define HAVE_SYS_STAT_H 1
| #define HAVE_STDLIB_H 1
| #define HAVE_STRING_H 1
| #define HAVE_MEMORY_H 1
| #define HAVE_STRINGS_H 1
| #define HAVE_INTTYPES_H 1
| #define HAVE_STDINT_H 1
| #define HAVE_UNISTD_H 1
| #define HAVE_LONG_LONG 1
| #define HAVE_OFF_T 1
| #define SIZEOF_INT 4
| #define SIZEOF_SHORT 2
| #define SIZEOF_LONG 4
| #define SIZEOF_LONG_LONG 8
| #define SIZEOF___INT64 0
| #define SIZEOF_OFF_T 8
| #define SIZEOF_VOIDP 4
| #define SIZEOF_FLOAT 4
| #define SIZEOF_DOUBLE 8
| #define SIZEOF_TIME_T 4
| #define rb_pid_t pid_t
| #define PIDT2NUM(v) LONG2NUM(v)
| #define NUM2PIDT(v) NUM2LONG(v)
| #define rb_uid_t uid_t
| #define UIDT2NUM(v) ULONG2NUM(v)
| #define NUM2UIDT(v) NUM2ULONG(v)
| #define rb_gid_t gid_t
| #define GIDT2NUM(v) ULONG2NUM(v)
| #define NUM2GIDT(v) NUM2ULONG(v)
| #define HAVE_PROTOTYPES 1
| #define TOKEN_PASTE(x,y) x##y
| #define STRINGIZE(expr) STRINGIZE0(expr)
| #define HAVE_STDARG_PROTOTYPES 1
| #define NORETURN(x) __attribute__ ((noreturn)) x
| #define DEPRECATED(x) __attribute__ ((deprecated)) x
| #define NOINLINE(x) __attribute__ ((noinline)) x
| #define FUNC_STDCALL(x) __attribute__ ((stdcall)) x
| #define FUNC_CDECL(x) __attribute__ ((cdecl)) x
| #define FUNC_FASTCALL(x) __attribute__ ((fastcall)) x
| /* end confdefs.h. */
| extern __attribute__((dllimport)) void conftest(void);
| int
| main ()
| {
| rb_cv_ruby_extern="extern __attribute__((dllimport))"; break
| ;
| return 0;
| }
configure:11501: gcc-mp-4.2 -c -O -pipe -I/opt/local/include conftest.c >&5
conftest.c: In function '__declspec':
conftest.c:53: error: expected '=', ',', ';', 'asm' or '__attribute__' before '{' token
conftest.c:50: error: declaration for parameter 'conftest' but no such parameter
conftest.c:57: error: expected '{' at end of input
configure:11507: $? = 1
configure: failed program was:
| /* confdefs.h. */
| #define PACKAGE_NAME ""
| #define PACKAGE_TARNAME ""
| #define PACKAGE_VERSION ""
| #define PACKAGE_STRING ""
| #define PACKAGE_BUGREPORT ""
| #define USE_BUILTIN_FRAME_ADDRESS 1
| #define STDC_HEADERS 1
| #define HAVE_SYS_TYPES_H 1
| #define HAVE_SYS_STAT_H 1
| #define HAVE_STDLIB_H 1
| #define HAVE_STRING_H 1
| #define HAVE_MEMORY_H 1
| #define HAVE_STRINGS_H 1
| #define HAVE_INTTYPES_H 1
| #define HAVE_STDINT_H 1
| #define HAVE_UNISTD_H 1
| #define HAVE_LONG_LONG 1
| #define HAVE_OFF_T 1
| #define SIZEOF_INT 4
| #define SIZEOF_SHORT 2
| #define SIZEOF_LONG 4
| #define SIZEOF_LONG_LONG 8
| #define SIZEOF___INT64 0
| #define SIZEOF_OFF_T 8
| #define SIZEOF_VOIDP 4
| #define SIZEOF_FLOAT 4
| #define SIZEOF_DOUBLE 8
| #define SIZEOF_TIME_T 4
| #define rb_pid_t pid_t
| #define PIDT2NUM(v) LONG2NUM(v)
| #define NUM2PIDT(v) NUM2LONG(v)
| #define rb_uid_t uid_t
| #define UIDT2NUM(v) ULONG2NUM(v)
| #define NUM2UIDT(v) NUM2ULONG(v)
| #define rb_gid_t gid_t
| #define GIDT2NUM(v) ULONG2NUM(v)
| #define NUM2GIDT(v) NUM2ULONG(v)
| #define HAVE_PROTOTYPES 1
| #define TOKEN_PASTE(x,y) x##y
| #define STRINGIZE(expr) STRINGIZE0(expr)
| #define HAVE_STDARG_PROTOTYPES 1
| #define NORETURN(x) __attribute__ ((noreturn)) x
| #define DEPRECATED(x) __attribute__ ((deprecated)) x
| #define NOINLINE(x) __attribute__ ((noinline)) x
| #define FUNC_STDCALL(x) __attribute__ ((stdcall)) x
| #define FUNC_CDECL(x) __attribute__ ((cdecl)) x
| #define FUNC_FASTCALL(x) __attribute__ ((fastcall)) x
| /* end confdefs.h. */
| extern __declspec(dllimport) void conftest(void);
| int
| main ()
| {
| rb_cv_ruby_extern="extern __declspec(dllimport)"; break
| ;
| return 0;
| }
configure:11523: result: no
configure:11532: checking whether sys_nerr is declared
configure:11563: gcc-mp-4.2 -c -O -pipe -I/opt/local/include conftest.c >&5
configure:11569: $? = 0
configure:11584: result: yes
configure:11693: gcc-mp-4.2 -E -D_XOPEN_SOURCE -D_DARWIN_C_SOURCE conftest.c
conftest.c:53:8: error: #error pre OS X 10.4
configure:11699: $? = 1
configure: failed program was:
| /* confdefs.h. */
| #define PACKAGE_NAME ""
| #define PACKAGE_TARNAME ""
| #define PACKAGE_VERSION ""
| #define PACKAGE_STRING ""
| #define PACKAGE_BUGREPORT ""
| #define USE_BUILTIN_FRAME_ADDRESS 1
| #define STDC_HEADERS 1
| #define HAVE_SYS_TYPES_H 1
| #define HAVE_SYS_STAT_H 1
| #define HAVE_STDLIB_H 1
| #define HAVE_STRING_H 1
| #define HAVE_MEMORY_H 1
| #define HAVE_STRINGS_H 1
| #define HAVE_INTTYPES_H 1
| #define HAVE_STDINT_H 1
| #define HAVE_UNISTD_H 1
| #define HAVE_LONG_LONG 1
| #define HAVE_OFF_T 1
| #define SIZEOF_INT 4
| #define SIZEOF_SHORT 2
| #define SIZEOF_LONG 4
| #define SIZEOF_LONG_LONG 8
| #define SIZEOF___INT64 0
| #define SIZEOF_OFF_T 8
| #define SIZEOF_VOIDP 4
| #define SIZEOF_FLOAT 4
| #define SIZEOF_DOUBLE 8
| #define SIZEOF_TIME_T 4
| #define rb_pid_t pid_t
| #define PIDT2NUM(v) LONG2NUM(v)
| #define NUM2PIDT(v) NUM2LONG(v)
| #define rb_uid_t uid_t
| #define UIDT2NUM(v) ULONG2NUM(v)
| #define NUM2UIDT(v) NUM2ULONG(v)
| #define rb_gid_t gid_t
| #define GIDT2NUM(v) ULONG2NUM(v)
| #define NUM2GIDT(v) NUM2ULONG(v)
| #define HAVE_PROTOTYPES 1
| #define TOKEN_PASTE(x,y) x##y
| #define STRINGIZE(expr) STRINGIZE0(expr)
| #define HAVE_STDARG_PROTOTYPES 1
| #define NORETURN(x) __attribute__ ((noreturn)) x
| #define DEPRECATED(x) __attribute__ ((deprecated)) x
| #define NOINLINE(x) __attribute__ ((noinline)) x
| #define FUNC_STDCALL(x) __attribute__ ((stdcall)) x
| #define FUNC_CDECL(x) __attribute__ ((cdecl)) x
| #define FUNC_FASTCALL(x) __attribute__ ((fastcall)) x
| #define HAVE_DECL_SYS_NERR 1
| /* end confdefs.h. */
| #include <AvailabilityMacros.h>
| #if MAC_OS_X_VERSION_MAX_ALLOWED <= 1040
| #error pre OS X 10.4
| [!<===== pre OS X 10.4 =====>]
| #endif
|
configure:11914: checking for crypt in -lcrypt
configure:11949: gcc-mp-4.2 -o conftest -O -pipe -I/opt/local/include -D_XOPEN_SOURCE -D_DARWIN_C_SOURCE -L/opt/local/lib conftest.c -lcrypt -lobjc >&5
/usr/bin/ld: can't locate file for: -lcrypt
collect2: ld returned 1 exit status
configure:11955: $? = 1
configure: failed program was:
| /* confdefs.h. */
| #define PACKAGE_NAME ""
| #define PACKAGE_TARNAME ""
| #define PACKAGE_VERSION ""
| #define PACKAGE_STRING ""
| #define PACKAGE_BUGREPORT ""
| #define USE_BUILTIN_FRAME_ADDRESS 1
| #define STDC_HEADERS 1
| #define HAVE_SYS_TYPES_H 1
| #define HAVE_SYS_STAT_H 1
| #define HAVE_STDLIB_H 1
| #define HAVE_STRING_H 1
| #define HAVE_MEMORY_H 1
| #define HAVE_STRINGS_H 1
| #define HAVE_INTTYPES_H 1
| #define HAVE_STDINT_H 1
| #define HAVE_UNISTD_H 1
| #define HAVE_LONG_LONG 1
| #define HAVE_OFF_T 1
| #define SIZEOF_INT 4
| #define SIZEOF_SHORT 2
| #define SIZEOF_LONG 4
| #define SIZEOF_LONG_LONG 8
| #define SIZEOF___INT64 0
| #define SIZEOF_OFF_T 8
| #define SIZEOF_VOIDP 4
| #define SIZEOF_FLOAT 4
| #define SIZEOF_DOUBLE 8
| #define SIZEOF_TIME_T 4
| #define rb_pid_t pid_t
| #define PIDT2NUM(v) LONG2NUM(v)
| #define NUM2PIDT(v) NUM2LONG(v)
| #define rb_uid_t uid_t
| #define UIDT2NUM(v) ULONG2NUM(v)
| #define NUM2UIDT(v) NUM2ULONG(v)
| #define rb_gid_t gid_t
| #define GIDT2NUM(v) ULONG2NUM(v)
| #define NUM2GIDT(v) NUM2ULONG(v)
| #define HAVE_PROTOTYPES 1
| #define TOKEN_PASTE(x,y) x##y
| #define STRINGIZE(expr) STRINGIZE0(expr)
| #define HAVE_STDARG_PROTOTYPES 1
| #define NORETURN(x) __attribute__ ((noreturn)) x
| #define DEPRECATED(x) __attribute__ ((deprecated)) x
| #define NOINLINE(x) __attribute__ ((noinline)) x
| #define FUNC_STDCALL(x) __attribute__ ((stdcall)) x
| #define FUNC_CDECL(x) __attribute__ ((cdecl)) x
| #define FUNC_FASTCALL(x) __attribute__ ((fastcall)) x
| #define HAVE_DECL_SYS_NERR 1
| #define BROKEN_SETREUID 1
| #define BROKEN_SETREGID 1
| /* end confdefs.h. */
|
| /* Override any GCC internal prototype to avoid an error.
| Use char because int might match the return type of a GCC
| builtin and then its argument prototype would still apply. */
| #ifdef __cplusplus
| extern "C"
| #endif
| char crypt ();
| int
| main ()
| {
| return crypt ();
| ;
| return 0;
| }
configure:11973: result: no
configure:11985: checking for dlopen in -ldl
configure:12020: gcc-mp-4.2 -o conftest -O -pipe -I/opt/local/include -D_XOPEN_SOURCE -D_DARWIN_C_SOURCE -L/opt/local/lib conftest.c -ldl -lobjc >&5
configure:12026: $? = 0
configure:12044: result: yes
configure:12056: checking for shl_load in -ldld
configure:12091: gcc-mp-4.2 -o conftest -O -pipe -I/opt/local/include -D_XOPEN_SOURCE -D_DARWIN_C_SOURCE -L/opt/local/lib conftest.c -ldld -ldl -lobjc >&5
/usr/bin/ld: can't locate file for: -ldld
collect2: ld returned 1 exit status
configure:12097: $? = 1
configure: failed program was:
| /* confdefs.h. */
| #define PACKAGE_NAME ""
| #define PACKAGE_TARNAME ""
| #define PACKAGE_VERSION ""
| #define PACKAGE_STRING ""
| #define PACKAGE_BUGREPORT ""
| #define USE_BUILTIN_FRAME_ADDRESS 1
| #define STDC_HEADERS 1
| #define HAVE_SYS_TYPES_H 1
| #define HAVE_SYS_STAT_H 1
| #define HAVE_STDLIB_H 1
| #define HAVE_STRING_H 1
| #define HAVE_MEMORY_H 1
| #define HAVE_STRINGS_H 1
| #define HAVE_INTTYPES_H 1
| #define HAVE_STDINT_H 1
| #define HAVE_UNISTD_H 1
| #define HAVE_LONG_LONG 1
| #define HAVE_OFF_T 1
| #define SIZEOF_INT 4
| #define SIZEOF_SHORT 2
| #define SIZEOF_LONG 4
| #define SIZEOF_LONG_LONG 8
| #define SIZEOF___INT64 0
| #define SIZEOF_OFF_T 8
| #define SIZEOF_VOIDP 4
| #define SIZEOF_FLOAT 4
| #define SIZEOF_DOUBLE 8
| #define SIZEOF_TIME_T 4
| #define rb_pid_t pid_t
| #define PIDT2NUM(v) LONG2NUM(v)
| #define NUM2PIDT(v) NUM2LONG(v)
| #define rb_uid_t uid_t
| #define UIDT2NUM(v) ULONG2NUM(v)
| #define NUM2UIDT(v) NUM2ULONG(v)
| #define rb_gid_t gid_t
| #define GIDT2NUM(v) ULONG2NUM(v)
| #define NUM2GIDT(v) NUM2ULONG(v)
| #define HAVE_PROTOTYPES 1
| #define TOKEN_PASTE(x,y) x##y
| #define STRINGIZE(expr) STRINGIZE0(expr)
| #define HAVE_STDARG_PROTOTYPES 1
| #define NORETURN(x) __attribute__ ((noreturn)) x
| #define DEPRECATED(x) __attribute__ ((deprecated)) x
| #define NOINLINE(x) __attribute__ ((noinline)) x
| #define FUNC_STDCALL(x) __attribute__ ((stdcall)) x
| #define FUNC_CDECL(x) __attribute__ ((cdecl)) x
| #define FUNC_FASTCALL(x) __attribute__ ((fastcall)) x
| #define HAVE_DECL_SYS_NERR 1
| #define BROKEN_SETREUID 1
| #define BROKEN_SETREGID 1
| #define HAVE_LIBDL 1
| /* end confdefs.h. */
|
| /* Override any GCC internal prototype to avoid an error.
| Use char because int might match the return type of a GCC
| builtin and then its argument prototype would still apply. */
| #ifdef __cplusplus
| extern "C"
| #endif
| char shl_load ();
| int
| main ()
| {
| return shl_load ();
| ;
| return 0;
| }
configure:12115: result: no
configure:12127: checking for socketpair in -lsocket
configure:12162: gcc-mp-4.2 -o conftest -O -pipe -I/opt/local/include -D_XOPEN_SOURCE -D_DARWIN_C_SOURCE -L/opt/local/lib conftest.c -lsocket -ldl -lobjc >&5
/usr/bin/ld: can't locate file for: -lsocket
collect2: ld returned 1 exit status
configure:12168: $? = 1
configure: failed program was:
| /* confdefs.h. */
| #define PACKAGE_NAME ""
| #define PACKAGE_TARNAME ""
| #define PACKAGE_VERSION ""
| #define PACKAGE_STRING ""
| #define PACKAGE_BUGREPORT ""
| #define USE_BUILTIN_FRAME_ADDRESS 1
| #define STDC_HEADERS 1
| #define HAVE_SYS_TYPES_H 1
| #define HAVE_SYS_STAT_H 1
| #define HAVE_STDLIB_H 1
| #define HAVE_STRING_H 1
| #define HAVE_MEMORY_H 1
| #define HAVE_STRINGS_H 1
| #define HAVE_INTTYPES_H 1
| #define HAVE_STDINT_H 1
| #define HAVE_UNISTD_H 1
| #define HAVE_LONG_LONG 1
| #define HAVE_OFF_T 1
| #define SIZEOF_INT 4
| #define SIZEOF_SHORT 2
| #define SIZEOF_LONG 4
| #define SIZEOF_LONG_LONG 8
| #define SIZEOF___INT64 0
| #define SIZEOF_OFF_T 8
| #define SIZEOF_VOIDP 4
| #define SIZEOF_FLOAT 4
| #define SIZEOF_DOUBLE 8
| #define SIZEOF_TIME_T 4
| #define rb_pid_t pid_t
| #define PIDT2NUM(v) LONG2NUM(v)
| #define NUM2PIDT(v) NUM2LONG(v)
| #define rb_uid_t uid_t
| #define UIDT2NUM(v) ULONG2NUM(v)
| #define NUM2UIDT(v) NUM2ULONG(v)
| #define rb_gid_t gid_t
| #define GIDT2NUM(v) ULONG2NUM(v)
| #define NUM2GIDT(v) NUM2ULONG(v)
| #define HAVE_PROTOTYPES 1
| #define TOKEN_PASTE(x,y) x##y
| #define STRINGIZE(expr) STRINGIZE0(expr)
| #define HAVE_STDARG_PROTOTYPES 1
| #define NORETURN(x) __attribute__ ((noreturn)) x
| #define DEPRECATED(x) __attribute__ ((deprecated)) x
| #define NOINLINE(x) __attribute__ ((noinline)) x
| #define FUNC_STDCALL(x) __attribute__ ((stdcall)) x
| #define FUNC_CDECL(x) __attribute__ ((cdecl)) x
| #define FUNC_FASTCALL(x) __attribute__ ((fastcall)) x
| #define HAVE_DECL_SYS_NERR 1
| #define BROKEN_SETREUID 1
| #define BROKEN_SETREGID 1
| #define HAVE_LIBDL 1
| /* end confdefs.h. */
|
| /* Override any GCC internal prototype to avoid an error.
| Use char because int might match the return type of a GCC
| builtin and then its argument prototype would still apply. */
| #ifdef __cplusplus
| extern "C"
| #endif
| char socketpair ();
| int
| main ()
| {
| return socketpair ();
| ;
| return 0;
| }
configure:12186: result: no
configure:12198: checking for clock_gettime in -lrt
configure:12233: gcc-mp-4.2 -o conftest -O -pipe -I/opt/local/include -D_XOPEN_SOURCE -D_DARWIN_C_SOURCE -L/opt/local/lib conftest.c -lrt -ldl -lobjc >&5
/usr/bin/ld: can't locate file for: -lrt
collect2: ld returned 1 exit status
configure:12239: $? = 1
configure: failed program was:
| /* confdefs.h. */
| #define PACKAGE_NAME ""
| #define PACKAGE_TARNAME ""
| #define PACKAGE_VERSION ""
| #define PACKAGE_STRING ""
| #define PACKAGE_BUGREPORT ""
| #define USE_BUILTIN_FRAME_ADDRESS 1
| #define STDC_HEADERS 1
| #define HAVE_SYS_TYPES_H 1
| #define HAVE_SYS_STAT_H 1
| #define HAVE_STDLIB_H 1
| #define HAVE_STRING_H 1
| #define HAVE_MEMORY_H 1
| #define HAVE_STRINGS_H 1
| #define HAVE_INTTYPES_H 1
| #define HAVE_STDINT_H 1
| #define HAVE_UNISTD_H 1
| #define HAVE_LONG_LONG 1
| #define HAVE_OFF_T 1
| #define SIZEOF_INT 4
| #define SIZEOF_SHORT 2
| #define SIZEOF_LONG 4
| #define SIZEOF_LONG_LONG 8
| #define SIZEOF___INT64 0
| #define SIZEOF_OFF_T 8
| #define SIZEOF_VOIDP 4
| #define SIZEOF_FLOAT 4
| #define SIZEOF_DOUBLE 8
| #define SIZEOF_TIME_T 4
| #define rb_pid_t pid_t
| #define PIDT2NUM(v) LONG2NUM(v)
| #define NUM2PIDT(v) NUM2LONG(v)
| #define rb_uid_t uid_t
| #define UIDT2NUM(v) ULONG2NUM(v)
| #define NUM2UIDT(v) NUM2ULONG(v)
| #define rb_gid_t gid_t
| #define GIDT2NUM(v) ULONG2NUM(v)
| #define NUM2GIDT(v) NUM2ULONG(v)
| #define HAVE_PROTOTYPES 1
| #define TOKEN_PASTE(x,y) x##y
| #define STRINGIZE(expr) STRINGIZE0(expr)
| #define HAVE_STDARG_PROTOTYPES 1
| #define NORETURN(x) __attribute__ ((noreturn)) x
| #define DEPRECATED(x) __attribute__ ((deprecated)) x
| #define NOINLINE(x) __attribute__ ((noinline)) x
| #define FUNC_STDCALL(x) __attribute__ ((stdcall)) x
| #define FUNC_CDECL(x) __attribute__ ((cdecl)) x
| #define FUNC_FASTCALL(x) __attribute__ ((fastcall)) x
| #define HAVE_DECL_SYS_NERR 1
| #define BROKEN_SETREUID 1
| #define BROKEN_SETREGID 1
| #define HAVE_LIBDL 1
| /* end confdefs.h. */
|
| /* Override any GCC internal prototype to avoid an error.
| Use char because int might match the return type of a GCC
| builtin and then its argument prototype would still apply. */
| #ifdef __cplusplus
| extern "C"
| #endif
| char clock_gettime ();
| int
| main ()
| {
| return clock_gettime ();
| ;
| return 0;
| }
configure:12257: result: no
configure:12284: checking for dirent.h that defines DIR
configure:12313: gcc-mp-4.2 -c -O -pipe -I/opt/local/include -D_XOPEN_SOURCE -D_DARWIN_C_SOURCE conftest.c >&5
configure:12319: $? = 0
configure:12335: result: yes
configure:12348: checking for library containing opendir
configure:12389: gcc-mp-4.2 -o conftest -O -pipe -I/opt/local/include -D_XOPEN_SOURCE -D_DARWIN_C_SOURCE -L/opt/local/lib conftest.c -ldl -lobjc >&5
configure:12395: $? = 0
configure:12423: result: none required
configure:12517: checking for ANSI C header files
configure:12678: result: yes
configure:12688: checking for sys/wait.h that is POSIX.1 compatible
configure:12724: gcc-mp-4.2 -c -O -pipe -I/opt/local/include -D_XOPEN_SOURCE -D_DARWIN_C_SOURCE conftest.c >&5
configure:12730: $? = 0
configure:12745: result: yes
configure:12796: checking for stdlib.h
configure:12802: result: yes
configure:12796: checking for string.h
configure:12802: result: yes
configure:12796: checking for unistd.h
configure:12802: result: yes
configure:12806: checking limits.h usability
configure:12823: gcc-mp-4.2 -c -O -pipe -I/opt/local/include -D_XOPEN_SOURCE -D_DARWIN_C_SOURCE conftest.c >&5
configure:12829: $? = 0
configure:12843: result: yes
configure:12847: checking limits.h presence
configure:12862: gcc-mp-4.2 -E -D_XOPEN_SOURCE -D_DARWIN_C_SOURCE conftest.c
configure:12868: $? = 0
configure:12882: result: yes
configure:12910: checking for limits.h
configure:12918: result: yes
configure:12806: checking sys/file.h usability
configure:12823: gcc-mp-4.2 -c -O -pipe -I/opt/local/include -D_XOPEN_SOURCE -D_DARWIN_C_SOURCE conftest.c >&5
configure:12829: $? = 0
configure:12843: result: yes
configure:12847: checking sys/file.h presence
configure:12862: gcc-mp-4.2 -E -D_XOPEN_SOURCE -D_DARWIN_C_SOURCE conftest.c
configure:12868: $? = 0
configure:12882: result: yes
configure:12910: checking for sys/file.h
configure:12918: result: yes
configure:12806: checking sys/ioctl.h usability
configure:12823: gcc-mp-4.2 -c -O -pipe -I/opt/local/include -D_XOPEN_SOURCE -D_DARWIN_C_SOURCE conftest.c >&5
configure:12829: $? = 0
configure:12843: result: yes
configure:12847: checking sys/ioctl.h presence
configure:12862: gcc-mp-4.2 -E -D_XOPEN_SOURCE -D_DARWIN_C_SOURCE conftest.c
configure:12868: $? = 0
configure:12882: result: yes
configure:12910: checking for sys/ioctl.h
configure:12918: result: yes
configure:12806: checking sys/syscall.h usability
configure:12823: gcc-mp-4.2 -c -O -pipe -I/opt/local/include -D_XOPEN_SOURCE -D_DARWIN_C_SOURCE conftest.c >&5
configure:12829: $? = 0
configure:12843: result: yes
configure:12847: checking sys/syscall.h presence
configure:12862: gcc-mp-4.2 -E -D_XOPEN_SOURCE -D_DARWIN_C_SOURCE conftest.c
configure:12868: $? = 0
configure:12882: result: yes
configure:12910: checking for sys/syscall.h
configure:12918: result: yes
configure:12806: checking fcntl.h usability
configure:12823: gcc-mp-4.2 -c -O -pipe -I/opt/local/include -D_XOPEN_SOURCE -D_DARWIN_C_SOURCE conftest.c >&5
configure:12829: $? = 0
configure:12843: result: yes
configure:12847: checking fcntl.h presence
configure:12862: gcc-mp-4.2 -E -D_XOPEN_SOURCE -D_DARWIN_C_SOURCE conftest.c
configure:12868: $? = 0
configure:12882: result: yes
configure:12910: checking for fcntl.h
configure:12918: result: yes
configure:12806: checking sys/fcntl.h usability
configure:12823: gcc-mp-4.2 -c -O -pipe -I/opt/local/include -D_XOPEN_SOURCE -D_DARWIN_C_SOURCE conftest.c >&5
configure:12829: $? = 0
configure:12843: result: yes
configure:12847: checking sys/fcntl.h presence
configure:12862: gcc-mp-4.2 -E -D_XOPEN_SOURCE -D_DARWIN_C_SOURCE conftest.c
configure:12868: $? = 0
configure:12882: result: yes
configure:12910: checking for sys/fcntl.h
configure:12918: result: yes
configure:12806: checking sys/select.h usability
configure:12823: gcc-mp-4.2 -c -O -pipe -I/opt/local/include -D_XOPEN_SOURCE -D_DARWIN_C_SOURCE conftest.c >&5
configure:12829: $? = 0
configure:12843: result: yes
configure:12847: checking sys/select.h presence
configure:12862: gcc-mp-4.2 -E -D_XOPEN_SOURCE -D_DARWIN_C_SOURCE conftest.c
configure:12868: $? = 0
configure:12882: result: yes
configure:12910: checking for sys/select.h
configure:12918: result: yes
configure:12806: checking sys/time.h usability
configure:12823: gcc-mp-4.2 -c -O -pipe -I/opt/local/include -D_XOPEN_SOURCE -D_DARWIN_C_SOURCE conftest.c >&5
configure:12829: $? = 0
configure:12843: result: yes
configure:12847: checking sys/time.h presence
configure:12862: gcc-mp-4.2 -E -D_XOPEN_SOURCE -D_DARWIN_C_SOURCE conftest.c
configure:12868: $? = 0
configure:12882: result: yes
configure:12910: checking for sys/time.h
configure:12918: result: yes
configure:12806: checking sys/times.h usability
configure:12823: gcc-mp-4.2 -c -O -pipe -I/opt/local/include -D_XOPEN_SOURCE -D_DARWIN_C_SOURCE conftest.c >&5
configure:12829: $? = 0
configure:12843: result: yes
configure:12847: checking sys/times.h presence
configure:12862: gcc-mp-4.2 -E -D_XOPEN_SOURCE -D_DARWIN_C_SOURCE conftest.c
configure:12868: $? = 0
configure:12882: result: yes
configure:12910: checking for sys/times.h
configure:12918: result: yes
configure:12806: checking sys/param.h usability
configure:12823: gcc-mp-4.2 -c -O -pipe -I/opt/local/include -D_XOPEN_SOURCE -D_DARWIN_C_SOURCE conftest.c >&5
configure:12829: $? = 0
configure:12843: result: yes
configure:12847: checking sys/param.h presence
configure:12862: gcc-mp-4.2 -E -D_XOPEN_SOURCE -D_DARWIN_C_SOURCE conftest.c
configure:12868: $? = 0
configure:12882: result: yes
configure:12910: checking for sys/param.h
configure:12918: result: yes
configure:12806: checking syscall.h usability
configure:12823: gcc-mp-4.2 -c -O -pipe -I/opt/local/include -D_XOPEN_SOURCE -D_DARWIN_C_SOURCE conftest.c >&5
conftest.c:103:21: error: syscall.h: No such file or directory
configure:12829: $? = 1
configure: failed program was:
| /* confdefs.h. */
| #define PACKAGE_NAME ""
| #define PACKAGE_TARNAME ""
| #define PACKAGE_VERSION ""
| #define PACKAGE_STRING ""
| #define PACKAGE_BUGREPORT ""
| #define USE_BUILTIN_FRAME_ADDRESS 1
| #define STDC_HEADERS 1
| #define HAVE_SYS_TYPES_H 1
| #define HAVE_SYS_STAT_H 1
| #define HAVE_STDLIB_H 1
| #define HAVE_STRING_H 1
| #define HAVE_MEMORY_H 1
| #define HAVE_STRINGS_H 1
| #define HAVE_INTTYPES_H 1
| #define HAVE_STDINT_H 1
| #define HAVE_UNISTD_H 1
| #define HAVE_LONG_LONG 1
| #define HAVE_OFF_T 1
| #define SIZEOF_INT 4
| #define SIZEOF_SHORT 2
| #define SIZEOF_LONG 4
| #define SIZEOF_LONG_LONG 8
| #define SIZEOF___INT64 0
| #define SIZEOF_OFF_T 8
| #define SIZEOF_VOIDP 4
| #define SIZEOF_FLOAT 4
| #define SIZEOF_DOUBLE 8
| #define SIZEOF_TIME_T 4
| #define rb_pid_t pid_t
| #define PIDT2NUM(v) LONG2NUM(v)
| #define NUM2PIDT(v) NUM2LONG(v)
| #define rb_uid_t uid_t
| #define UIDT2NUM(v) ULONG2NUM(v)
| #define NUM2UIDT(v) NUM2ULONG(v)
| #define rb_gid_t gid_t
| #define GIDT2NUM(v) ULONG2NUM(v)
| #define NUM2GIDT(v) NUM2ULONG(v)
| #define HAVE_PROTOTYPES 1
| #define TOKEN_PASTE(x,y) x##y
| #define STRINGIZE(expr) STRINGIZE0(expr)
| #define HAVE_STDARG_PROTOTYPES 1
| #define NORETURN(x) __attribute__ ((noreturn)) x
| #define DEPRECATED(x) __attribute__ ((deprecated)) x
| #define NOINLINE(x) __attribute__ ((noinline)) x
| #define FUNC_STDCALL(x) __attribute__ ((stdcall)) x
| #define FUNC_CDECL(x) __attribute__ ((cdecl)) x
| #define FUNC_FASTCALL(x) __attribute__ ((fastcall)) x
| #define HAVE_DECL_SYS_NERR 1
| #define BROKEN_SETREUID 1
| #define BROKEN_SETREGID 1
| #define HAVE_LIBDL 1
| #define HAVE_DIRENT_H 1
| #define STDC_HEADERS 1
| #define HAVE_SYS_WAIT_H 1
| #define HAVE_STDLIB_H 1
| #define HAVE_STRING_H 1
| #define HAVE_UNISTD_H 1
| #define HAVE_LIMITS_H 1
| #define HAVE_SYS_FILE_H 1
| #define HAVE_SYS_IOCTL_H 1
| #define HAVE_SYS_SYSCALL_H 1
| #define HAVE_FCNTL_H 1
| #define HAVE_SYS_FCNTL_H 1
| #define HAVE_SYS_SELECT_H 1
| #define HAVE_SYS_TIME_H 1
| #define HAVE_SYS_TIMES_H 1
| #define HAVE_SYS_PARAM_H 1
| /* end confdefs.h. */
| #include <stdio.h>
| #ifdef HAVE_SYS_TYPES_H
| # include <sys/types.h>
| #endif
| #ifdef HAVE_SYS_STAT_H
| # include <sys/stat.h>
| #endif
| #ifdef STDC_HEADERS
| # include <stdlib.h>
| # include <stddef.h>
| #else
| # ifdef HAVE_STDLIB_H
| # include <stdlib.h>
| # endif
| #endif
| #ifdef HAVE_STRING_H
| # if !defined STDC_HEADERS && defined HAVE_MEMORY_H
| # include <memory.h>
| # endif
| # include <string.h>
| #endif
| #ifdef HAVE_STRINGS_H
| # include <strings.h>
| #endif
| #ifdef HAVE_INTTYPES_H
| # include <inttypes.h>
| #endif
| #ifdef HAVE_STDINT_H
| # include <stdint.h>
| #endif
| #ifdef HAVE_UNISTD_H
| # include <unistd.h>
| #endif
| #include <syscall.h>
configure:12843: result: no
configure:12847: checking syscall.h presence
configure:12862: gcc-mp-4.2 -E -D_XOPEN_SOURCE -D_DARWIN_C_SOURCE conftest.c
conftest.c:70:21: error: syscall.h: No such file or directory
configure:12868: $? = 1
configure: failed program was:
| /* confdefs.h. */
| #define PACKAGE_NAME ""
| #define PACKAGE_TARNAME ""
| #define PACKAGE_VERSION ""
| #define PACKAGE_STRING ""
| #define PACKAGE_BUGREPORT ""
| #define USE_BUILTIN_FRAME_ADDRESS 1
| #define STDC_HEADERS 1
| #define HAVE_SYS_TYPES_H 1
| #define HAVE_SYS_STAT_H 1
| #define HAVE_STDLIB_H 1
| #define HAVE_STRING_H 1
| #define HAVE_MEMORY_H 1
| #define HAVE_STRINGS_H 1
| #define HAVE_INTTYPES_H 1
| #define HAVE_STDINT_H 1
| #define HAVE_UNISTD_H 1
| #define HAVE_LONG_LONG 1
| #define HAVE_OFF_T 1
| #define SIZEOF_INT 4
| #define SIZEOF_SHORT 2
| #define SIZEOF_LONG 4
| #define SIZEOF_LONG_LONG 8
| #define SIZEOF___INT64 0
| #define SIZEOF_OFF_T 8
| #define SIZEOF_VOIDP 4
| #define SIZEOF_FLOAT 4
| #define SIZEOF_DOUBLE 8
| #define SIZEOF_TIME_T 4
| #define rb_pid_t pid_t
| #define PIDT2NUM(v) LONG2NUM(v)
| #define NUM2PIDT(v) NUM2LONG(v)
| #define rb_uid_t uid_t
| #define UIDT2NUM(v) ULONG2NUM(v)
| #define NUM2UIDT(v) NUM2ULONG(v)
| #define rb_gid_t gid_t
| #define GIDT2NUM(v) ULONG2NUM(v)
| #define NUM2GIDT(v) NUM2ULONG(v)
| #define HAVE_PROTOTYPES 1
| #define TOKEN_PASTE(x,y) x##y
| #define STRINGIZE(expr) STRINGIZE0(expr)
| #define HAVE_STDARG_PROTOTYPES 1
| #define NORETURN(x) __attribute__ ((noreturn)) x
| #define DEPRECATED(x) __attribute__ ((deprecated)) x
| #define NOINLINE(x) __attribute__ ((noinline)) x
| #define FUNC_STDCALL(x) __attribute__ ((stdcall)) x
| #define FUNC_CDECL(x) __attribute__ ((cdecl)) x
| #define FUNC_FASTCALL(x) __attribute__ ((fastcall)) x
| #define HAVE_DECL_SYS_NERR 1
| #define BROKEN_SETREUID 1
| #define BROKEN_SETREGID 1
| #define HAVE_LIBDL 1
| #define HAVE_DIRENT_H 1
| #define STDC_HEADERS 1
| #define HAVE_SYS_WAIT_H 1
| #define HAVE_STDLIB_H 1
| #define HAVE_STRING_H 1
| #define HAVE_UNISTD_H 1
| #define HAVE_LIMITS_H 1
| #define HAVE_SYS_FILE_H 1
| #define HAVE_SYS_IOCTL_H 1
| #define HAVE_SYS_SYSCALL_H 1
| #define HAVE_FCNTL_H 1
| #define HAVE_SYS_FCNTL_H 1
| #define HAVE_SYS_SELECT_H 1
| #define HAVE_SYS_TIME_H 1
| #define HAVE_SYS_TIMES_H 1
| #define HAVE_SYS_PARAM_H 1
| /* end confdefs.h. */
| #include <syscall.h>
configure:12882: result: no
configure:12910: checking for syscall.h
configure:12918: result: no
configure:12806: checking pwd.h usability
configure:12823: gcc-mp-4.2 -c -O -pipe -I/opt/local/include -D_XOPEN_SOURCE -D_DARWIN_C_SOURCE conftest.c >&5
configure:12829: $? = 0
configure:12843: result: yes
configure:12847: checking pwd.h presence
configure:12862: gcc-mp-4.2 -E -D_XOPEN_SOURCE -D_DARWIN_C_SOURCE conftest.c
configure:12868: $? = 0
configure:12882: result: yes
configure:12910: checking for pwd.h
configure:12918: result: yes
configure:12806: checking grp.h usability
configure:12823: gcc-mp-4.2 -c -O -pipe -I/opt/local/include -D_XOPEN_SOURCE -D_DARWIN_C_SOURCE conftest.c >&5
configure:12829: $? = 0
configure:12843: result: yes
configure:12847: checking grp.h presence
configure:12862: gcc-mp-4.2 -E -D_XOPEN_SOURCE -D_DARWIN_C_SOURCE conftest.c
configure:12868: $? = 0
configure:12882: result: yes
configure:12910: checking for grp.h
configure:12918: result: yes
configure:12806: checking a.out.h usability
configure:12823: gcc-mp-4.2 -c -O -pipe -I/opt/local/include -D_XOPEN_SOURCE -D_DARWIN_C_SOURCE conftest.c >&5
conftest.c:105:19: error: a.out.h: No such file or directory
configure:12829: $? = 1
configure: failed program was:
| /* confdefs.h. */
| #define PACKAGE_NAME ""
| #define PACKAGE_TARNAME ""
| #define PACKAGE_VERSION ""
| #define PACKAGE_STRING ""
| #define PACKAGE_BUGREPORT ""
| #define USE_BUILTIN_FRAME_ADDRESS 1
| #define STDC_HEADERS 1
| #define HAVE_SYS_TYPES_H 1
| #define HAVE_SYS_STAT_H 1
| #define HAVE_STDLIB_H 1
| #define HAVE_STRING_H 1
| #define HAVE_MEMORY_H 1
| #define HAVE_STRINGS_H 1
| #define HAVE_INTTYPES_H 1
| #define HAVE_STDINT_H 1
| #define HAVE_UNISTD_H 1
| #define HAVE_LONG_LONG 1
| #define HAVE_OFF_T 1
| #define SIZEOF_INT 4
| #define SIZEOF_SHORT 2
| #define SIZEOF_LONG 4
| #define SIZEOF_LONG_LONG 8
| #define SIZEOF___INT64 0
| #define SIZEOF_OFF_T 8
| #define SIZEOF_VOIDP 4
| #define SIZEOF_FLOAT 4
| #define SIZEOF_DOUBLE 8
| #define SIZEOF_TIME_T 4
| #define rb_pid_t pid_t
| #define PIDT2NUM(v) LONG2NUM(v)
| #define NUM2PIDT(v) NUM2LONG(v)
| #define rb_uid_t uid_t
| #define UIDT2NUM(v) ULONG2NUM(v)
| #define NUM2UIDT(v) NUM2ULONG(v)
| #define rb_gid_t gid_t
| #define GIDT2NUM(v) ULONG2NUM(v)
| #define NUM2GIDT(v) NUM2ULONG(v)
| #define HAVE_PROTOTYPES 1
| #define TOKEN_PASTE(x,y) x##y
| #define STRINGIZE(expr) STRINGIZE0(expr)
| #define HAVE_STDARG_PROTOTYPES 1
| #define NORETURN(x) __attribute__ ((noreturn)) x
| #define DEPRECATED(x) __attribute__ ((deprecated)) x
| #define NOINLINE(x) __attribute__ ((noinline)) x
| #define FUNC_STDCALL(x) __attribute__ ((stdcall)) x
| #define FUNC_CDECL(x) __attribute__ ((cdecl)) x
| #define FUNC_FASTCALL(x) __attribute__ ((fastcall)) x
| #define HAVE_DECL_SYS_NERR 1
| #define BROKEN_SETREUID 1
| #define BROKEN_SETREGID 1
| #define HAVE_LIBDL 1
| #define HAVE_DIRENT_H 1
| #define STDC_HEADERS 1
| #define HAVE_SYS_WAIT_H 1
| #define HAVE_STDLIB_H 1
| #define HAVE_STRING_H 1
| #define HAVE_UNISTD_H 1
| #define HAVE_LIMITS_H 1
| #define HAVE_SYS_FILE_H 1
| #define HAVE_SYS_IOCTL_H 1
| #define HAVE_SYS_SYSCALL_H 1
| #define HAVE_FCNTL_H 1
| #define HAVE_SYS_FCNTL_H 1
| #define HAVE_SYS_SELECT_H 1
| #define HAVE_SYS_TIME_H 1
| #define HAVE_SYS_TIMES_H 1
| #define HAVE_SYS_PARAM_H 1
| #define HAVE_PWD_H 1
| #define HAVE_GRP_H 1
| /* end confdefs.h. */
| #include <stdio.h>
| #ifdef HAVE_SYS_TYPES_H
| # include <sys/types.h>
| #endif
| #ifdef HAVE_SYS_STAT_H
| # include <sys/stat.h>
| #endif
| #ifdef STDC_HEADERS
| # include <stdlib.h>
| # include <stddef.h>
| #else
| # ifdef HAVE_STDLIB_H
| # include <stdlib.h>
| # endif
| #endif
| #ifdef HAVE_STRING_H
| # if !defined STDC_HEADERS && defined HAVE_MEMORY_H
| # include <memory.h>
| # endif
| # include <string.h>
| #endif
| #ifdef HAVE_STRINGS_H
| # include <strings.h>
| #endif
| #ifdef HAVE_INTTYPES_H
| # include <inttypes.h>
| #endif
| #ifdef HAVE_STDINT_H
| # include <stdint.h>
| #endif
| #ifdef HAVE_UNISTD_H
| # include <unistd.h>
| #endif
| #include <a.out.h>
configure:12843: result: no
configure:12847: checking a.out.h presence
configure:12862: gcc-mp-4.2 -E -D_XOPEN_SOURCE -D_DARWIN_C_SOURCE conftest.c
conftest.c:72:19: error: a.out.h: No such file or directory
configure:12868: $? = 1
configure: failed program was:
| /* confdefs.h. */
| #define PACKAGE_NAME ""
| #define PACKAGE_TARNAME ""
| #define PACKAGE_VERSION ""
| #define PACKAGE_STRING ""
| #define PACKAGE_BUGREPORT ""
| #define USE_BUILTIN_FRAME_ADDRESS 1
| #define STDC_HEADERS 1
| #define HAVE_SYS_TYPES_H 1
| #define HAVE_SYS_STAT_H 1
| #define HAVE_STDLIB_H 1
| #define HAVE_STRING_H 1
| #define HAVE_MEMORY_H 1
| #define HAVE_STRINGS_H 1
| #define HAVE_INTTYPES_H 1
| #define HAVE_STDINT_H 1
| #define HAVE_UNISTD_H 1
| #define HAVE_LONG_LONG 1
| #define HAVE_OFF_T 1
| #define SIZEOF_INT 4
| #define SIZEOF_SHORT 2
| #define SIZEOF_LONG 4
| #define SIZEOF_LONG_LONG 8
| #define SIZEOF___INT64 0
| #define SIZEOF_OFF_T 8
| #define SIZEOF_VOIDP 4
| #define SIZEOF_FLOAT 4
| #define SIZEOF_DOUBLE 8
| #define SIZEOF_TIME_T 4
| #define rb_pid_t pid_t
| #define PIDT2NUM(v) LONG2NUM(v)
| #define NUM2PIDT(v) NUM2LONG(v)
| #define rb_uid_t uid_t
| #define UIDT2NUM(v) ULONG2NUM(v)
| #define NUM2UIDT(v) NUM2ULONG(v)
| #define rb_gid_t gid_t
| #define GIDT2NUM(v) ULONG2NUM(v)
| #define NUM2GIDT(v) NUM2ULONG(v)
| #define HAVE_PROTOTYPES 1
| #define TOKEN_PASTE(x,y) x##y
| #define STRINGIZE(expr) STRINGIZE0(expr)
| #define HAVE_STDARG_PROTOTYPES 1
| #define NORETURN(x) __attribute__ ((noreturn)) x
| #define DEPRECATED(x) __attribute__ ((deprecated)) x
| #define NOINLINE(x) __attribute__ ((noinline)) x
| #define FUNC_STDCALL(x) __attribute__ ((stdcall)) x
| #define FUNC_CDECL(x) __attribute__ ((cdecl)) x
| #define FUNC_FASTCALL(x) __attribute__ ((fastcall)) x
| #define HAVE_DECL_SYS_NERR 1
| #define BROKEN_SETREUID 1
| #define BROKEN_SETREGID 1
| #define HAVE_LIBDL 1
| #define HAVE_DIRENT_H 1
| #define STDC_HEADERS 1
| #define HAVE_SYS_WAIT_H 1
| #define HAVE_STDLIB_H 1
| #define HAVE_STRING_H 1
| #define HAVE_UNISTD_H 1
| #define HAVE_LIMITS_H 1
| #define HAVE_SYS_FILE_H 1
| #define HAVE_SYS_IOCTL_H 1
| #define HAVE_SYS_SYSCALL_H 1
| #define HAVE_FCNTL_H 1
| #define HAVE_SYS_FCNTL_H 1
| #define HAVE_SYS_SELECT_H 1
| #define HAVE_SYS_TIME_H 1
| #define HAVE_SYS_TIMES_H 1
| #define HAVE_SYS_PARAM_H 1
| #define HAVE_PWD_H 1
| #define HAVE_GRP_H 1
| /* end confdefs.h. */
| #include <a.out.h>
configure:12882: result: no
configure:12910: checking for a.out.h
configure:12918: result: no
configure:12806: checking utime.h usability
configure:12823: gcc-mp-4.2 -c -O -pipe -I/opt/local/include -D_XOPEN_SOURCE -D_DARWIN_C_SOURCE conftest.c >&5
configure:12829: $? = 0
configure:12843: result: yes
configure:12847: checking utime.h presence
configure:12862: gcc-mp-4.2 -E -D_XOPEN_SOURCE -D_DARWIN_C_SOURCE conftest.c
configure:12868: $? = 0
configure:12882: result: yes
configure:12910: checking for utime.h
configure:12918: result: yes
configure:12796: checking for memory.h
configure:12802: result: yes
configure:12806: checking direct.h usability
configure:12823: gcc-mp-4.2 -c -O -pipe -I/opt/local/include -D_XOPEN_SOURCE -D_DARWIN_C_SOURCE conftest.c >&5
conftest.c:107:20: error: direct.h: No such file or directory
configure:12829: $? = 1
configure: failed program was:
| /* confdefs.h. */
| #define PACKAGE_NAME ""
| #define PACKAGE_TARNAME ""
| #define PACKAGE_VERSION ""
| #define PACKAGE_STRING ""
| #define PACKAGE_BUGREPORT ""
| #define USE_BUILTIN_FRAME_ADDRESS 1
| #define STDC_HEADERS 1
| #define HAVE_SYS_TYPES_H 1
| #define HAVE_SYS_STAT_H 1
| #define HAVE_STDLIB_H 1
| #define HAVE_STRING_H 1
| #define HAVE_MEMORY_H 1
| #define HAVE_STRINGS_H 1
| #define HAVE_INTTYPES_H 1
| #define HAVE_STDINT_H 1
| #define HAVE_UNISTD_H 1
| #define HAVE_LONG_LONG 1
| #define HAVE_OFF_T 1
| #define SIZEOF_INT 4
| #define SIZEOF_SHORT 2
| #define SIZEOF_LONG 4
| #define SIZEOF_LONG_LONG 8
| #define SIZEOF___INT64 0
| #define SIZEOF_OFF_T 8
| #define SIZEOF_VOIDP 4
| #define SIZEOF_FLOAT 4
| #define SIZEOF_DOUBLE 8
| #define SIZEOF_TIME_T 4
| #define rb_pid_t pid_t
| #define PIDT2NUM(v) LONG2NUM(v)
| #define NUM2PIDT(v) NUM2LONG(v)
| #define rb_uid_t uid_t
| #define UIDT2NUM(v) ULONG2NUM(v)
| #define NUM2UIDT(v) NUM2ULONG(v)
| #define rb_gid_t gid_t
| #define GIDT2NUM(v) ULONG2NUM(v)
| #define NUM2GIDT(v) NUM2ULONG(v)
| #define HAVE_PROTOTYPES 1
| #define TOKEN_PASTE(x,y) x##y
| #define STRINGIZE(expr) STRINGIZE0(expr)
| #define HAVE_STDARG_PROTOTYPES 1
| #define NORETURN(x) __attribute__ ((noreturn)) x
| #define DEPRECATED(x) __attribute__ ((deprecated)) x
| #define NOINLINE(x) __attribute__ ((noinline)) x
| #define FUNC_STDCALL(x) __attribute__ ((stdcall)) x
| #define FUNC_CDECL(x) __attribute__ ((cdecl)) x
| #define FUNC_FASTCALL(x) __attribute__ ((fastcall)) x
| #define HAVE_DECL_SYS_NERR 1
| #define BROKEN_SETREUID 1
| #define BROKEN_SETREGID 1
| #define HAVE_LIBDL 1
| #define HAVE_DIRENT_H 1
| #define STDC_HEADERS 1
| #define HAVE_SYS_WAIT_H 1
| #define HAVE_STDLIB_H 1
| #define HAVE_STRING_H 1
| #define HAVE_UNISTD_H 1
| #define HAVE_LIMITS_H 1
| #define HAVE_SYS_FILE_H 1
| #define HAVE_SYS_IOCTL_H 1
| #define HAVE_SYS_SYSCALL_H 1
| #define HAVE_FCNTL_H 1
| #define HAVE_SYS_FCNTL_H 1
| #define HAVE_SYS_SELECT_H 1
| #define HAVE_SYS_TIME_H 1
| #define HAVE_SYS_TIMES_H 1
| #define HAVE_SYS_PARAM_H 1
| #define HAVE_PWD_H 1
| #define HAVE_GRP_H 1
| #define HAVE_UTIME_H 1
| #define HAVE_MEMORY_H 1
| /* end confdefs.h. */
| #include <stdio.h>
| #ifdef HAVE_SYS_TYPES_H
| # include <sys/types.h>
| #endif
| #ifdef HAVE_SYS_STAT_H
| # include <sys/stat.h>
| #endif
| #ifdef STDC_HEADERS
| # include <stdlib.h>
| # include <stddef.h>
| #else
| # ifdef HAVE_STDLIB_H
| # include <stdlib.h>
| # endif
| #endif
| #ifdef HAVE_STRING_H
| # if !defined STDC_HEADERS && defined HAVE_MEMORY_H
| # include <memory.h>
| # endif
| # include <string.h>
| #endif
| #ifdef HAVE_STRINGS_H
| # include <strings.h>
| #endif
| #ifdef HAVE_INTTYPES_H
| # include <inttypes.h>
| #endif
| #ifdef HAVE_STDINT_H
| # include <stdint.h>
| #endif
| #ifdef HAVE_UNISTD_H
| # include <unistd.h>
| #endif
| #include <direct.h>
configure:12843: result: no
configure:12847: checking direct.h presence
configure:12862: gcc-mp-4.2 -E -D_XOPEN_SOURCE -D_DARWIN_C_SOURCE conftest.c
conftest.c:74:20: error: direct.h: No such file or directory
configure:12868: $? = 1
configure: failed program was:
| /* confdefs.h. */
| #define PACKAGE_NAME ""
| #define PACKAGE_TARNAME ""
| #define PACKAGE_VERSION ""
| #define PACKAGE_STRING ""
| #define PACKAGE_BUGREPORT ""
| #define USE_BUILTIN_FRAME_ADDRESS 1
| #define STDC_HEADERS 1
| #define HAVE_SYS_TYPES_H 1
| #define HAVE_SYS_STAT_H 1
| #define HAVE_STDLIB_H 1
| #define HAVE_STRING_H 1
| #define HAVE_MEMORY_H 1
| #define HAVE_STRINGS_H 1
| #define HAVE_INTTYPES_H 1
| #define HAVE_STDINT_H 1
| #define HAVE_UNISTD_H 1
| #define HAVE_LONG_LONG 1
| #define HAVE_OFF_T 1
| #define SIZEOF_INT 4
| #define SIZEOF_SHORT 2
| #define SIZEOF_LONG 4
| #define SIZEOF_LONG_LONG 8
| #define SIZEOF___INT64 0
| #define SIZEOF_OFF_T 8
| #define SIZEOF_VOIDP 4
| #define SIZEOF_FLOAT 4
| #define SIZEOF_DOUBLE 8
| #define SIZEOF_TIME_T 4
| #define rb_pid_t pid_t
| #define PIDT2NUM(v) LONG2NUM(v)
| #define NUM2PIDT(v) NUM2LONG(v)
| #define rb_uid_t uid_t
| #define UIDT2NUM(v) ULONG2NUM(v)
| #define NUM2UIDT(v) NUM2ULONG(v)
| #define rb_gid_t gid_t
| #define GIDT2NUM(v) ULONG2NUM(v)
| #define NUM2GIDT(v) NUM2ULONG(v)
| #define HAVE_PROTOTYPES 1
| #define TOKEN_PASTE(x,y) x##y
| #define STRINGIZE(expr) STRINGIZE0(expr)
| #define HAVE_STDARG_PROTOTYPES 1
| #define NORETURN(x) __attribute__ ((noreturn)) x
| #define DEPRECATED(x) __attribute__ ((deprecated)) x
| #define NOINLINE(x) __attribute__ ((noinline)) x
| #define FUNC_STDCALL(x) __attribute__ ((stdcall)) x
| #define FUNC_CDECL(x) __attribute__ ((cdecl)) x
| #define FUNC_FASTCALL(x) __attribute__ ((fastcall)) x
| #define HAVE_DECL_SYS_NERR 1
| #define BROKEN_SETREUID 1
| #define BROKEN_SETREGID 1
| #define HAVE_LIBDL 1
| #define HAVE_DIRENT_H 1
| #define STDC_HEADERS 1
| #define HAVE_SYS_WAIT_H 1
| #define HAVE_STDLIB_H 1
| #define HAVE_STRING_H 1
| #define HAVE_UNISTD_H 1
| #define HAVE_LIMITS_H 1
| #define HAVE_SYS_FILE_H 1
| #define HAVE_SYS_IOCTL_H 1
| #define HAVE_SYS_SYSCALL_H 1
| #define HAVE_FCNTL_H 1
| #define HAVE_SYS_FCNTL_H 1
| #define HAVE_SYS_SELECT_H 1
| #define HAVE_SYS_TIME_H 1
| #define HAVE_SYS_TIMES_H 1
| #define HAVE_SYS_PARAM_H 1
| #define HAVE_PWD_H 1
| #define HAVE_GRP_H 1
| #define HAVE_UTIME_H 1
| #define HAVE_MEMORY_H 1
| /* end confdefs.h. */
| #include <direct.h>
configure:12882: result: no
configure:12910: checking for direct.h
configure:12918: result: no
configure:12806: checking sys/resource.h usability
configure:12823: gcc-mp-4.2 -c -O -pipe -I/opt/local/include -D_XOPEN_SOURCE -D_DARWIN_C_SOURCE conftest.c >&5
configure:12829: $? = 0
configure:12843: result: yes
configure:12847: checking sys/resource.h presence
configure:12862: gcc-mp-4.2 -E -D_XOPEN_SOURCE -D_DARWIN_C_SOURCE conftest.c
configure:12868: $? = 0
configure:12882: result: yes
configure:12910: checking for sys/resource.h
configure:12918: result: yes
configure:12806: checking sys/mkdev.h usability
configure:12823: gcc-mp-4.2 -c -O -pipe -I/opt/local/include -D_XOPEN_SOURCE -D_DARWIN_C_SOURCE conftest.c >&5
conftest.c:108:23: error: sys/mkdev.h: No such file or directory
configure:12829: $? = 1
configure: failed program was:
| /* confdefs.h. */
| #define PACKAGE_NAME ""
| #define PACKAGE_TARNAME ""
| #define PACKAGE_VERSION ""
| #define PACKAGE_STRING ""
| #define PACKAGE_BUGREPORT ""
| #define USE_BUILTIN_FRAME_ADDRESS 1
| #define STDC_HEADERS 1
| #define HAVE_SYS_TYPES_H 1
| #define HAVE_SYS_STAT_H 1
| #define HAVE_STDLIB_H 1
| #define HAVE_STRING_H 1
| #define HAVE_MEMORY_H 1
| #define HAVE_STRINGS_H 1
| #define HAVE_INTTYPES_H 1
| #define HAVE_STDINT_H 1
| #define HAVE_UNISTD_H 1
| #define HAVE_LONG_LONG 1
| #define HAVE_OFF_T 1
| #define SIZEOF_INT 4
| #define SIZEOF_SHORT 2
| #define SIZEOF_LONG 4
| #define SIZEOF_LONG_LONG 8
| #define SIZEOF___INT64 0
| #define SIZEOF_OFF_T 8
| #define SIZEOF_VOIDP 4
| #define SIZEOF_FLOAT 4
| #define SIZEOF_DOUBLE 8
| #define SIZEOF_TIME_T 4
| #define rb_pid_t pid_t
| #define PIDT2NUM(v) LONG2NUM(v)
| #define NUM2PIDT(v) NUM2LONG(v)
| #define rb_uid_t uid_t
| #define UIDT2NUM(v) ULONG2NUM(v)
| #define NUM2UIDT(v) NUM2ULONG(v)
| #define rb_gid_t gid_t
| #define GIDT2NUM(v) ULONG2NUM(v)
| #define NUM2GIDT(v) NUM2ULONG(v)
| #define HAVE_PROTOTYPES 1
| #define TOKEN_PASTE(x,y) x##y
| #define STRINGIZE(expr) STRINGIZE0(expr)
| #define HAVE_STDARG_PROTOTYPES 1
| #define NORETURN(x) __attribute__ ((noreturn)) x
| #define DEPRECATED(x) __attribute__ ((deprecated)) x
| #define NOINLINE(x) __attribute__ ((noinline)) x
| #define FUNC_STDCALL(x) __attribute__ ((stdcall)) x
| #define FUNC_CDECL(x) __attribute__ ((cdecl)) x
| #define FUNC_FASTCALL(x) __attribute__ ((fastcall)) x
| #define HAVE_DECL_SYS_NERR 1
| #define BROKEN_SETREUID 1
| #define BROKEN_SETREGID 1
| #define HAVE_LIBDL 1
| #define HAVE_DIRENT_H 1
| #define STDC_HEADERS 1
| #define HAVE_SYS_WAIT_H 1
| #define HAVE_STDLIB_H 1
| #define HAVE_STRING_H 1
| #define HAVE_UNISTD_H 1
| #define HAVE_LIMITS_H 1
| #define HAVE_SYS_FILE_H 1
| #define HAVE_SYS_IOCTL_H 1
| #define HAVE_SYS_SYSCALL_H 1
| #define HAVE_FCNTL_H 1
| #define HAVE_SYS_FCNTL_H 1
| #define HAVE_SYS_SELECT_H 1
| #define HAVE_SYS_TIME_H 1
| #define HAVE_SYS_TIMES_H 1
| #define HAVE_SYS_PARAM_H 1
| #define HAVE_PWD_H 1
| #define HAVE_GRP_H 1
| #define HAVE_UTIME_H 1
| #define HAVE_MEMORY_H 1
| #define HAVE_SYS_RESOURCE_H 1
| /* end confdefs.h. */
| #include <stdio.h>
| #ifdef HAVE_SYS_TYPES_H
| # include <sys/types.h>
| #endif
| #ifdef HAVE_SYS_STAT_H
| # include <sys/stat.h>
| #endif
| #ifdef STDC_HEADERS
| # include <stdlib.h>
| # include <stddef.h>
| #else
| # ifdef HAVE_STDLIB_H
| # include <stdlib.h>
| # endif
| #endif
| #ifdef HAVE_STRING_H
| # if !defined STDC_HEADERS && defined HAVE_MEMORY_H
| # include <memory.h>
| # endif
| # include <string.h>
| #endif
| #ifdef HAVE_STRINGS_H
| # include <strings.h>
| #endif
| #ifdef HAVE_INTTYPES_H
| # include <inttypes.h>
| #endif
| #ifdef HAVE_STDINT_H
| # include <stdint.h>
| #endif
| #ifdef HAVE_UNISTD_H
| # include <unistd.h>
| #endif
| #include <sys/mkdev.h>
configure:12843: result: no
configure:12847: checking sys/mkdev.h presence
configure:12862: gcc-mp-4.2 -E -D_XOPEN_SOURCE -D_DARWIN_C_SOURCE conftest.c
conftest.c:75:23: error: sys/mkdev.h: No such file or directory
configure:12868: $? = 1
configure: failed program was:
| /* confdefs.h. */
| #define PACKAGE_NAME ""
| #define PACKAGE_TARNAME ""
| #define PACKAGE_VERSION ""
| #define PACKAGE_STRING ""
| #define PACKAGE_BUGREPORT ""
| #define USE_BUILTIN_FRAME_ADDRESS 1
| #define STDC_HEADERS 1
| #define HAVE_SYS_TYPES_H 1
| #define HAVE_SYS_STAT_H 1
| #define HAVE_STDLIB_H 1
| #define HAVE_STRING_H 1
| #define HAVE_MEMORY_H 1
| #define HAVE_STRINGS_H 1
| #define HAVE_INTTYPES_H 1
| #define HAVE_STDINT_H 1
| #define HAVE_UNISTD_H 1
| #define HAVE_LONG_LONG 1
| #define HAVE_OFF_T 1
| #define SIZEOF_INT 4
| #define SIZEOF_SHORT 2
| #define SIZEOF_LONG 4
| #define SIZEOF_LONG_LONG 8
| #define SIZEOF___INT64 0
| #define SIZEOF_OFF_T 8
| #define SIZEOF_VOIDP 4
| #define SIZEOF_FLOAT 4
| #define SIZEOF_DOUBLE 8
| #define SIZEOF_TIME_T 4
| #define rb_pid_t pid_t
| #define PIDT2NUM(v) LONG2NUM(v)
| #define NUM2PIDT(v) NUM2LONG(v)
| #define rb_uid_t uid_t
| #define UIDT2NUM(v) ULONG2NUM(v)
| #define NUM2UIDT(v) NUM2ULONG(v)
| #define rb_gid_t gid_t
| #define GIDT2NUM(v) ULONG2NUM(v)
| #define NUM2GIDT(v) NUM2ULONG(v)
| #define HAVE_PROTOTYPES 1
| #define TOKEN_PASTE(x,y) x##y
| #define STRINGIZE(expr) STRINGIZE0(expr)
| #define HAVE_STDARG_PROTOTYPES 1
| #define NORETURN(x) __attribute__ ((noreturn)) x
| #define DEPRECATED(x) __attribute__ ((deprecated)) x
| #define NOINLINE(x) __attribute__ ((noinline)) x
| #define FUNC_STDCALL(x) __attribute__ ((stdcall)) x
| #define FUNC_CDECL(x) __attribute__ ((cdecl)) x
| #define FUNC_FASTCALL(x) __attribute__ ((fastcall)) x
| #define HAVE_DECL_SYS_NERR 1
| #define BROKEN_SETREUID 1
| #define BROKEN_SETREGID 1
| #define HAVE_LIBDL 1
| #define HAVE_DIRENT_H 1
| #define STDC_HEADERS 1
| #define HAVE_SYS_WAIT_H 1
| #define HAVE_STDLIB_H 1
| #define HAVE_STRING_H 1
| #define HAVE_UNISTD_H 1
| #define HAVE_LIMITS_H 1
| #define HAVE_SYS_FILE_H 1
| #define HAVE_SYS_IOCTL_H 1
| #define HAVE_SYS_SYSCALL_H 1
| #define HAVE_FCNTL_H 1
| #define HAVE_SYS_FCNTL_H 1
| #define HAVE_SYS_SELECT_H 1
| #define HAVE_SYS_TIME_H 1
| #define HAVE_SYS_TIMES_H 1
| #define HAVE_SYS_PARAM_H 1
| #define HAVE_PWD_H 1
| #define HAVE_GRP_H 1
| #define HAVE_UTIME_H 1
| #define HAVE_MEMORY_H 1
| #define HAVE_SYS_RESOURCE_H 1
| /* end confdefs.h. */
| #include <sys/mkdev.h>
configure:12882: result: no
configure:12910: checking for sys/mkdev.h
configure:12918: result: no
configure:12806: checking sys/utime.h usability
configure:12823: gcc-mp-4.2 -c -O -pipe -I/opt/local/include -D_XOPEN_SOURCE -D_DARWIN_C_SOURCE conftest.c >&5
conftest.c:108:23: error: sys/utime.h: No such file or directory
configure:12829: $? = 1
configure: failed program was:
| /* confdefs.h. */
| #define PACKAGE_NAME ""
| #define PACKAGE_TARNAME ""
| #define PACKAGE_VERSION ""
| #define PACKAGE_STRING ""
| #define PACKAGE_BUGREPORT ""
| #define USE_BUILTIN_FRAME_ADDRESS 1
| #define STDC_HEADERS 1
| #define HAVE_SYS_TYPES_H 1
| #define HAVE_SYS_STAT_H 1
| #define HAVE_STDLIB_H 1
| #define HAVE_STRING_H 1
| #define HAVE_MEMORY_H 1
| #define HAVE_STRINGS_H 1
| #define HAVE_INTTYPES_H 1
| #define HAVE_STDINT_H 1
| #define HAVE_UNISTD_H 1
| #define HAVE_LONG_LONG 1
| #define HAVE_OFF_T 1
| #define SIZEOF_INT 4
| #define SIZEOF_SHORT 2
| #define SIZEOF_LONG 4
| #define SIZEOF_LONG_LONG 8
| #define SIZEOF___INT64 0
| #define SIZEOF_OFF_T 8
| #define SIZEOF_VOIDP 4
| #define SIZEOF_FLOAT 4
| #define SIZEOF_DOUBLE 8
| #define SIZEOF_TIME_T 4
| #define rb_pid_t pid_t
| #define PIDT2NUM(v) LONG2NUM(v)
| #define NUM2PIDT(v) NUM2LONG(v)
| #define rb_uid_t uid_t
| #define UIDT2NUM(v) ULONG2NUM(v)
| #define NUM2UIDT(v) NUM2ULONG(v)
| #define rb_gid_t gid_t
| #define GIDT2NUM(v) ULONG2NUM(v)
| #define NUM2GIDT(v) NUM2ULONG(v)
| #define HAVE_PROTOTYPES 1
| #define TOKEN_PASTE(x,y) x##y
| #define STRINGIZE(expr) STRINGIZE0(expr)
| #define HAVE_STDARG_PROTOTYPES 1
| #define NORETURN(x) __attribute__ ((noreturn)) x
| #define DEPRECATED(x) __attribute__ ((deprecated)) x
| #define NOINLINE(x) __attribute__ ((noinline)) x
| #define FUNC_STDCALL(x) __attribute__ ((stdcall)) x
| #define FUNC_CDECL(x) __attribute__ ((cdecl)) x
| #define FUNC_FASTCALL(x) __attribute__ ((fastcall)) x
| #define HAVE_DECL_SYS_NERR 1
| #define BROKEN_SETREUID 1
| #define BROKEN_SETREGID 1
| #define HAVE_LIBDL 1
| #define HAVE_DIRENT_H 1
| #define STDC_HEADERS 1
| #define HAVE_SYS_WAIT_H 1
| #define HAVE_STDLIB_H 1
| #define HAVE_STRING_H 1
| #define HAVE_UNISTD_H 1
| #define HAVE_LIMITS_H 1
| #define HAVE_SYS_FILE_H 1
| #define HAVE_SYS_IOCTL_H 1
| #define HAVE_SYS_SYSCALL_H 1
| #define HAVE_FCNTL_H 1
| #define HAVE_SYS_FCNTL_H 1
| #define HAVE_SYS_SELECT_H 1
| #define HAVE_SYS_TIME_H 1
| #define HAVE_SYS_TIMES_H 1
| #define HAVE_SYS_PARAM_H 1
| #define HAVE_PWD_H 1
| #define HAVE_GRP_H 1
| #define HAVE_UTIME_H 1
| #define HAVE_MEMORY_H 1
| #define HAVE_SYS_RESOURCE_H 1
| /* end confdefs.h. */
| #include <stdio.h>
| #ifdef HAVE_SYS_TYPES_H
| # include <sys/types.h>
| #endif
| #ifdef HAVE_SYS_STAT_H
| # include <sys/stat.h>
| #endif
| #ifdef STDC_HEADERS
| # include <stdlib.h>
| # include <stddef.h>
| #else
| # ifdef HAVE_STDLIB_H
| # include <stdlib.h>
| # endif
| #endif
| #ifdef HAVE_STRING_H
| # if !defined STDC_HEADERS && defined HAVE_MEMORY_H
| # include <memory.h>
| # endif
| # include <string.h>
| #endif
| #ifdef HAVE_STRINGS_H
| # include <strings.h>
| #endif
| #ifdef HAVE_INTTYPES_H
| # include <inttypes.h>
| #endif
| #ifdef HAVE_STDINT_H
| # include <stdint.h>
| #endif
| #ifdef HAVE_UNISTD_H
| # include <unistd.h>
| #endif
| #include <sys/utime.h>
configure:12843: result: no
configure:12847: checking sys/utime.h presence
configure:12862: gcc-mp-4.2 -E -D_XOPEN_SOURCE -D_DARWIN_C_SOURCE conftest.c
conftest.c:75:23: error: sys/utime.h: No such file or directory
configure:12868: $? = 1
configure: failed program was:
| /* confdefs.h. */
| #define PACKAGE_NAME ""
| #define PACKAGE_TARNAME ""
| #define PACKAGE_VERSION ""
| #define PACKAGE_STRING ""
| #define PACKAGE_BUGREPORT ""
| #define USE_BUILTIN_FRAME_ADDRESS 1
| #define STDC_HEADERS 1
| #define HAVE_SYS_TYPES_H 1
| #define HAVE_SYS_STAT_H 1
| #define HAVE_STDLIB_H 1
| #define HAVE_STRING_H 1
| #define HAVE_MEMORY_H 1
| #define HAVE_STRINGS_H 1
| #define HAVE_INTTYPES_H 1
| #define HAVE_STDINT_H 1
| #define HAVE_UNISTD_H 1
| #define HAVE_LONG_LONG 1
| #define HAVE_OFF_T 1
| #define SIZEOF_INT 4
| #define SIZEOF_SHORT 2
| #define SIZEOF_LONG 4
| #define SIZEOF_LONG_LONG 8
| #define SIZEOF___INT64 0
| #define SIZEOF_OFF_T 8
| #define SIZEOF_VOIDP 4
| #define SIZEOF_FLOAT 4
| #define SIZEOF_DOUBLE 8
| #define SIZEOF_TIME_T 4
| #define rb_pid_t pid_t
| #define PIDT2NUM(v) LONG2NUM(v)
| #define NUM2PIDT(v) NUM2LONG(v)
| #define rb_uid_t uid_t
| #define UIDT2NUM(v) ULONG2NUM(v)
| #define NUM2UIDT(v) NUM2ULONG(v)
| #define rb_gid_t gid_t
| #define GIDT2NUM(v) ULONG2NUM(v)
| #define NUM2GIDT(v) NUM2ULONG(v)
| #define HAVE_PROTOTYPES 1
| #define TOKEN_PASTE(x,y) x##y
| #define STRINGIZE(expr) STRINGIZE0(expr)
| #define HAVE_STDARG_PROTOTYPES 1
| #define NORETURN(x) __attribute__ ((noreturn)) x
| #define DEPRECATED(x) __attribute__ ((deprecated)) x
| #define NOINLINE(x) __attribute__ ((noinline)) x
| #define FUNC_STDCALL(x) __attribute__ ((stdcall)) x
| #define FUNC_CDECL(x) __attribute__ ((cdecl)) x
| #define FUNC_FASTCALL(x) __attribute__ ((fastcall)) x
| #define HAVE_DECL_SYS_NERR 1
| #define BROKEN_SETREUID 1
| #define BROKEN_SETREGID 1
| #define HAVE_LIBDL 1
| #define HAVE_DIRENT_H 1
| #define STDC_HEADERS 1
| #define HAVE_SYS_WAIT_H 1
| #define HAVE_STDLIB_H 1
| #define HAVE_STRING_H 1
| #define HAVE_UNISTD_H 1
| #define HAVE_LIMITS_H 1
| #define HAVE_SYS_FILE_H 1
| #define HAVE_SYS_IOCTL_H 1
| #define HAVE_SYS_SYSCALL_H 1
| #define HAVE_FCNTL_H 1
| #define HAVE_SYS_FCNTL_H 1
| #define HAVE_SYS_SELECT_H 1
| #define HAVE_SYS_TIME_H 1
| #define HAVE_SYS_TIMES_H 1
| #define HAVE_SYS_PARAM_H 1
| #define HAVE_PWD_H 1
| #define HAVE_GRP_H 1
| #define HAVE_UTIME_H 1
| #define HAVE_MEMORY_H 1
| #define HAVE_SYS_RESOURCE_H 1
| /* end confdefs.h. */
| #include <sys/utime.h>
configure:12882: result: no
configure:12910: checking for sys/utime.h
configure:12918: result: no
configure:12806: checking xti.h usability
configure:12823: gcc-mp-4.2 -c -O -pipe -I/opt/local/include -D_XOPEN_SOURCE -D_DARWIN_C_SOURCE conftest.c >&5
conftest.c:108:17: error: xti.h: No such file or directory
configure:12829: $? = 1
configure: failed program was:
| /* confdefs.h. */
| #define PACKAGE_NAME ""
| #define PACKAGE_TARNAME ""
| #define PACKAGE_VERSION ""
| #define PACKAGE_STRING ""
| #define PACKAGE_BUGREPORT ""
| #define USE_BUILTIN_FRAME_ADDRESS 1
| #define STDC_HEADERS 1
| #define HAVE_SYS_TYPES_H 1
| #define HAVE_SYS_STAT_H 1
| #define HAVE_STDLIB_H 1
| #define HAVE_STRING_H 1
| #define HAVE_MEMORY_H 1
| #define HAVE_STRINGS_H 1
| #define HAVE_INTTYPES_H 1
| #define HAVE_STDINT_H 1
| #define HAVE_UNISTD_H 1
| #define HAVE_LONG_LONG 1
| #define HAVE_OFF_T 1
| #define SIZEOF_INT 4
| #define SIZEOF_SHORT 2
| #define SIZEOF_LONG 4
| #define SIZEOF_LONG_LONG 8
| #define SIZEOF___INT64 0
| #define SIZEOF_OFF_T 8
| #define SIZEOF_VOIDP 4
| #define SIZEOF_FLOAT 4
| #define SIZEOF_DOUBLE 8
| #define SIZEOF_TIME_T 4
| #define rb_pid_t pid_t
| #define PIDT2NUM(v) LONG2NUM(v)
| #define NUM2PIDT(v) NUM2LONG(v)
| #define rb_uid_t uid_t
| #define UIDT2NUM(v) ULONG2NUM(v)
| #define NUM2UIDT(v) NUM2ULONG(v)
| #define rb_gid_t gid_t
| #define GIDT2NUM(v) ULONG2NUM(v)
| #define NUM2GIDT(v) NUM2ULONG(v)
| #define HAVE_PROTOTYPES 1
| #define TOKEN_PASTE(x,y) x##y
| #define STRINGIZE(expr) STRINGIZE0(expr)
| #define HAVE_STDARG_PROTOTYPES 1
| #define NORETURN(x) __attribute__ ((noreturn)) x
| #define DEPRECATED(x) __attribute__ ((deprecated)) x
| #define NOINLINE(x) __attribute__ ((noinline)) x
| #define FUNC_STDCALL(x) __attribute__ ((stdcall)) x
| #define FUNC_CDECL(x) __attribute__ ((cdecl)) x
| #define FUNC_FASTCALL(x) __attribute__ ((fastcall)) x
| #define HAVE_DECL_SYS_NERR 1
| #define BROKEN_SETREUID 1
| #define BROKEN_SETREGID 1
| #define HAVE_LIBDL 1
| #define HAVE_DIRENT_H 1
| #define STDC_HEADERS 1
| #define HAVE_SYS_WAIT_H 1
| #define HAVE_STDLIB_H 1
| #define HAVE_STRING_H 1
| #define HAVE_UNISTD_H 1
| #define HAVE_LIMITS_H 1
| #define HAVE_SYS_FILE_H 1
| #define HAVE_SYS_IOCTL_H 1
| #define HAVE_SYS_SYSCALL_H 1
| #define HAVE_FCNTL_H 1
| #define HAVE_SYS_FCNTL_H 1
| #define HAVE_SYS_SELECT_H 1
| #define HAVE_SYS_TIME_H 1
| #define HAVE_SYS_TIMES_H 1
| #define HAVE_SYS_PARAM_H 1
| #define HAVE_PWD_H 1
| #define HAVE_GRP_H 1
| #define HAVE_UTIME_H 1
| #define HAVE_MEMORY_H 1
| #define HAVE_SYS_RESOURCE_H 1
| /* end confdefs.h. */
| #include <stdio.h>
| #ifdef HAVE_SYS_TYPES_H
| # include <sys/types.h>
| #endif
| #ifdef HAVE_SYS_STAT_H
| # include <sys/stat.h>
| #endif
| #ifdef STDC_HEADERS
| # include <stdlib.h>
| # include <stddef.h>
| #else
| # ifdef HAVE_STDLIB_H
| # include <stdlib.h>
| # endif
| #endif
| #ifdef HAVE_STRING_H
| # if !defined STDC_HEADERS && defined HAVE_MEMORY_H
| # include <memory.h>
| # endif
| # include <string.h>
| #endif
| #ifdef HAVE_STRINGS_H
| # include <strings.h>
| #endif
| #ifdef HAVE_INTTYPES_H
| # include <inttypes.h>
| #endif
| #ifdef HAVE_STDINT_H
| # include <stdint.h>
| #endif
| #ifdef HAVE_UNISTD_H
| # include <unistd.h>
| #endif
| #include <xti.h>
configure:12843: result: no
configure:12847: checking xti.h presence
configure:12862: gcc-mp-4.2 -E -D_XOPEN_SOURCE -D_DARWIN_C_SOURCE conftest.c
conftest.c:75:17: error: xti.h: No such file or directory
configure:12868: $? = 1
configure: failed program was:
| /* confdefs.h. */
| #define PACKAGE_NAME ""
| #define PACKAGE_TARNAME ""
| #define PACKAGE_VERSION ""
| #define PACKAGE_STRING ""
| #define PACKAGE_BUGREPORT ""
| #define USE_BUILTIN_FRAME_ADDRESS 1
| #define STDC_HEADERS 1
| #define HAVE_SYS_TYPES_H 1
| #define HAVE_SYS_STAT_H 1
| #define HAVE_STDLIB_H 1
| #define HAVE_STRING_H 1
| #define HAVE_MEMORY_H 1
| #define HAVE_STRINGS_H 1
| #define HAVE_INTTYPES_H 1
| #define HAVE_STDINT_H 1
| #define HAVE_UNISTD_H 1
| #define HAVE_LONG_LONG 1
| #define HAVE_OFF_T 1
| #define SIZEOF_INT 4
| #define SIZEOF_SHORT 2
| #define SIZEOF_LONG 4
| #define SIZEOF_LONG_LONG 8
| #define SIZEOF___INT64 0
| #define SIZEOF_OFF_T 8
| #define SIZEOF_VOIDP 4
| #define SIZEOF_FLOAT 4
| #define SIZEOF_DOUBLE 8
| #define SIZEOF_TIME_T 4
| #define rb_pid_t pid_t
| #define PIDT2NUM(v) LONG2NUM(v)
| #define NUM2PIDT(v) NUM2LONG(v)
| #define rb_uid_t uid_t
| #define UIDT2NUM(v) ULONG2NUM(v)
| #define NUM2UIDT(v) NUM2ULONG(v)
| #define rb_gid_t gid_t
| #define GIDT2NUM(v) ULONG2NUM(v)
| #define NUM2GIDT(v) NUM2ULONG(v)
| #define HAVE_PROTOTYPES 1
| #define TOKEN_PASTE(x,y) x##y
| #define STRINGIZE(expr) STRINGIZE0(expr)
| #define HAVE_STDARG_PROTOTYPES 1
| #define NORETURN(x) __attribute__ ((noreturn)) x
| #define DEPRECATED(x) __attribute__ ((deprecated)) x
| #define NOINLINE(x) __attribute__ ((noinline)) x
| #define FUNC_STDCALL(x) __attribute__ ((stdcall)) x
| #define FUNC_CDECL(x) __attribute__ ((cdecl)) x
| #define FUNC_FASTCALL(x) __attribute__ ((fastcall)) x
| #define HAVE_DECL_SYS_NERR 1
| #define BROKEN_SETREUID 1
| #define BROKEN_SETREGID 1
| #define HAVE_LIBDL 1
| #define HAVE_DIRENT_H 1
| #define STDC_HEADERS 1
| #define HAVE_SYS_WAIT_H 1
| #define HAVE_STDLIB_H 1
| #define HAVE_STRING_H 1
| #define HAVE_UNISTD_H 1
| #define HAVE_LIMITS_H 1
| #define HAVE_SYS_FILE_H 1
| #define HAVE_SYS_IOCTL_H 1
| #define HAVE_SYS_SYSCALL_H 1
| #define HAVE_FCNTL_H 1
| #define HAVE_SYS_FCNTL_H 1
| #define HAVE_SYS_SELECT_H 1
| #define HAVE_SYS_TIME_H 1
| #define HAVE_SYS_TIMES_H 1
| #define HAVE_SYS_PARAM_H 1
| #define HAVE_PWD_H 1
| #define HAVE_GRP_H 1
| #define HAVE_UTIME_H 1
| #define HAVE_MEMORY_H 1
| #define HAVE_SYS_RESOURCE_H 1
| /* end confdefs.h. */
| #include <xti.h>
configure:12882: result: no
configure:12910: checking for xti.h
configure:12918: result: no
configure:12806: checking netinet/in_systm.h usability
configure:12823: gcc-mp-4.2 -c -O -pipe -I/opt/local/include -D_XOPEN_SOURCE -D_DARWIN_C_SOURCE conftest.c >&5
configure:12829: $? = 0
configure:12843: result: yes
configure:12847: checking netinet/in_systm.h presence
configure:12862: gcc-mp-4.2 -E -D_XOPEN_SOURCE -D_DARWIN_C_SOURCE conftest.c
configure:12868: $? = 0
configure:12882: result: yes
configure:12910: checking for netinet/in_systm.h
configure:12918: result: yes
configure:12806: checking float.h usability
configure:12823: gcc-mp-4.2 -c -O -pipe -I/opt/local/include -D_XOPEN_SOURCE -D_DARWIN_C_SOURCE conftest.c >&5
configure:12829: $? = 0
configure:12843: result: yes
configure:12847: checking float.h presence
configure:12862: gcc-mp-4.2 -E -D_XOPEN_SOURCE -D_DARWIN_C_SOURCE conftest.c
configure:12868: $? = 0
configure:12882: result: yes
configure:12910: checking for float.h
configure:12918: result: yes
configure:12806: checking ieeefp.h usability
configure:12823: gcc-mp-4.2 -c -O -pipe -I/opt/local/include -D_XOPEN_SOURCE -D_DARWIN_C_SOURCE conftest.c >&5
conftest.c:110:20: error: ieeefp.h: No such file or directory
configure:12829: $? = 1
configure: failed program was:
| /* confdefs.h. */
| #define PACKAGE_NAME ""
| #define PACKAGE_TARNAME ""
| #define PACKAGE_VERSION ""
| #define PACKAGE_STRING ""
| #define PACKAGE_BUGREPORT ""
| #define USE_BUILTIN_FRAME_ADDRESS 1
| #define STDC_HEADERS 1
| #define HAVE_SYS_TYPES_H 1
| #define HAVE_SYS_STAT_H 1
| #define HAVE_STDLIB_H 1
| #define HAVE_STRING_H 1
| #define HAVE_MEMORY_H 1
| #define HAVE_STRINGS_H 1
| #define HAVE_INTTYPES_H 1
| #define HAVE_STDINT_H 1
| #define HAVE_UNISTD_H 1
| #define HAVE_LONG_LONG 1
| #define HAVE_OFF_T 1
| #define SIZEOF_INT 4
| #define SIZEOF_SHORT 2
| #define SIZEOF_LONG 4
| #define SIZEOF_LONG_LONG 8
| #define SIZEOF___INT64 0
| #define SIZEOF_OFF_T 8
| #define SIZEOF_VOIDP 4
| #define SIZEOF_FLOAT 4
| #define SIZEOF_DOUBLE 8
| #define SIZEOF_TIME_T 4
| #define rb_pid_t pid_t
| #define PIDT2NUM(v) LONG2NUM(v)
| #define NUM2PIDT(v) NUM2LONG(v)
| #define rb_uid_t uid_t
| #define UIDT2NUM(v) ULONG2NUM(v)
| #define NUM2UIDT(v) NUM2ULONG(v)
| #define rb_gid_t gid_t
| #define GIDT2NUM(v) ULONG2NUM(v)
| #define NUM2GIDT(v) NUM2ULONG(v)
| #define HAVE_PROTOTYPES 1
| #define TOKEN_PASTE(x,y) x##y
| #define STRINGIZE(expr) STRINGIZE0(expr)
| #define HAVE_STDARG_PROTOTYPES 1
| #define NORETURN(x) __attribute__ ((noreturn)) x
| #define DEPRECATED(x) __attribute__ ((deprecated)) x
| #define NOINLINE(x) __attribute__ ((noinline)) x
| #define FUNC_STDCALL(x) __attribute__ ((stdcall)) x
| #define FUNC_CDECL(x) __attribute__ ((cdecl)) x
| #define FUNC_FASTCALL(x) __attribute__ ((fastcall)) x
| #define HAVE_DECL_SYS_NERR 1
| #define BROKEN_SETREUID 1
| #define BROKEN_SETREGID 1
| #define HAVE_LIBDL 1
| #define HAVE_DIRENT_H 1
| #define STDC_HEADERS 1
| #define HAVE_SYS_WAIT_H 1
| #define HAVE_STDLIB_H 1
| #define HAVE_STRING_H 1
| #define HAVE_UNISTD_H 1
| #define HAVE_LIMITS_H 1
| #define HAVE_SYS_FILE_H 1
| #define HAVE_SYS_IOCTL_H 1
| #define HAVE_SYS_SYSCALL_H 1
| #define HAVE_FCNTL_H 1
| #define HAVE_SYS_FCNTL_H 1
| #define HAVE_SYS_SELECT_H 1
| #define HAVE_SYS_TIME_H 1
| #define HAVE_SYS_TIMES_H 1
| #define HAVE_SYS_PARAM_H 1
| #define HAVE_PWD_H 1
| #define HAVE_GRP_H 1
| #define HAVE_UTIME_H 1
| #define HAVE_MEMORY_H 1
| #define HAVE_SYS_RESOURCE_H 1
| #define HAVE_NETINET_IN_SYSTM_H 1
| #define HAVE_FLOAT_H 1
| /* end confdefs.h. */
| #include <stdio.h>
| #ifdef HAVE_SYS_TYPES_H
| # include <sys/types.h>
| #endif
| #ifdef HAVE_SYS_STAT_H
| # include <sys/stat.h>
| #endif
| #ifdef STDC_HEADERS
| # include <stdlib.h>
| # include <stddef.h>
| #else
| # ifdef HAVE_STDLIB_H
| # include <stdlib.h>
| # endif
| #endif
| #ifdef HAVE_STRING_H
| # if !defined STDC_HEADERS && defined HAVE_MEMORY_H
| # include <memory.h>
| # endif
| # include <string.h>
| #endif
| #ifdef HAVE_STRINGS_H
| # include <strings.h>
| #endif
| #ifdef HAVE_INTTYPES_H
| # include <inttypes.h>
| #endif
| #ifdef HAVE_STDINT_H
| # include <stdint.h>
| #endif
| #ifdef HAVE_UNISTD_H
| # include <unistd.h>
| #endif
| #include <ieeefp.h>
configure:12843: result: no
configure:12847: checking ieeefp.h presence
configure:12862: gcc-mp-4.2 -E -D_XOPEN_SOURCE -D_DARWIN_C_SOURCE conftest.c
conftest.c:77:20: error: ieeefp.h: No such file or directory
configure:12868: $? = 1
configure: failed program was:
| /* confdefs.h. */
| #define PACKAGE_NAME ""
| #define PACKAGE_TARNAME ""
| #define PACKAGE_VERSION ""
| #define PACKAGE_STRING ""
| #define PACKAGE_BUGREPORT ""
| #define USE_BUILTIN_FRAME_ADDRESS 1
| #define STDC_HEADERS 1
| #define HAVE_SYS_TYPES_H 1
| #define HAVE_SYS_STAT_H 1
| #define HAVE_STDLIB_H 1
| #define HAVE_STRING_H 1
| #define HAVE_MEMORY_H 1
| #define HAVE_STRINGS_H 1
| #define HAVE_INTTYPES_H 1
| #define HAVE_STDINT_H 1
| #define HAVE_UNISTD_H 1
| #define HAVE_LONG_LONG 1
| #define HAVE_OFF_T 1
| #define SIZEOF_INT 4
| #define SIZEOF_SHORT 2
| #define SIZEOF_LONG 4
| #define SIZEOF_LONG_LONG 8
| #define SIZEOF___INT64 0
| #define SIZEOF_OFF_T 8
| #define SIZEOF_VOIDP 4
| #define SIZEOF_FLOAT 4
| #define SIZEOF_DOUBLE 8
| #define SIZEOF_TIME_T 4
| #define rb_pid_t pid_t
| #define PIDT2NUM(v) LONG2NUM(v)
| #define NUM2PIDT(v) NUM2LONG(v)
| #define rb_uid_t uid_t
| #define UIDT2NUM(v) ULONG2NUM(v)
| #define NUM2UIDT(v) NUM2ULONG(v)
| #define rb_gid_t gid_t
| #define GIDT2NUM(v) ULONG2NUM(v)
| #define NUM2GIDT(v) NUM2ULONG(v)
| #define HAVE_PROTOTYPES 1
| #define TOKEN_PASTE(x,y) x##y
| #define STRINGIZE(expr) STRINGIZE0(expr)
| #define HAVE_STDARG_PROTOTYPES 1
| #define NORETURN(x) __attribute__ ((noreturn)) x
| #define DEPRECATED(x) __attribute__ ((deprecated)) x
| #define NOINLINE(x) __attribute__ ((noinline)) x
| #define FUNC_STDCALL(x) __attribute__ ((stdcall)) x
| #define FUNC_CDECL(x) __attribute__ ((cdecl)) x
| #define FUNC_FASTCALL(x) __attribute__ ((fastcall)) x
| #define HAVE_DECL_SYS_NERR 1
| #define BROKEN_SETREUID 1
| #define BROKEN_SETREGID 1
| #define HAVE_LIBDL 1
| #define HAVE_DIRENT_H 1
| #define STDC_HEADERS 1
| #define HAVE_SYS_WAIT_H 1
| #define HAVE_STDLIB_H 1
| #define HAVE_STRING_H 1
| #define HAVE_UNISTD_H 1
| #define HAVE_LIMITS_H 1
| #define HAVE_SYS_FILE_H 1
| #define HAVE_SYS_IOCTL_H 1
| #define HAVE_SYS_SYSCALL_H 1
| #define HAVE_FCNTL_H 1
| #define HAVE_SYS_FCNTL_H 1
| #define HAVE_SYS_SELECT_H 1
| #define HAVE_SYS_TIME_H 1
| #define HAVE_SYS_TIMES_H 1
| #define HAVE_SYS_PARAM_H 1
| #define HAVE_PWD_H 1
| #define HAVE_GRP_H 1
| #define HAVE_UTIME_H 1
| #define HAVE_MEMORY_H 1
| #define HAVE_SYS_RESOURCE_H 1
| #define HAVE_NETINET_IN_SYSTM_H 1
| #define HAVE_FLOAT_H 1
| /* end confdefs.h. */
| #include <ieeefp.h>
configure:12882: result: no
configure:12910: checking for ieeefp.h
configure:12918: result: no
configure:12806: checking pthread.h usability
configure:12823: gcc-mp-4.2 -c -O -pipe -I/opt/local/include -D_XOPEN_SOURCE -D_DARWIN_C_SOURCE conftest.c >&5
configure:12829: $? = 0
configure:12843: result: yes
configure:12847: checking pthread.h presence
configure:12862: gcc-mp-4.2 -E -D_XOPEN_SOURCE -D_DARWIN_C_SOURCE conftest.c
configure:12868: $? = 0
configure:12882: result: yes
configure:12910: checking for pthread.h
configure:12918: result: yes
configure:12806: checking ucontext.h usability
configure:12823: gcc-mp-4.2 -c -O -pipe -I/opt/local/include -D_XOPEN_SOURCE -D_DARWIN_C_SOURCE conftest.c >&5
configure:12829: $? = 0
configure:12843: result: yes
configure:12847: checking ucontext.h presence
configure:12862: gcc-mp-4.2 -E -D_XOPEN_SOURCE -D_DARWIN_C_SOURCE conftest.c
configure:12868: $? = 0
configure:12882: result: yes
configure:12910: checking for ucontext.h
configure:12918: result: yes
configure:12806: checking intrinsics.h usability
configure:12823: gcc-mp-4.2 -c -O -pipe -I/opt/local/include -D_XOPEN_SOURCE -D_DARWIN_C_SOURCE conftest.c >&5
conftest.c:112:24: error: intrinsics.h: No such file or directory
configure:12829: $? = 1
configure: failed program was:
| /* confdefs.h. */
| #define PACKAGE_NAME ""
| #define PACKAGE_TARNAME ""
| #define PACKAGE_VERSION ""
| #define PACKAGE_STRING ""
| #define PACKAGE_BUGREPORT ""
| #define USE_BUILTIN_FRAME_ADDRESS 1
| #define STDC_HEADERS 1
| #define HAVE_SYS_TYPES_H 1
| #define HAVE_SYS_STAT_H 1
| #define HAVE_STDLIB_H 1
| #define HAVE_STRING_H 1
| #define HAVE_MEMORY_H 1
| #define HAVE_STRINGS_H 1
| #define HAVE_INTTYPES_H 1
| #define HAVE_STDINT_H 1
| #define HAVE_UNISTD_H 1
| #define HAVE_LONG_LONG 1
| #define HAVE_OFF_T 1
| #define SIZEOF_INT 4
| #define SIZEOF_SHORT 2
| #define SIZEOF_LONG 4
| #define SIZEOF_LONG_LONG 8
| #define SIZEOF___INT64 0
| #define SIZEOF_OFF_T 8
| #define SIZEOF_VOIDP 4
| #define SIZEOF_FLOAT 4
| #define SIZEOF_DOUBLE 8
| #define SIZEOF_TIME_T 4
| #define rb_pid_t pid_t
| #define PIDT2NUM(v) LONG2NUM(v)
| #define NUM2PIDT(v) NUM2LONG(v)
| #define rb_uid_t uid_t
| #define UIDT2NUM(v) ULONG2NUM(v)
| #define NUM2UIDT(v) NUM2ULONG(v)
| #define rb_gid_t gid_t
| #define GIDT2NUM(v) ULONG2NUM(v)
| #define NUM2GIDT(v) NUM2ULONG(v)
| #define HAVE_PROTOTYPES 1
| #define TOKEN_PASTE(x,y) x##y
| #define STRINGIZE(expr) STRINGIZE0(expr)
| #define HAVE_STDARG_PROTOTYPES 1
| #define NORETURN(x) __attribute__ ((noreturn)) x
| #define DEPRECATED(x) __attribute__ ((deprecated)) x
| #define NOINLINE(x) __attribute__ ((noinline)) x
| #define FUNC_STDCALL(x) __attribute__ ((stdcall)) x
| #define FUNC_CDECL(x) __attribute__ ((cdecl)) x
| #define FUNC_FASTCALL(x) __attribute__ ((fastcall)) x
| #define HAVE_DECL_SYS_NERR 1
| #define BROKEN_SETREUID 1
| #define BROKEN_SETREGID 1
| #define HAVE_LIBDL 1
| #define HAVE_DIRENT_H 1
| #define STDC_HEADERS 1
| #define HAVE_SYS_WAIT_H 1
| #define HAVE_STDLIB_H 1
| #define HAVE_STRING_H 1
| #define HAVE_UNISTD_H 1
| #define HAVE_LIMITS_H 1
| #define HAVE_SYS_FILE_H 1
| #define HAVE_SYS_IOCTL_H 1
| #define HAVE_SYS_SYSCALL_H 1
| #define HAVE_FCNTL_H 1
| #define HAVE_SYS_FCNTL_H 1
| #define HAVE_SYS_SELECT_H 1
| #define HAVE_SYS_TIME_H 1
| #define HAVE_SYS_TIMES_H 1
| #define HAVE_SYS_PARAM_H 1
| #define HAVE_PWD_H 1
| #define HAVE_GRP_H 1
| #define HAVE_UTIME_H 1
| #define HAVE_MEMORY_H 1
| #define HAVE_SYS_RESOURCE_H 1
| #define HAVE_NETINET_IN_SYSTM_H 1
| #define HAVE_FLOAT_H 1
| #define HAVE_PTHREAD_H 1
| #define HAVE_UCONTEXT_H 1
| /* end confdefs.h. */
| #include <stdio.h>
| #ifdef HAVE_SYS_TYPES_H
| # include <sys/types.h>
| #endif
| #ifdef HAVE_SYS_STAT_H
| # include <sys/stat.h>
| #endif
| #ifdef STDC_HEADERS
| # include <stdlib.h>
| # include <stddef.h>
| #else
| # ifdef HAVE_STDLIB_H
| # include <stdlib.h>
| # endif
| #endif
| #ifdef HAVE_STRING_H
| # if !defined STDC_HEADERS && defined HAVE_MEMORY_H
| # include <memory.h>
| # endif
| # include <string.h>
| #endif
| #ifdef HAVE_STRINGS_H
| # include <strings.h>
| #endif
| #ifdef HAVE_INTTYPES_H
| # include <inttypes.h>
| #endif
| #ifdef HAVE_STDINT_H
| # include <stdint.h>
| #endif
| #ifdef HAVE_UNISTD_H
| # include <unistd.h>
| #endif
| #include <intrinsics.h>
configure:12843: result: no
configure:12847: checking intrinsics.h presence
configure:12862: gcc-mp-4.2 -E -D_XOPEN_SOURCE -D_DARWIN_C_SOURCE conftest.c
conftest.c:79:24: error: intrinsics.h: No such file or directory
configure:12868: $? = 1
configure: failed program was:
| /* confdefs.h. */
| #define PACKAGE_NAME ""
| #define PACKAGE_TARNAME ""
| #define PACKAGE_VERSION ""
| #define PACKAGE_STRING ""
| #define PACKAGE_BUGREPORT ""
| #define USE_BUILTIN_FRAME_ADDRESS 1
| #define STDC_HEADERS 1
| #define HAVE_SYS_TYPES_H 1
| #define HAVE_SYS_STAT_H 1
| #define HAVE_STDLIB_H 1
| #define HAVE_STRING_H 1
| #define HAVE_MEMORY_H 1
| #define HAVE_STRINGS_H 1
| #define HAVE_INTTYPES_H 1
| #define HAVE_STDINT_H 1
| #define HAVE_UNISTD_H 1
| #define HAVE_LONG_LONG 1
| #define HAVE_OFF_T 1
| #define SIZEOF_INT 4
| #define SIZEOF_SHORT 2
| #define SIZEOF_LONG 4
| #define SIZEOF_LONG_LONG 8
| #define SIZEOF___INT64 0
| #define SIZEOF_OFF_T 8
| #define SIZEOF_VOIDP 4
| #define SIZEOF_FLOAT 4
| #define SIZEOF_DOUBLE 8
| #define SIZEOF_TIME_T 4
| #define rb_pid_t pid_t
| #define PIDT2NUM(v) LONG2NUM(v)
| #define NUM2PIDT(v) NUM2LONG(v)
| #define rb_uid_t uid_t
| #define UIDT2NUM(v) ULONG2NUM(v)
| #define NUM2UIDT(v) NUM2ULONG(v)
| #define rb_gid_t gid_t
| #define GIDT2NUM(v) ULONG2NUM(v)
| #define NUM2GIDT(v) NUM2ULONG(v)
| #define HAVE_PROTOTYPES 1
| #define TOKEN_PASTE(x,y) x##y
| #define STRINGIZE(expr) STRINGIZE0(expr)
| #define HAVE_STDARG_PROTOTYPES 1
| #define NORETURN(x) __attribute__ ((noreturn)) x
| #define DEPRECATED(x) __attribute__ ((deprecated)) x
| #define NOINLINE(x) __attribute__ ((noinline)) x
| #define FUNC_STDCALL(x) __attribute__ ((stdcall)) x
| #define FUNC_CDECL(x) __attribute__ ((cdecl)) x
| #define FUNC_FASTCALL(x) __attribute__ ((fastcall)) x
| #define HAVE_DECL_SYS_NERR 1
| #define BROKEN_SETREUID 1
| #define BROKEN_SETREGID 1
| #define HAVE_LIBDL 1
| #define HAVE_DIRENT_H 1
| #define STDC_HEADERS 1
| #define HAVE_SYS_WAIT_H 1
| #define HAVE_STDLIB_H 1
| #define HAVE_STRING_H 1
| #define HAVE_UNISTD_H 1
| #define HAVE_LIMITS_H 1
| #define HAVE_SYS_FILE_H 1
| #define HAVE_SYS_IOCTL_H 1
| #define HAVE_SYS_SYSCALL_H 1
| #define HAVE_FCNTL_H 1
| #define HAVE_SYS_FCNTL_H 1
| #define HAVE_SYS_SELECT_H 1
| #define HAVE_SYS_TIME_H 1
| #define HAVE_SYS_TIMES_H 1
| #define HAVE_SYS_PARAM_H 1
| #define HAVE_PWD_H 1
| #define HAVE_GRP_H 1
| #define HAVE_UTIME_H 1
| #define HAVE_MEMORY_H 1
| #define HAVE_SYS_RESOURCE_H 1
| #define HAVE_NETINET_IN_SYSTM_H 1
| #define HAVE_FLOAT_H 1
| #define HAVE_PTHREAD_H 1
| #define HAVE_UCONTEXT_H 1
| /* end confdefs.h. */
| #include <intrinsics.h>
configure:12882: result: no
configure:12910: checking for intrinsics.h
configure:12918: result: no
configure:12806: checking langinfo.h usability
configure:12823: gcc-mp-4.2 -c -O -pipe -I/opt/local/include -D_XOPEN_SOURCE -D_DARWIN_C_SOURCE conftest.c >&5
configure:12829: $? = 0
configure:12843: result: yes
configure:12847: checking langinfo.h presence
configure:12862: gcc-mp-4.2 -E -D_XOPEN_SOURCE -D_DARWIN_C_SOURCE conftest.c
configure:12868: $? = 0
configure:12882: result: yes
configure:12910: checking for langinfo.h
configure:12918: result: yes
configure:12806: checking locale.h usability
configure:12823: gcc-mp-4.2 -c -O -pipe -I/opt/local/include -D_XOPEN_SOURCE -D_DARWIN_C_SOURCE conftest.c >&5
configure:12829: $? = 0
configure:12843: result: yes
configure:12847: checking locale.h presence
configure:12862: gcc-mp-4.2 -E -D_XOPEN_SOURCE -D_DARWIN_C_SOURCE conftest.c
configure:12868: $? = 0
configure:12882: result: yes
configure:12910: checking for locale.h
configure:12918: result: yes
configure:12806: checking sys/sendfile.h usability
configure:12823: gcc-mp-4.2 -c -O -pipe -I/opt/local/include -D_XOPEN_SOURCE -D_DARWIN_C_SOURCE conftest.c >&5
conftest.c:114:26: error: sys/sendfile.h: No such file or directory
configure:12829: $? = 1
configure: failed program was:
| /* confdefs.h. */
| #define PACKAGE_NAME ""
| #define PACKAGE_TARNAME ""
| #define PACKAGE_VERSION ""
| #define PACKAGE_STRING ""
| #define PACKAGE_BUGREPORT ""
| #define USE_BUILTIN_FRAME_ADDRESS 1
| #define STDC_HEADERS 1
| #define HAVE_SYS_TYPES_H 1
| #define HAVE_SYS_STAT_H 1
| #define HAVE_STDLIB_H 1
| #define HAVE_STRING_H 1
| #define HAVE_MEMORY_H 1
| #define HAVE_STRINGS_H 1
| #define HAVE_INTTYPES_H 1
| #define HAVE_STDINT_H 1
| #define HAVE_UNISTD_H 1
| #define HAVE_LONG_LONG 1
| #define HAVE_OFF_T 1
| #define SIZEOF_INT 4
| #define SIZEOF_SHORT 2
| #define SIZEOF_LONG 4
| #define SIZEOF_LONG_LONG 8
| #define SIZEOF___INT64 0
| #define SIZEOF_OFF_T 8
| #define SIZEOF_VOIDP 4
| #define SIZEOF_FLOAT 4
| #define SIZEOF_DOUBLE 8
| #define SIZEOF_TIME_T 4
| #define rb_pid_t pid_t
| #define PIDT2NUM(v) LONG2NUM(v)
| #define NUM2PIDT(v) NUM2LONG(v)
| #define rb_uid_t uid_t
| #define UIDT2NUM(v) ULONG2NUM(v)
| #define NUM2UIDT(v) NUM2ULONG(v)
| #define rb_gid_t gid_t
| #define GIDT2NUM(v) ULONG2NUM(v)
| #define NUM2GIDT(v) NUM2ULONG(v)
| #define HAVE_PROTOTYPES 1
| #define TOKEN_PASTE(x,y) x##y
| #define STRINGIZE(expr) STRINGIZE0(expr)
| #define HAVE_STDARG_PROTOTYPES 1
| #define NORETURN(x) __attribute__ ((noreturn)) x
| #define DEPRECATED(x) __attribute__ ((deprecated)) x
| #define NOINLINE(x) __attribute__ ((noinline)) x
| #define FUNC_STDCALL(x) __attribute__ ((stdcall)) x
| #define FUNC_CDECL(x) __attribute__ ((cdecl)) x
| #define FUNC_FASTCALL(x) __attribute__ ((fastcall)) x
| #define HAVE_DECL_SYS_NERR 1
| #define BROKEN_SETREUID 1
| #define BROKEN_SETREGID 1
| #define HAVE_LIBDL 1
| #define HAVE_DIRENT_H 1
| #define STDC_HEADERS 1
| #define HAVE_SYS_WAIT_H 1
| #define HAVE_STDLIB_H 1
| #define HAVE_STRING_H 1
| #define HAVE_UNISTD_H 1
| #define HAVE_LIMITS_H 1
| #define HAVE_SYS_FILE_H 1
| #define HAVE_SYS_IOCTL_H 1
| #define HAVE_SYS_SYSCALL_H 1
| #define HAVE_FCNTL_H 1
| #define HAVE_SYS_FCNTL_H 1
| #define HAVE_SYS_SELECT_H 1
| #define HAVE_SYS_TIME_H 1
| #define HAVE_SYS_TIMES_H 1
| #define HAVE_SYS_PARAM_H 1
| #define HAVE_PWD_H 1
| #define HAVE_GRP_H 1
| #define HAVE_UTIME_H 1
| #define HAVE_MEMORY_H 1
| #define HAVE_SYS_RESOURCE_H 1
| #define HAVE_NETINET_IN_SYSTM_H 1
| #define HAVE_FLOAT_H 1
| #define HAVE_PTHREAD_H 1
| #define HAVE_UCONTEXT_H 1
| #define HAVE_LANGINFO_H 1
| #define HAVE_LOCALE_H 1
| /* end confdefs.h. */
| #include <stdio.h>
| #ifdef HAVE_SYS_TYPES_H
| # include <sys/types.h>
| #endif
| #ifdef HAVE_SYS_STAT_H
| # include <sys/stat.h>
| #endif
| #ifdef STDC_HEADERS
| # include <stdlib.h>
| # include <stddef.h>
| #else
| # ifdef HAVE_STDLIB_H
| # include <stdlib.h>
| # endif
| #endif
| #ifdef HAVE_STRING_H
| # if !defined STDC_HEADERS && defined HAVE_MEMORY_H
| # include <memory.h>
| # endif
| # include <string.h>
| #endif
| #ifdef HAVE_STRINGS_H
| # include <strings.h>
| #endif
| #ifdef HAVE_INTTYPES_H
| # include <inttypes.h>
| #endif
| #ifdef HAVE_STDINT_H
| # include <stdint.h>
| #endif
| #ifdef HAVE_UNISTD_H
| # include <unistd.h>
| #endif
| #include <sys/sendfile.h>
configure:12843: result: no
configure:12847: checking sys/sendfile.h presence
configure:12862: gcc-mp-4.2 -E -D_XOPEN_SOURCE -D_DARWIN_C_SOURCE conftest.c
conftest.c:81:26: error: sys/sendfile.h: No such file or directory
configure:12868: $? = 1
configure: failed program was:
| /* confdefs.h. */
| #define PACKAGE_NAME ""
| #define PACKAGE_TARNAME ""
| #define PACKAGE_VERSION ""
| #define PACKAGE_STRING ""
| #define PACKAGE_BUGREPORT ""
| #define USE_BUILTIN_FRAME_ADDRESS 1
| #define STDC_HEADERS 1
| #define HAVE_SYS_TYPES_H 1
| #define HAVE_SYS_STAT_H 1
| #define HAVE_STDLIB_H 1
| #define HAVE_STRING_H 1
| #define HAVE_MEMORY_H 1
| #define HAVE_STRINGS_H 1
| #define HAVE_INTTYPES_H 1
| #define HAVE_STDINT_H 1
| #define HAVE_UNISTD_H 1
| #define HAVE_LONG_LONG 1
| #define HAVE_OFF_T 1
| #define SIZEOF_INT 4
| #define SIZEOF_SHORT 2
| #define SIZEOF_LONG 4
| #define SIZEOF_LONG_LONG 8
| #define SIZEOF___INT64 0
| #define SIZEOF_OFF_T 8
| #define SIZEOF_VOIDP 4
| #define SIZEOF_FLOAT 4
| #define SIZEOF_DOUBLE 8
| #define SIZEOF_TIME_T 4
| #define rb_pid_t pid_t
| #define PIDT2NUM(v) LONG2NUM(v)
| #define NUM2PIDT(v) NUM2LONG(v)
| #define rb_uid_t uid_t
| #define UIDT2NUM(v) ULONG2NUM(v)
| #define NUM2UIDT(v) NUM2ULONG(v)
| #define rb_gid_t gid_t
| #define GIDT2NUM(v) ULONG2NUM(v)
| #define NUM2GIDT(v) NUM2ULONG(v)
| #define HAVE_PROTOTYPES 1
| #define TOKEN_PASTE(x,y) x##y
| #define STRINGIZE(expr) STRINGIZE0(expr)
| #define HAVE_STDARG_PROTOTYPES 1
| #define NORETURN(x) __attribute__ ((noreturn)) x
| #define DEPRECATED(x) __attribute__ ((deprecated)) x
| #define NOINLINE(x) __attribute__ ((noinline)) x
| #define FUNC_STDCALL(x) __attribute__ ((stdcall)) x
| #define FUNC_CDECL(x) __attribute__ ((cdecl)) x
| #define FUNC_FASTCALL(x) __attribute__ ((fastcall)) x
| #define HAVE_DECL_SYS_NERR 1
| #define BROKEN_SETREUID 1
| #define BROKEN_SETREGID 1
| #define HAVE_LIBDL 1
| #define HAVE_DIRENT_H 1
| #define STDC_HEADERS 1
| #define HAVE_SYS_WAIT_H 1
| #define HAVE_STDLIB_H 1
| #define HAVE_STRING_H 1
| #define HAVE_UNISTD_H 1
| #define HAVE_LIMITS_H 1
| #define HAVE_SYS_FILE_H 1
| #define HAVE_SYS_IOCTL_H 1
| #define HAVE_SYS_SYSCALL_H 1
| #define HAVE_FCNTL_H 1
| #define HAVE_SYS_FCNTL_H 1
| #define HAVE_SYS_SELECT_H 1
| #define HAVE_SYS_TIME_H 1
| #define HAVE_SYS_TIMES_H 1
| #define HAVE_SYS_PARAM_H 1
| #define HAVE_PWD_H 1
| #define HAVE_GRP_H 1
| #define HAVE_UTIME_H 1
| #define HAVE_MEMORY_H 1
| #define HAVE_SYS_RESOURCE_H 1
| #define HAVE_NETINET_IN_SYSTM_H 1
| #define HAVE_FLOAT_H 1
| #define HAVE_PTHREAD_H 1
| #define HAVE_UCONTEXT_H 1
| #define HAVE_LANGINFO_H 1
| #define HAVE_LOCALE_H 1
| /* end confdefs.h. */
| #include <sys/sendfile.h>
configure:12882: result: no
configure:12910: checking for sys/sendfile.h
configure:12918: result: no
configure:12932: checking for rlim_t
configure:12977: gcc-mp-4.2 -c -O -pipe -I/opt/local/include -D_XOPEN_SOURCE -D_DARWIN_C_SOURCE conftest.c >&5
configure:12983: $? = 0
configure:12998: result: yes
configure:13005: checking size of rlim_t
configure:13397: gcc-mp-4.2 -o conftest -O -pipe -I/opt/local/include -D_XOPEN_SOURCE -D_DARWIN_C_SOURCE -L/opt/local/lib conftest.c -ldl -lobjc >&5
configure:13400: $? = 0
configure:13406: ./conftest
configure:13409: $? = 0
configure:13432: result: 8
configure:13443: checking for size_t
configure:13473: gcc-mp-4.2 -c -O -pipe -I/opt/local/include -D_XOPEN_SOURCE -D_DARWIN_C_SOURCE conftest.c >&5
configure:13479: $? = 0
configure:13494: result: yes
configure:13506: checking for size_t
configure:13557: result: yes
configure:13564: checking size of size_t
configure:13866: gcc-mp-4.2 -o conftest -O -pipe -I/opt/local/include -D_XOPEN_SOURCE -D_DARWIN_C_SOURCE -L/opt/local/lib conftest.c -ldl -lobjc >&5
configure:13869: $? = 0
configure:13875: ./conftest
configure:13878: $? = 0
configure:13901: result: 4
configure:13911: checking for struct stat.st_blksize
configure:13939: gcc-mp-4.2 -c -O -pipe -I/opt/local/include -D_XOPEN_SOURCE -D_DARWIN_C_SOURCE conftest.c >&5
configure:13945: $? = 0
configure:14002: result: yes
configure:14018: checking for struct stat.st_blocks
configure:14046: gcc-mp-4.2 -c -O -pipe -I/opt/local/include -D_XOPEN_SOURCE -D_DARWIN_C_SOURCE conftest.c >&5
configure:14052: $? = 0
configure:14109: result: yes
configure:14132: checking for struct stat.st_rdev
configure:14160: gcc-mp-4.2 -c -O -pipe -I/opt/local/include -D_XOPEN_SOURCE -D_DARWIN_C_SOURCE conftest.c >&5
configure:14166: $? = 0
configure:14223: result: yes
configure:14239: checking for struct stat.st_atim
configure:14267: gcc-mp-4.2 -c -O -pipe -I/opt/local/include -D_XOPEN_SOURCE -D_DARWIN_C_SOURCE conftest.c >&5
conftest.c: In function 'main':
conftest.c:126: error: 'struct stat' has no member named 'st_atim'
configure:14273: $? = 1
configure: failed program was:
| /* confdefs.h. */
| #define PACKAGE_NAME ""
| #define PACKAGE_TARNAME ""
| #define PACKAGE_VERSION ""
| #define PACKAGE_STRING ""
| #define PACKAGE_BUGREPORT ""
| #define USE_BUILTIN_FRAME_ADDRESS 1
| #define STDC_HEADERS 1
| #define HAVE_SYS_TYPES_H 1
| #define HAVE_SYS_STAT_H 1
| #define HAVE_STDLIB_H 1
| #define HAVE_STRING_H 1
| #define HAVE_MEMORY_H 1
| #define HAVE_STRINGS_H 1
| #define HAVE_INTTYPES_H 1
| #define HAVE_STDINT_H 1
| #define HAVE_UNISTD_H 1
| #define HAVE_LONG_LONG 1
| #define HAVE_OFF_T 1
| #define SIZEOF_INT 4
| #define SIZEOF_SHORT 2
| #define SIZEOF_LONG 4
| #define SIZEOF_LONG_LONG 8
| #define SIZEOF___INT64 0
| #define SIZEOF_OFF_T 8
| #define SIZEOF_VOIDP 4
| #define SIZEOF_FLOAT 4
| #define SIZEOF_DOUBLE 8
| #define SIZEOF_TIME_T 4
| #define rb_pid_t pid_t
| #define PIDT2NUM(v) LONG2NUM(v)
| #define NUM2PIDT(v) NUM2LONG(v)
| #define rb_uid_t uid_t
| #define UIDT2NUM(v) ULONG2NUM(v)
| #define NUM2UIDT(v) NUM2ULONG(v)
| #define rb_gid_t gid_t
| #define GIDT2NUM(v) ULONG2NUM(v)
| #define NUM2GIDT(v) NUM2ULONG(v)
| #define HAVE_PROTOTYPES 1
| #define TOKEN_PASTE(x,y) x##y
| #define STRINGIZE(expr) STRINGIZE0(expr)
| #define HAVE_STDARG_PROTOTYPES 1
| #define NORETURN(x) __attribute__ ((noreturn)) x
| #define DEPRECATED(x) __attribute__ ((deprecated)) x
| #define NOINLINE(x) __attribute__ ((noinline)) x
| #define FUNC_STDCALL(x) __attribute__ ((stdcall)) x
| #define FUNC_CDECL(x) __attribute__ ((cdecl)) x
| #define FUNC_FASTCALL(x) __attribute__ ((fastcall)) x
| #define HAVE_DECL_SYS_NERR 1
| #define BROKEN_SETREUID 1
| #define BROKEN_SETREGID 1
| #define HAVE_LIBDL 1
| #define HAVE_DIRENT_H 1
| #define STDC_HEADERS 1
| #define HAVE_SYS_WAIT_H 1
| #define HAVE_STDLIB_H 1
| #define HAVE_STRING_H 1
| #define HAVE_UNISTD_H 1
| #define HAVE_LIMITS_H 1
| #define HAVE_SYS_FILE_H 1
| #define HAVE_SYS_IOCTL_H 1
| #define HAVE_SYS_SYSCALL_H 1
| #define HAVE_FCNTL_H 1
| #define HAVE_SYS_FCNTL_H 1
| #define HAVE_SYS_SELECT_H 1
| #define HAVE_SYS_TIME_H 1
| #define HAVE_SYS_TIMES_H 1
| #define HAVE_SYS_PARAM_H 1
| #define HAVE_PWD_H 1
| #define HAVE_GRP_H 1
| #define HAVE_UTIME_H 1
| #define HAVE_MEMORY_H 1
| #define HAVE_SYS_RESOURCE_H 1
| #define HAVE_NETINET_IN_SYSTM_H 1
| #define HAVE_FLOAT_H 1
| #define HAVE_PTHREAD_H 1
| #define HAVE_UCONTEXT_H 1
| #define HAVE_LANGINFO_H 1
| #define HAVE_LOCALE_H 1
| #define SIZEOF_RLIM_T 8
| #define SIZEOF_SIZE_T 4
| #define HAVE_STRUCT_STAT_ST_BLKSIZE 1
| #define HAVE_ST_BLKSIZE 1
| #define HAVE_STRUCT_STAT_ST_BLOCKS 1
| #define HAVE_ST_BLOCKS 1
| #define HAVE_STRUCT_STAT_ST_RDEV 1
| #define HAVE_ST_RDEV 1
| /* end confdefs.h. */
| #include <stdio.h>
| #ifdef HAVE_SYS_TYPES_H
| # include <sys/types.h>
| #endif
| #ifdef HAVE_SYS_STAT_H
| # include <sys/stat.h>
| #endif
| #ifdef STDC_HEADERS
| # include <stdlib.h>
| # include <stddef.h>
| #else
| # ifdef HAVE_STDLIB_H
| # include <stdlib.h>
| # endif
| #endif
| #ifdef HAVE_STRING_H
| # if !defined STDC_HEADERS && defined HAVE_MEMORY_H
| # include <memory.h>
| # endif
| # include <string.h>
| #endif
| #ifdef HAVE_STRINGS_H
| # include <strings.h>
| #endif
| #ifdef HAVE_INTTYPES_H
| # include <inttypes.h>
| #endif
| #ifdef HAVE_STDINT_H
| # include <stdint.h>
| #endif
| #ifdef HAVE_UNISTD_H
| # include <unistd.h>
| #endif
| int
| main ()
| {
| static struct stat ac_aggr;
| if (ac_aggr.st_atim)
| return 0;
| ;
| return 0;
| }
configure:14306: gcc-mp-4.2 -c -O -pipe -I/opt/local/include -D_XOPEN_SOURCE -D_DARWIN_C_SOURCE conftest.c >&5
conftest.c: In function 'main':
conftest.c:126: error: 'struct stat' has no member named 'st_atim'
configure:14312: $? = 1
configure: failed program was:
| /* confdefs.h. */
| #define PACKAGE_NAME ""
| #define PACKAGE_TARNAME ""
| #define PACKAGE_VERSION ""
| #define PACKAGE_STRING ""
| #define PACKAGE_BUGREPORT ""
| #define USE_BUILTIN_FRAME_ADDRESS 1
| #define STDC_HEADERS 1
| #define HAVE_SYS_TYPES_H 1
| #define HAVE_SYS_STAT_H 1
| #define HAVE_STDLIB_H 1
| #define HAVE_STRING_H 1
| #define HAVE_MEMORY_H 1
| #define HAVE_STRINGS_H 1
| #define HAVE_INTTYPES_H 1
| #define HAVE_STDINT_H 1
| #define HAVE_UNISTD_H 1
| #define HAVE_LONG_LONG 1
| #define HAVE_OFF_T 1
| #define SIZEOF_INT 4
| #define SIZEOF_SHORT 2
| #define SIZEOF_LONG 4
| #define SIZEOF_LONG_LONG 8
| #define SIZEOF___INT64 0
| #define SIZEOF_OFF_T 8
| #define SIZEOF_VOIDP 4
| #define SIZEOF_FLOAT 4
| #define SIZEOF_DOUBLE 8
| #define SIZEOF_TIME_T 4
| #define rb_pid_t pid_t
| #define PIDT2NUM(v) LONG2NUM(v)
| #define NUM2PIDT(v) NUM2LONG(v)
| #define rb_uid_t uid_t
| #define UIDT2NUM(v) ULONG2NUM(v)
| #define NUM2UIDT(v) NUM2ULONG(v)
| #define rb_gid_t gid_t
| #define GIDT2NUM(v) ULONG2NUM(v)
| #define NUM2GIDT(v) NUM2ULONG(v)
| #define HAVE_PROTOTYPES 1
| #define TOKEN_PASTE(x,y) x##y
| #define STRINGIZE(expr) STRINGIZE0(expr)
| #define HAVE_STDARG_PROTOTYPES 1
| #define NORETURN(x) __attribute__ ((noreturn)) x
| #define DEPRECATED(x) __attribute__ ((deprecated)) x
| #define NOINLINE(x) __attribute__ ((noinline)) x
| #define FUNC_STDCALL(x) __attribute__ ((stdcall)) x
| #define FUNC_CDECL(x) __attribute__ ((cdecl)) x
| #define FUNC_FASTCALL(x) __attribute__ ((fastcall)) x
| #define HAVE_DECL_SYS_NERR 1
| #define BROKEN_SETREUID 1
| #define BROKEN_SETREGID 1
| #define HAVE_LIBDL 1
| #define HAVE_DIRENT_H 1
| #define STDC_HEADERS 1
| #define HAVE_SYS_WAIT_H 1
| #define HAVE_STDLIB_H 1
| #define HAVE_STRING_H 1
| #define HAVE_UNISTD_H 1
| #define HAVE_LIMITS_H 1
| #define HAVE_SYS_FILE_H 1
| #define HAVE_SYS_IOCTL_H 1
| #define HAVE_SYS_SYSCALL_H 1
| #define HAVE_FCNTL_H 1
| #define HAVE_SYS_FCNTL_H 1
| #define HAVE_SYS_SELECT_H 1
| #define HAVE_SYS_TIME_H 1
| #define HAVE_SYS_TIMES_H 1
| #define HAVE_SYS_PARAM_H 1
| #define HAVE_PWD_H 1
| #define HAVE_GRP_H 1
| #define HAVE_UTIME_H 1
| #define HAVE_MEMORY_H 1
| #define HAVE_SYS_RESOURCE_H 1
| #define HAVE_NETINET_IN_SYSTM_H 1
| #define HAVE_FLOAT_H 1
| #define HAVE_PTHREAD_H 1
| #define HAVE_UCONTEXT_H 1
| #define HAVE_LANGINFO_H 1
| #define HAVE_LOCALE_H 1
| #define SIZEOF_RLIM_T 8
| #define SIZEOF_SIZE_T 4
| #define HAVE_STRUCT_STAT_ST_BLKSIZE 1
| #define HAVE_ST_BLKSIZE 1
| #define HAVE_STRUCT_STAT_ST_BLOCKS 1
| #define HAVE_ST_BLOCKS 1
| #define HAVE_STRUCT_STAT_ST_RDEV 1
| #define HAVE_ST_RDEV 1
| /* end confdefs.h. */
| #include <stdio.h>
| #ifdef HAVE_SYS_TYPES_H
| # include <sys/types.h>
| #endif
| #ifdef HAVE_SYS_STAT_H
| # include <sys/stat.h>
| #endif
| #ifdef STDC_HEADERS
| # include <stdlib.h>
| # include <stddef.h>
| #else
| # ifdef HAVE_STDLIB_H
| # include <stdlib.h>
| # endif
| #endif
| #ifdef HAVE_STRING_H
| # if !defined STDC_HEADERS && defined HAVE_MEMORY_H
| # include <memory.h>
| # endif
| # include <string.h>
| #endif
| #ifdef HAVE_STRINGS_H
| # include <strings.h>
| #endif
| #ifdef HAVE_INTTYPES_H
| # include <inttypes.h>
| #endif
| #ifdef HAVE_STDINT_H
| # include <stdint.h>
| #endif
| #ifdef HAVE_UNISTD_H
| # include <unistd.h>
| #endif
| int
| main ()
| {
| static struct stat ac_aggr;
| if (sizeof ac_aggr.st_atim)
| return 0;
| ;
| return 0;
| }
configure:14330: result: no
configure:14341: checking for struct stat.st_atimespec
configure:14369: gcc-mp-4.2 -c -O -pipe -I/opt/local/include -D_XOPEN_SOURCE -D_DARWIN_C_SOURCE conftest.c >&5
conftest.c: In function 'main':
conftest.c:126: error: used struct type value where scalar is required
configure:14375: $? = 1
configure: failed program was:
| /* confdefs.h. */
| #define PACKAGE_NAME ""
| #define PACKAGE_TARNAME ""
| #define PACKAGE_VERSION ""
| #define PACKAGE_STRING ""
| #define PACKAGE_BUGREPORT ""
| #define USE_BUILTIN_FRAME_ADDRESS 1
| #define STDC_HEADERS 1
| #define HAVE_SYS_TYPES_H 1
| #define HAVE_SYS_STAT_H 1
| #define HAVE_STDLIB_H 1
| #define HAVE_STRING_H 1
| #define HAVE_MEMORY_H 1
| #define HAVE_STRINGS_H 1
| #define HAVE_INTTYPES_H 1
| #define HAVE_STDINT_H 1
| #define HAVE_UNISTD_H 1
| #define HAVE_LONG_LONG 1
| #define HAVE_OFF_T 1
| #define SIZEOF_INT 4
| #define SIZEOF_SHORT 2
| #define SIZEOF_LONG 4
| #define SIZEOF_LONG_LONG 8
| #define SIZEOF___INT64 0
| #define SIZEOF_OFF_T 8
| #define SIZEOF_VOIDP 4
| #define SIZEOF_FLOAT 4
| #define SIZEOF_DOUBLE 8
| #define SIZEOF_TIME_T 4
| #define rb_pid_t pid_t
| #define PIDT2NUM(v) LONG2NUM(v)
| #define NUM2PIDT(v) NUM2LONG(v)
| #define rb_uid_t uid_t
| #define UIDT2NUM(v) ULONG2NUM(v)
| #define NUM2UIDT(v) NUM2ULONG(v)
| #define rb_gid_t gid_t
| #define GIDT2NUM(v) ULONG2NUM(v)
| #define NUM2GIDT(v) NUM2ULONG(v)
| #define HAVE_PROTOTYPES 1
| #define TOKEN_PASTE(x,y) x##y
| #define STRINGIZE(expr) STRINGIZE0(expr)
| #define HAVE_STDARG_PROTOTYPES 1
| #define NORETURN(x) __attribute__ ((noreturn)) x
| #define DEPRECATED(x) __attribute__ ((deprecated)) x
| #define NOINLINE(x) __attribute__ ((noinline)) x
| #define FUNC_STDCALL(x) __attribute__ ((stdcall)) x
| #define FUNC_CDECL(x) __attribute__ ((cdecl)) x
| #define FUNC_FASTCALL(x) __attribute__ ((fastcall)) x
| #define HAVE_DECL_SYS_NERR 1
| #define BROKEN_SETREUID 1
| #define BROKEN_SETREGID 1
| #define HAVE_LIBDL 1
| #define HAVE_DIRENT_H 1
| #define STDC_HEADERS 1
| #define HAVE_SYS_WAIT_H 1
| #define HAVE_STDLIB_H 1
| #define HAVE_STRING_H 1
| #define HAVE_UNISTD_H 1
| #define HAVE_LIMITS_H 1
| #define HAVE_SYS_FILE_H 1
| #define HAVE_SYS_IOCTL_H 1
| #define HAVE_SYS_SYSCALL_H 1
| #define HAVE_FCNTL_H 1
| #define HAVE_SYS_FCNTL_H 1
| #define HAVE_SYS_SELECT_H 1
| #define HAVE_SYS_TIME_H 1
| #define HAVE_SYS_TIMES_H 1
| #define HAVE_SYS_PARAM_H 1
| #define HAVE_PWD_H 1
| #define HAVE_GRP_H 1
| #define HAVE_UTIME_H 1
| #define HAVE_MEMORY_H 1
| #define HAVE_SYS_RESOURCE_H 1
| #define HAVE_NETINET_IN_SYSTM_H 1
| #define HAVE_FLOAT_H 1
| #define HAVE_PTHREAD_H 1
| #define HAVE_UCONTEXT_H 1
| #define HAVE_LANGINFO_H 1
| #define HAVE_LOCALE_H 1
| #define SIZEOF_RLIM_T 8
| #define SIZEOF_SIZE_T 4
| #define HAVE_STRUCT_STAT_ST_BLKSIZE 1
| #define HAVE_ST_BLKSIZE 1
| #define HAVE_STRUCT_STAT_ST_BLOCKS 1
| #define HAVE_ST_BLOCKS 1
| #define HAVE_STRUCT_STAT_ST_RDEV 1
| #define HAVE_ST_RDEV 1
| /* end confdefs.h. */
| #include <stdio.h>
| #ifdef HAVE_SYS_TYPES_H
| # include <sys/types.h>
| #endif
| #ifdef HAVE_SYS_STAT_H
| # include <sys/stat.h>
| #endif
| #ifdef STDC_HEADERS
| # include <stdlib.h>
| # include <stddef.h>
| #else
| # ifdef HAVE_STDLIB_H
| # include <stdlib.h>
| # endif
| #endif
| #ifdef HAVE_STRING_H
| # if !defined STDC_HEADERS && defined HAVE_MEMORY_H
| # include <memory.h>
| # endif
| # include <string.h>
| #endif
| #ifdef HAVE_STRINGS_H
| # include <strings.h>
| #endif
| #ifdef HAVE_INTTYPES_H
| # include <inttypes.h>
| #endif
| #ifdef HAVE_STDINT_H
| # include <stdint.h>
| #endif
| #ifdef HAVE_UNISTD_H
| # include <unistd.h>
| #endif
| int
| main ()
| {
| static struct stat ac_aggr;
| if (ac_aggr.st_atimespec)
| return 0;
| ;
| return 0;
| }
configure:14408: gcc-mp-4.2 -c -O -pipe -I/opt/local/include -D_XOPEN_SOURCE -D_DARWIN_C_SOURCE conftest.c >&5
configure:14414: $? = 0
configure:14432: result: yes
configure:14443: checking for struct stat.st_atimensec
configure:14471: gcc-mp-4.2 -c -O -pipe -I/opt/local/include -D_XOPEN_SOURCE -D_DARWIN_C_SOURCE conftest.c >&5
conftest.c: In function 'main':
conftest.c:127: error: 'struct stat' has no member named 'st_atimensec'
configure:14477: $? = 1
configure: failed program was:
| /* confdefs.h. */
| #define PACKAGE_NAME ""
| #define PACKAGE_TARNAME ""
| #define PACKAGE_VERSION ""
| #define PACKAGE_STRING ""
| #define PACKAGE_BUGREPORT ""
| #define USE_BUILTIN_FRAME_ADDRESS 1
| #define STDC_HEADERS 1
| #define HAVE_SYS_TYPES_H 1
| #define HAVE_SYS_STAT_H 1
| #define HAVE_STDLIB_H 1
| #define HAVE_STRING_H 1
| #define HAVE_MEMORY_H 1
| #define HAVE_STRINGS_H 1
| #define HAVE_INTTYPES_H 1
| #define HAVE_STDINT_H 1
| #define HAVE_UNISTD_H 1
| #define HAVE_LONG_LONG 1
| #define HAVE_OFF_T 1
| #define SIZEOF_INT 4
| #define SIZEOF_SHORT 2
| #define SIZEOF_LONG 4
| #define SIZEOF_LONG_LONG 8
| #define SIZEOF___INT64 0
| #define SIZEOF_OFF_T 8
| #define SIZEOF_VOIDP 4
| #define SIZEOF_FLOAT 4
| #define SIZEOF_DOUBLE 8
| #define SIZEOF_TIME_T 4
| #define rb_pid_t pid_t
| #define PIDT2NUM(v) LONG2NUM(v)
| #define NUM2PIDT(v) NUM2LONG(v)
| #define rb_uid_t uid_t
| #define UIDT2NUM(v) ULONG2NUM(v)
| #define NUM2UIDT(v) NUM2ULONG(v)
| #define rb_gid_t gid_t
| #define GIDT2NUM(v) ULONG2NUM(v)
| #define NUM2GIDT(v) NUM2ULONG(v)
| #define HAVE_PROTOTYPES 1
| #define TOKEN_PASTE(x,y) x##y
| #define STRINGIZE(expr) STRINGIZE0(expr)
| #define HAVE_STDARG_PROTOTYPES 1
| #define NORETURN(x) __attribute__ ((noreturn)) x
| #define DEPRECATED(x) __attribute__ ((deprecated)) x
| #define NOINLINE(x) __attribute__ ((noinline)) x
| #define FUNC_STDCALL(x) __attribute__ ((stdcall)) x
| #define FUNC_CDECL(x) __attribute__ ((cdecl)) x
| #define FUNC_FASTCALL(x) __attribute__ ((fastcall)) x
| #define HAVE_DECL_SYS_NERR 1
| #define BROKEN_SETREUID 1
| #define BROKEN_SETREGID 1
| #define HAVE_LIBDL 1
| #define HAVE_DIRENT_H 1
| #define STDC_HEADERS 1
| #define HAVE_SYS_WAIT_H 1
| #define HAVE_STDLIB_H 1
| #define HAVE_STRING_H 1
| #define HAVE_UNISTD_H 1
| #define HAVE_LIMITS_H 1
| #define HAVE_SYS_FILE_H 1
| #define HAVE_SYS_IOCTL_H 1
| #define HAVE_SYS_SYSCALL_H 1
| #define HAVE_FCNTL_H 1
| #define HAVE_SYS_FCNTL_H 1
| #define HAVE_SYS_SELECT_H 1
| #define HAVE_SYS_TIME_H 1
| #define HAVE_SYS_TIMES_H 1
| #define HAVE_SYS_PARAM_H 1
| #define HAVE_PWD_H 1
| #define HAVE_GRP_H 1
| #define HAVE_UTIME_H 1
| #define HAVE_MEMORY_H 1
| #define HAVE_SYS_RESOURCE_H 1
| #define HAVE_NETINET_IN_SYSTM_H 1
| #define HAVE_FLOAT_H 1
| #define HAVE_PTHREAD_H 1
| #define HAVE_UCONTEXT_H 1
| #define HAVE_LANGINFO_H 1
| #define HAVE_LOCALE_H 1
| #define SIZEOF_RLIM_T 8
| #define SIZEOF_SIZE_T 4
| #define HAVE_STRUCT_STAT_ST_BLKSIZE 1
| #define HAVE_ST_BLKSIZE 1
| #define HAVE_STRUCT_STAT_ST_BLOCKS 1
| #define HAVE_ST_BLOCKS 1
| #define HAVE_STRUCT_STAT_ST_RDEV 1
| #define HAVE_ST_RDEV 1
| #define HAVE_STRUCT_STAT_ST_ATIMESPEC 1
| /* end confdefs.h. */
| #include <stdio.h>
| #ifdef HAVE_SYS_TYPES_H
| # include <sys/types.h>
| #endif
| #ifdef HAVE_SYS_STAT_H
| # include <sys/stat.h>
| #endif
| #ifdef STDC_HEADERS
| # include <stdlib.h>
| # include <stddef.h>
| #else
| # ifdef HAVE_STDLIB_H
| # include <stdlib.h>
| # endif
| #endif
| #ifdef HAVE_STRING_H
| # if !defined STDC_HEADERS && defined HAVE_MEMORY_H
| # include <memory.h>
| # endif
| # include <string.h>
| #endif
| #ifdef HAVE_STRINGS_H
| # include <strings.h>
| #endif
| #ifdef HAVE_INTTYPES_H
| # include <inttypes.h>
| #endif
| #ifdef HAVE_STDINT_H
| # include <stdint.h>
| #endif
| #ifdef HAVE_UNISTD_H
| # include <unistd.h>
| #endif
| int
| main ()
| {
| static struct stat ac_aggr;
| if (ac_aggr.st_atimensec)
| return 0;
| ;
| return 0;
| }
configure:14510: gcc-mp-4.2 -c -O -pipe -I/opt/local/include -D_XOPEN_SOURCE -D_DARWIN_C_SOURCE conftest.c >&5
conftest.c: In function 'main':
conftest.c:127: error: 'struct stat' has no member named 'st_atimensec'
configure:14516: $? = 1
configure: failed program was:
| /* confdefs.h. */
| #define PACKAGE_NAME ""
| #define PACKAGE_TARNAME ""
| #define PACKAGE_VERSION ""
| #define PACKAGE_STRING ""
| #define PACKAGE_BUGREPORT ""
| #define USE_BUILTIN_FRAME_ADDRESS 1
| #define STDC_HEADERS 1
| #define HAVE_SYS_TYPES_H 1
| #define HAVE_SYS_STAT_H 1
| #define HAVE_STDLIB_H 1
| #define HAVE_STRING_H 1
| #define HAVE_MEMORY_H 1
| #define HAVE_STRINGS_H 1
| #define HAVE_INTTYPES_H 1
| #define HAVE_STDINT_H 1
| #define HAVE_UNISTD_H 1
| #define HAVE_LONG_LONG 1
| #define HAVE_OFF_T 1
| #define SIZEOF_INT 4
| #define SIZEOF_SHORT 2
| #define SIZEOF_LONG 4
| #define SIZEOF_LONG_LONG 8
| #define SIZEOF___INT64 0
| #define SIZEOF_OFF_T 8
| #define SIZEOF_VOIDP 4
| #define SIZEOF_FLOAT 4
| #define SIZEOF_DOUBLE 8
| #define SIZEOF_TIME_T 4
| #define rb_pid_t pid_t
| #define PIDT2NUM(v) LONG2NUM(v)
| #define NUM2PIDT(v) NUM2LONG(v)
| #define rb_uid_t uid_t
| #define UIDT2NUM(v) ULONG2NUM(v)
| #define NUM2UIDT(v) NUM2ULONG(v)
| #define rb_gid_t gid_t
| #define GIDT2NUM(v) ULONG2NUM(v)
| #define NUM2GIDT(v) NUM2ULONG(v)
| #define HAVE_PROTOTYPES 1
| #define TOKEN_PASTE(x,y) x##y
| #define STRINGIZE(expr) STRINGIZE0(expr)
| #define HAVE_STDARG_PROTOTYPES 1
| #define NORETURN(x) __attribute__ ((noreturn)) x
| #define DEPRECATED(x) __attribute__ ((deprecated)) x
| #define NOINLINE(x) __attribute__ ((noinline)) x
| #define FUNC_STDCALL(x) __attribute__ ((stdcall)) x
| #define FUNC_CDECL(x) __attribute__ ((cdecl)) x
| #define FUNC_FASTCALL(x) __attribute__ ((fastcall)) x
| #define HAVE_DECL_SYS_NERR 1
| #define BROKEN_SETREUID 1
| #define BROKEN_SETREGID 1
| #define HAVE_LIBDL 1
| #define HAVE_DIRENT_H 1
| #define STDC_HEADERS 1
| #define HAVE_SYS_WAIT_H 1
| #define HAVE_STDLIB_H 1
| #define HAVE_STRING_H 1
| #define HAVE_UNISTD_H 1
| #define HAVE_LIMITS_H 1
| #define HAVE_SYS_FILE_H 1
| #define HAVE_SYS_IOCTL_H 1
| #define HAVE_SYS_SYSCALL_H 1
| #define HAVE_FCNTL_H 1
| #define HAVE_SYS_FCNTL_H 1
| #define HAVE_SYS_SELECT_H 1
| #define HAVE_SYS_TIME_H 1
| #define HAVE_SYS_TIMES_H 1
| #define HAVE_SYS_PARAM_H 1
| #define HAVE_PWD_H 1
| #define HAVE_GRP_H 1
| #define HAVE_UTIME_H 1
| #define HAVE_MEMORY_H 1
| #define HAVE_SYS_RESOURCE_H 1
| #define HAVE_NETINET_IN_SYSTM_H 1
| #define HAVE_FLOAT_H 1
| #define HAVE_PTHREAD_H 1
| #define HAVE_UCONTEXT_H 1
| #define HAVE_LANGINFO_H 1
| #define HAVE_LOCALE_H 1
| #define SIZEOF_RLIM_T 8
| #define SIZEOF_SIZE_T 4
| #define HAVE_STRUCT_STAT_ST_BLKSIZE 1
| #define HAVE_ST_BLKSIZE 1
| #define HAVE_STRUCT_STAT_ST_BLOCKS 1
| #define HAVE_ST_BLOCKS 1
| #define HAVE_STRUCT_STAT_ST_RDEV 1
| #define HAVE_ST_RDEV 1
| #define HAVE_STRUCT_STAT_ST_ATIMESPEC 1
| /* end confdefs.h. */
| #include <stdio.h>
| #ifdef HAVE_SYS_TYPES_H
| # include <sys/types.h>
| #endif
| #ifdef HAVE_SYS_STAT_H
| # include <sys/stat.h>
| #endif
| #ifdef STDC_HEADERS
| # include <stdlib.h>
| # include <stddef.h>
| #else
| # ifdef HAVE_STDLIB_H
| # include <stdlib.h>
| # endif
| #endif
| #ifdef HAVE_STRING_H
| # if !defined STDC_HEADERS && defined HAVE_MEMORY_H
| # include <memory.h>
| # endif
| # include <string.h>
| #endif
| #ifdef HAVE_STRINGS_H
| # include <strings.h>
| #endif
| #ifdef HAVE_INTTYPES_H
| # include <inttypes.h>
| #endif
| #ifdef HAVE_STDINT_H
| # include <stdint.h>
| #endif
| #ifdef HAVE_UNISTD_H
| # include <unistd.h>
| #endif
| int
| main ()
| {
| static struct stat ac_aggr;
| if (sizeof ac_aggr.st_atimensec)
| return 0;
| ;
| return 0;
| }
configure:14534: result: no
configure:14545: checking for struct stat.st_mtim
configure:14573: gcc-mp-4.2 -c -O -pipe -I/opt/local/include -D_XOPEN_SOURCE -D_DARWIN_C_SOURCE conftest.c >&5
conftest.c: In function 'main':
conftest.c:127: error: 'struct stat' has no member named 'st_mtim'
configure:14579: $? = 1
configure: failed program was:
| /* confdefs.h. */
| #define PACKAGE_NAME ""
| #define PACKAGE_TARNAME ""
| #define PACKAGE_VERSION ""
| #define PACKAGE_STRING ""
| #define PACKAGE_BUGREPORT ""
| #define USE_BUILTIN_FRAME_ADDRESS 1
| #define STDC_HEADERS 1
| #define HAVE_SYS_TYPES_H 1
| #define HAVE_SYS_STAT_H 1
| #define HAVE_STDLIB_H 1
| #define HAVE_STRING_H 1
| #define HAVE_MEMORY_H 1
| #define HAVE_STRINGS_H 1
| #define HAVE_INTTYPES_H 1
| #define HAVE_STDINT_H 1
| #define HAVE_UNISTD_H 1
| #define HAVE_LONG_LONG 1
| #define HAVE_OFF_T 1
| #define SIZEOF_INT 4
| #define SIZEOF_SHORT 2
| #define SIZEOF_LONG 4
| #define SIZEOF_LONG_LONG 8
| #define SIZEOF___INT64 0
| #define SIZEOF_OFF_T 8
| #define SIZEOF_VOIDP 4
| #define SIZEOF_FLOAT 4
| #define SIZEOF_DOUBLE 8
| #define SIZEOF_TIME_T 4
| #define rb_pid_t pid_t
| #define PIDT2NUM(v) LONG2NUM(v)
| #define NUM2PIDT(v) NUM2LONG(v)
| #define rb_uid_t uid_t
| #define UIDT2NUM(v) ULONG2NUM(v)
| #define NUM2UIDT(v) NUM2ULONG(v)
| #define rb_gid_t gid_t
| #define GIDT2NUM(v) ULONG2NUM(v)
| #define NUM2GIDT(v) NUM2ULONG(v)
| #define HAVE_PROTOTYPES 1
| #define TOKEN_PASTE(x,y) x##y
| #define STRINGIZE(expr) STRINGIZE0(expr)
| #define HAVE_STDARG_PROTOTYPES 1
| #define NORETURN(x) __attribute__ ((noreturn)) x
| #define DEPRECATED(x) __attribute__ ((deprecated)) x
| #define NOINLINE(x) __attribute__ ((noinline)) x
| #define FUNC_STDCALL(x) __attribute__ ((stdcall)) x
| #define FUNC_CDECL(x) __attribute__ ((cdecl)) x
| #define FUNC_FASTCALL(x) __attribute__ ((fastcall)) x
| #define HAVE_DECL_SYS_NERR 1
| #define BROKEN_SETREUID 1
| #define BROKEN_SETREGID 1
| #define HAVE_LIBDL 1
| #define HAVE_DIRENT_H 1
| #define STDC_HEADERS 1
| #define HAVE_SYS_WAIT_H 1
| #define HAVE_STDLIB_H 1
| #define HAVE_STRING_H 1
| #define HAVE_UNISTD_H 1
| #define HAVE_LIMITS_H 1
| #define HAVE_SYS_FILE_H 1
| #define HAVE_SYS_IOCTL_H 1
| #define HAVE_SYS_SYSCALL_H 1
| #define HAVE_FCNTL_H 1
| #define HAVE_SYS_FCNTL_H 1
| #define HAVE_SYS_SELECT_H 1
| #define HAVE_SYS_TIME_H 1
| #define HAVE_SYS_TIMES_H 1
| #define HAVE_SYS_PARAM_H 1
| #define HAVE_PWD_H 1
| #define HAVE_GRP_H 1
| #define HAVE_UTIME_H 1
| #define HAVE_MEMORY_H 1
| #define HAVE_SYS_RESOURCE_H 1
| #define HAVE_NETINET_IN_SYSTM_H 1
| #define HAVE_FLOAT_H 1
| #define HAVE_PTHREAD_H 1
| #define HAVE_UCONTEXT_H 1
| #define HAVE_LANGINFO_H 1
| #define HAVE_LOCALE_H 1
| #define SIZEOF_RLIM_T 8
| #define SIZEOF_SIZE_T 4
| #define HAVE_STRUCT_STAT_ST_BLKSIZE 1
| #define HAVE_ST_BLKSIZE 1
| #define HAVE_STRUCT_STAT_ST_BLOCKS 1
| #define HAVE_ST_BLOCKS 1
| #define HAVE_STRUCT_STAT_ST_RDEV 1
| #define HAVE_ST_RDEV 1
| #define HAVE_STRUCT_STAT_ST_ATIMESPEC 1
| /* end confdefs.h. */
| #include <stdio.h>
| #ifdef HAVE_SYS_TYPES_H
| # include <sys/types.h>
| #endif
| #ifdef HAVE_SYS_STAT_H
| # include <sys/stat.h>
| #endif
| #ifdef STDC_HEADERS
| # include <stdlib.h>
| # include <stddef.h>
| #else
| # ifdef HAVE_STDLIB_H
| # include <stdlib.h>
| # endif
| #endif
| #ifdef HAVE_STRING_H
| # if !defined STDC_HEADERS && defined HAVE_MEMORY_H
| # include <memory.h>
| # endif
| # include <string.h>
| #endif
| #ifdef HAVE_STRINGS_H
| # include <strings.h>
| #endif
| #ifdef HAVE_INTTYPES_H
| # include <inttypes.h>
| #endif
| #ifdef HAVE_STDINT_H
| # include <stdint.h>
| #endif
| #ifdef HAVE_UNISTD_H
| # include <unistd.h>
| #endif
| int
| main ()
| {
| static struct stat ac_aggr;
| if (ac_aggr.st_mtim)
| return 0;
| ;
| return 0;
| }
configure:14612: gcc-mp-4.2 -c -O -pipe -I/opt/local/include -D_XOPEN_SOURCE -D_DARWIN_C_SOURCE conftest.c >&5
conftest.c: In function 'main':
conftest.c:127: error: 'struct stat' has no member named 'st_mtim'
configure:14618: $? = 1
configure: failed program was:
| /* confdefs.h. */
| #define PACKAGE_NAME ""
| #define PACKAGE_TARNAME ""
| #define PACKAGE_VERSION ""
| #define PACKAGE_STRING ""
| #define PACKAGE_BUGREPORT ""
| #define USE_BUILTIN_FRAME_ADDRESS 1
| #define STDC_HEADERS 1
| #define HAVE_SYS_TYPES_H 1
| #define HAVE_SYS_STAT_H 1
| #define HAVE_STDLIB_H 1
| #define HAVE_STRING_H 1
| #define HAVE_MEMORY_H 1
| #define HAVE_STRINGS_H 1
| #define HAVE_INTTYPES_H 1
| #define HAVE_STDINT_H 1
| #define HAVE_UNISTD_H 1
| #define HAVE_LONG_LONG 1
| #define HAVE_OFF_T 1
| #define SIZEOF_INT 4
| #define SIZEOF_SHORT 2
| #define SIZEOF_LONG 4
| #define SIZEOF_LONG_LONG 8
| #define SIZEOF___INT64 0
| #define SIZEOF_OFF_T 8
| #define SIZEOF_VOIDP 4
| #define SIZEOF_FLOAT 4
| #define SIZEOF_DOUBLE 8
| #define SIZEOF_TIME_T 4
| #define rb_pid_t pid_t
| #define PIDT2NUM(v) LONG2NUM(v)
| #define NUM2PIDT(v) NUM2LONG(v)
| #define rb_uid_t uid_t
| #define UIDT2NUM(v) ULONG2NUM(v)
| #define NUM2UIDT(v) NUM2ULONG(v)
| #define rb_gid_t gid_t
| #define GIDT2NUM(v) ULONG2NUM(v)
| #define NUM2GIDT(v) NUM2ULONG(v)
| #define HAVE_PROTOTYPES 1
| #define TOKEN_PASTE(x,y) x##y
| #define STRINGIZE(expr) STRINGIZE0(expr)
| #define HAVE_STDARG_PROTOTYPES 1
| #define NORETURN(x) __attribute__ ((noreturn)) x
| #define DEPRECATED(x) __attribute__ ((deprecated)) x
| #define NOINLINE(x) __attribute__ ((noinline)) x
| #define FUNC_STDCALL(x) __attribute__ ((stdcall)) x
| #define FUNC_CDECL(x) __attribute__ ((cdecl)) x
| #define FUNC_FASTCALL(x) __attribute__ ((fastcall)) x
| #define HAVE_DECL_SYS_NERR 1
| #define BROKEN_SETREUID 1
| #define BROKEN_SETREGID 1
| #define HAVE_LIBDL 1
| #define HAVE_DIRENT_H 1
| #define STDC_HEADERS 1
| #define HAVE_SYS_WAIT_H 1
| #define HAVE_STDLIB_H 1
| #define HAVE_STRING_H 1
| #define HAVE_UNISTD_H 1
| #define HAVE_LIMITS_H 1
| #define HAVE_SYS_FILE_H 1
| #define HAVE_SYS_IOCTL_H 1
| #define HAVE_SYS_SYSCALL_H 1
| #define HAVE_FCNTL_H 1
| #define HAVE_SYS_FCNTL_H 1
| #define HAVE_SYS_SELECT_H 1
| #define HAVE_SYS_TIME_H 1
| #define HAVE_SYS_TIMES_H 1
| #define HAVE_SYS_PARAM_H 1
| #define HAVE_PWD_H 1
| #define HAVE_GRP_H 1
| #define HAVE_UTIME_H 1
| #define HAVE_MEMORY_H 1
| #define HAVE_SYS_RESOURCE_H 1
| #define HAVE_NETINET_IN_SYSTM_H 1
| #define HAVE_FLOAT_H 1
| #define HAVE_PTHREAD_H 1
| #define HAVE_UCONTEXT_H 1
| #define HAVE_LANGINFO_H 1
| #define HAVE_LOCALE_H 1
| #define SIZEOF_RLIM_T 8
| #define SIZEOF_SIZE_T 4
| #define HAVE_STRUCT_STAT_ST_BLKSIZE 1
| #define HAVE_ST_BLKSIZE 1
| #define HAVE_STRUCT_STAT_ST_BLOCKS 1
| #define HAVE_ST_BLOCKS 1
| #define HAVE_STRUCT_STAT_ST_RDEV 1
| #define HAVE_ST_RDEV 1
| #define HAVE_STRUCT_STAT_ST_ATIMESPEC 1
| /* end confdefs.h. */
| #include <stdio.h>
| #ifdef HAVE_SYS_TYPES_H
| # include <sys/types.h>
| #endif
| #ifdef HAVE_SYS_STAT_H
| # include <sys/stat.h>
| #endif
| #ifdef STDC_HEADERS
| # include <stdlib.h>
| # include <stddef.h>
| #else
| # ifdef HAVE_STDLIB_H
| # include <stdlib.h>
| # endif
| #endif
| #ifdef HAVE_STRING_H
| # if !defined STDC_HEADERS && defined HAVE_MEMORY_H
| # include <memory.h>
| # endif
| # include <string.h>
| #endif
| #ifdef HAVE_STRINGS_H
| # include <strings.h>
| #endif
| #ifdef HAVE_INTTYPES_H
| # include <inttypes.h>
| #endif
| #ifdef HAVE_STDINT_H
| # include <stdint.h>
| #endif
| #ifdef HAVE_UNISTD_H
| # include <unistd.h>
| #endif
| int
| main ()
| {
| static struct stat ac_aggr;
| if (sizeof ac_aggr.st_mtim)
| return 0;
| ;
| return 0;
| }
configure:14636: result: no
configure:14647: checking for struct stat.st_mtimespec
configure:14675: gcc-mp-4.2 -c -O -pipe -I/opt/local/include -D_XOPEN_SOURCE -D_DARWIN_C_SOURCE conftest.c >&5
conftest.c: In function 'main':
conftest.c:127: error: used struct type value where scalar is required
configure:14681: $? = 1
configure: failed program was:
| /* confdefs.h. */
| #define PACKAGE_NAME ""
| #define PACKAGE_TARNAME ""
| #define PACKAGE_VERSION ""
| #define PACKAGE_STRING ""
| #define PACKAGE_BUGREPORT ""
| #define USE_BUILTIN_FRAME_ADDRESS 1
| #define STDC_HEADERS 1
| #define HAVE_SYS_TYPES_H 1
| #define HAVE_SYS_STAT_H 1
| #define HAVE_STDLIB_H 1
| #define HAVE_STRING_H 1
| #define HAVE_MEMORY_H 1
| #define HAVE_STRINGS_H 1
| #define HAVE_INTTYPES_H 1
| #define HAVE_STDINT_H 1
| #define HAVE_UNISTD_H 1
| #define HAVE_LONG_LONG 1
| #define HAVE_OFF_T 1
| #define SIZEOF_INT 4
| #define SIZEOF_SHORT 2
| #define SIZEOF_LONG 4
| #define SIZEOF_LONG_LONG 8
| #define SIZEOF___INT64 0
| #define SIZEOF_OFF_T 8
| #define SIZEOF_VOIDP 4
| #define SIZEOF_FLOAT 4
| #define SIZEOF_DOUBLE 8
| #define SIZEOF_TIME_T 4
| #define rb_pid_t pid_t
| #define PIDT2NUM(v) LONG2NUM(v)
| #define NUM2PIDT(v) NUM2LONG(v)
| #define rb_uid_t uid_t
| #define UIDT2NUM(v) ULONG2NUM(v)
| #define NUM2UIDT(v) NUM2ULONG(v)
| #define rb_gid_t gid_t
| #define GIDT2NUM(v) ULONG2NUM(v)
| #define NUM2GIDT(v) NUM2ULONG(v)
| #define HAVE_PROTOTYPES 1
| #define TOKEN_PASTE(x,y) x##y
| #define STRINGIZE(expr) STRINGIZE0(expr)
| #define HAVE_STDARG_PROTOTYPES 1
| #define NORETURN(x) __attribute__ ((noreturn)) x
| #define DEPRECATED(x) __attribute__ ((deprecated)) x
| #define NOINLINE(x) __attribute__ ((noinline)) x
| #define FUNC_STDCALL(x) __attribute__ ((stdcall)) x
| #define FUNC_CDECL(x) __attribute__ ((cdecl)) x
| #define FUNC_FASTCALL(x) __attribute__ ((fastcall)) x
| #define HAVE_DECL_SYS_NERR 1
| #define BROKEN_SETREUID 1
| #define BROKEN_SETREGID 1
| #define HAVE_LIBDL 1
| #define HAVE_DIRENT_H 1
| #define STDC_HEADERS 1
| #define HAVE_SYS_WAIT_H 1
| #define HAVE_STDLIB_H 1
| #define HAVE_STRING_H 1
| #define HAVE_UNISTD_H 1
| #define HAVE_LIMITS_H 1
| #define HAVE_SYS_FILE_H 1
| #define HAVE_SYS_IOCTL_H 1
| #define HAVE_SYS_SYSCALL_H 1
| #define HAVE_FCNTL_H 1
| #define HAVE_SYS_FCNTL_H 1
| #define HAVE_SYS_SELECT_H 1
| #define HAVE_SYS_TIME_H 1
| #define HAVE_SYS_TIMES_H 1
| #define HAVE_SYS_PARAM_H 1
| #define HAVE_PWD_H 1
| #define HAVE_GRP_H 1
| #define HAVE_UTIME_H 1
| #define HAVE_MEMORY_H 1
| #define HAVE_SYS_RESOURCE_H 1
| #define HAVE_NETINET_IN_SYSTM_H 1
| #define HAVE_FLOAT_H 1
| #define HAVE_PTHREAD_H 1
| #define HAVE_UCONTEXT_H 1
| #define HAVE_LANGINFO_H 1
| #define HAVE_LOCALE_H 1
| #define SIZEOF_RLIM_T 8
| #define SIZEOF_SIZE_T 4
| #define HAVE_STRUCT_STAT_ST_BLKSIZE 1
| #define HAVE_ST_BLKSIZE 1
| #define HAVE_STRUCT_STAT_ST_BLOCKS 1
| #define HAVE_ST_BLOCKS 1
| #define HAVE_STRUCT_STAT_ST_RDEV 1
| #define HAVE_ST_RDEV 1
| #define HAVE_STRUCT_STAT_ST_ATIMESPEC 1
| /* end confdefs.h. */
| #include <stdio.h>
| #ifdef HAVE_SYS_TYPES_H
| # include <sys/types.h>
| #endif
| #ifdef HAVE_SYS_STAT_H
| # include <sys/stat.h>
| #endif
| #ifdef STDC_HEADERS
| # include <stdlib.h>
| # include <stddef.h>
| #else
| # ifdef HAVE_STDLIB_H
| # include <stdlib.h>
| # endif
| #endif
| #ifdef HAVE_STRING_H
| # if !defined STDC_HEADERS && defined HAVE_MEMORY_H
| # include <memory.h>
| # endif
| # include <string.h>
| #endif
| #ifdef HAVE_STRINGS_H
| # include <strings.h>
| #endif
| #ifdef HAVE_INTTYPES_H
| # include <inttypes.h>
| #endif
| #ifdef HAVE_STDINT_H
| # include <stdint.h>
| #endif
| #ifdef HAVE_UNISTD_H
| # include <unistd.h>
| #endif
| int
| main ()
| {
| static struct stat ac_aggr;
| if (ac_aggr.st_mtimespec)
| return 0;
| ;
| return 0;
| }
configure:14714: gcc-mp-4.2 -c -O -pipe -I/opt/local/include -D_XOPEN_SOURCE -D_DARWIN_C_SOURCE conftest.c >&5
configure:14720: $? = 0
configure:14738: result: yes
configure:14749: checking for struct stat.st_mtimensec
configure:14777: gcc-mp-4.2 -c -O -pipe -I/opt/local/include -D_XOPEN_SOURCE -D_DARWIN_C_SOURCE conftest.c >&5
conftest.c: In function 'main':
conftest.c:128: error: 'struct stat' has no member named 'st_mtimensec'
configure:14783: $? = 1
configure: failed program was:
| /* confdefs.h. */
| #define PACKAGE_NAME ""
| #define PACKAGE_TARNAME ""
| #define PACKAGE_VERSION ""
| #define PACKAGE_STRING ""
| #define PACKAGE_BUGREPORT ""
| #define USE_BUILTIN_FRAME_ADDRESS 1
| #define STDC_HEADERS 1
| #define HAVE_SYS_TYPES_H 1
| #define HAVE_SYS_STAT_H 1
| #define HAVE_STDLIB_H 1
| #define HAVE_STRING_H 1
| #define HAVE_MEMORY_H 1
| #define HAVE_STRINGS_H 1
| #define HAVE_INTTYPES_H 1
| #define HAVE_STDINT_H 1
| #define HAVE_UNISTD_H 1
| #define HAVE_LONG_LONG 1
| #define HAVE_OFF_T 1
| #define SIZEOF_INT 4
| #define SIZEOF_SHORT 2
| #define SIZEOF_LONG 4
| #define SIZEOF_LONG_LONG 8
| #define SIZEOF___INT64 0
| #define SIZEOF_OFF_T 8
| #define SIZEOF_VOIDP 4
| #define SIZEOF_FLOAT 4
| #define SIZEOF_DOUBLE 8
| #define SIZEOF_TIME_T 4
| #define rb_pid_t pid_t
| #define PIDT2NUM(v) LONG2NUM(v)
| #define NUM2PIDT(v) NUM2LONG(v)
| #define rb_uid_t uid_t
| #define UIDT2NUM(v) ULONG2NUM(v)
| #define NUM2UIDT(v) NUM2ULONG(v)
| #define rb_gid_t gid_t
| #define GIDT2NUM(v) ULONG2NUM(v)
| #define NUM2GIDT(v) NUM2ULONG(v)
| #define HAVE_PROTOTYPES 1
| #define TOKEN_PASTE(x,y) x##y
| #define STRINGIZE(expr) STRINGIZE0(expr)
| #define HAVE_STDARG_PROTOTYPES 1
| #define NORETURN(x) __attribute__ ((noreturn)) x
| #define DEPRECATED(x) __attribute__ ((deprecated)) x
| #define NOINLINE(x) __attribute__ ((noinline)) x
| #define FUNC_STDCALL(x) __attribute__ ((stdcall)) x
| #define FUNC_CDECL(x) __attribute__ ((cdecl)) x
| #define FUNC_FASTCALL(x) __attribute__ ((fastcall)) x
| #define HAVE_DECL_SYS_NERR 1
| #define BROKEN_SETREUID 1
| #define BROKEN_SETREGID 1
| #define HAVE_LIBDL 1
| #define HAVE_DIRENT_H 1
| #define STDC_HEADERS 1
| #define HAVE_SYS_WAIT_H 1
| #define HAVE_STDLIB_H 1
| #define HAVE_STRING_H 1
| #define HAVE_UNISTD_H 1
| #define HAVE_LIMITS_H 1
| #define HAVE_SYS_FILE_H 1
| #define HAVE_SYS_IOCTL_H 1
| #define HAVE_SYS_SYSCALL_H 1
| #define HAVE_FCNTL_H 1
| #define HAVE_SYS_FCNTL_H 1
| #define HAVE_SYS_SELECT_H 1
| #define HAVE_SYS_TIME_H 1
| #define HAVE_SYS_TIMES_H 1
| #define HAVE_SYS_PARAM_H 1
| #define HAVE_PWD_H 1
| #define HAVE_GRP_H 1
| #define HAVE_UTIME_H 1
| #define HAVE_MEMORY_H 1
| #define HAVE_SYS_RESOURCE_H 1
| #define HAVE_NETINET_IN_SYSTM_H 1
| #define HAVE_FLOAT_H 1
| #define HAVE_PTHREAD_H 1
| #define HAVE_UCONTEXT_H 1
| #define HAVE_LANGINFO_H 1
| #define HAVE_LOCALE_H 1
| #define SIZEOF_RLIM_T 8
| #define SIZEOF_SIZE_T 4
| #define HAVE_STRUCT_STAT_ST_BLKSIZE 1
| #define HAVE_ST_BLKSIZE 1
| #define HAVE_STRUCT_STAT_ST_BLOCKS 1
| #define HAVE_ST_BLOCKS 1
| #define HAVE_STRUCT_STAT_ST_RDEV 1
| #define HAVE_ST_RDEV 1
| #define HAVE_STRUCT_STAT_ST_ATIMESPEC 1
| #define HAVE_STRUCT_STAT_ST_MTIMESPEC 1
| /* end confdefs.h. */
| #include <stdio.h>
| #ifdef HAVE_SYS_TYPES_H
| # include <sys/types.h>
| #endif
| #ifdef HAVE_SYS_STAT_H
| # include <sys/stat.h>
| #endif
| #ifdef STDC_HEADERS
| # include <stdlib.h>
| # include <stddef.h>
| #else
| # ifdef HAVE_STDLIB_H
| # include <stdlib.h>
| # endif
| #endif
| #ifdef HAVE_STRING_H
| # if !defined STDC_HEADERS && defined HAVE_MEMORY_H
| # include <memory.h>
| # endif
| # include <string.h>
| #endif
| #ifdef HAVE_STRINGS_H
| # include <strings.h>
| #endif
| #ifdef HAVE_INTTYPES_H
| # include <inttypes.h>
| #endif
| #ifdef HAVE_STDINT_H
| # include <stdint.h>
| #endif
| #ifdef HAVE_UNISTD_H
| # include <unistd.h>
| #endif
| int
| main ()
| {
| static struct stat ac_aggr;
| if (ac_aggr.st_mtimensec)
| return 0;
| ;
| return 0;
| }
configure:14816: gcc-mp-4.2 -c -O -pipe -I/opt/local/include -D_XOPEN_SOURCE -D_DARWIN_C_SOURCE conftest.c >&5
conftest.c: In function 'main':
conftest.c:128: error: 'struct stat' has no member named 'st_mtimensec'
configure:14822: $? = 1
configure: failed program was:
| /* confdefs.h. */
| #define PACKAGE_NAME ""
| #define PACKAGE_TARNAME ""
| #define PACKAGE_VERSION ""
| #define PACKAGE_STRING ""
| #define PACKAGE_BUGREPORT ""
| #define USE_BUILTIN_FRAME_ADDRESS 1
| #define STDC_HEADERS 1
| #define HAVE_SYS_TYPES_H 1
| #define HAVE_SYS_STAT_H 1
| #define HAVE_STDLIB_H 1
| #define HAVE_STRING_H 1
| #define HAVE_MEMORY_H 1
| #define HAVE_STRINGS_H 1
| #define HAVE_INTTYPES_H 1
| #define HAVE_STDINT_H 1
| #define HAVE_UNISTD_H 1
| #define HAVE_LONG_LONG 1
| #define HAVE_OFF_T 1
| #define SIZEOF_INT 4
| #define SIZEOF_SHORT 2
| #define SIZEOF_LONG 4
| #define SIZEOF_LONG_LONG 8
| #define SIZEOF___INT64 0
| #define SIZEOF_OFF_T 8
| #define SIZEOF_VOIDP 4
| #define SIZEOF_FLOAT 4
| #define SIZEOF_DOUBLE 8
| #define SIZEOF_TIME_T 4
| #define rb_pid_t pid_t
| #define PIDT2NUM(v) LONG2NUM(v)
| #define NUM2PIDT(v) NUM2LONG(v)
| #define rb_uid_t uid_t
| #define UIDT2NUM(v) ULONG2NUM(v)
| #define NUM2UIDT(v) NUM2ULONG(v)
| #define rb_gid_t gid_t
| #define GIDT2NUM(v) ULONG2NUM(v)
| #define NUM2GIDT(v) NUM2ULONG(v)
| #define HAVE_PROTOTYPES 1
| #define TOKEN_PASTE(x,y) x##y
| #define STRINGIZE(expr) STRINGIZE0(expr)
| #define HAVE_STDARG_PROTOTYPES 1
| #define NORETURN(x) __attribute__ ((noreturn)) x
| #define DEPRECATED(x) __attribute__ ((deprecated)) x
| #define NOINLINE(x) __attribute__ ((noinline)) x
| #define FUNC_STDCALL(x) __attribute__ ((stdcall)) x
| #define FUNC_CDECL(x) __attribute__ ((cdecl)) x
| #define FUNC_FASTCALL(x) __attribute__ ((fastcall)) x
| #define HAVE_DECL_SYS_NERR 1
| #define BROKEN_SETREUID 1
| #define BROKEN_SETREGID 1
| #define HAVE_LIBDL 1
| #define HAVE_DIRENT_H 1
| #define STDC_HEADERS 1
| #define HAVE_SYS_WAIT_H 1
| #define HAVE_STDLIB_H 1
| #define HAVE_STRING_H 1
| #define HAVE_UNISTD_H 1
| #define HAVE_LIMITS_H 1
| #define HAVE_SYS_FILE_H 1
| #define HAVE_SYS_IOCTL_H 1
| #define HAVE_SYS_SYSCALL_H 1
| #define HAVE_FCNTL_H 1
| #define HAVE_SYS_FCNTL_H 1
| #define HAVE_SYS_SELECT_H 1
| #define HAVE_SYS_TIME_H 1
| #define HAVE_SYS_TIMES_H 1
| #define HAVE_SYS_PARAM_H 1
| #define HAVE_PWD_H 1
| #define HAVE_GRP_H 1
| #define HAVE_UTIME_H 1
| #define HAVE_MEMORY_H 1
| #define HAVE_SYS_RESOURCE_H 1
| #define HAVE_NETINET_IN_SYSTM_H 1
| #define HAVE_FLOAT_H 1
| #define HAVE_PTHREAD_H 1
| #define HAVE_UCONTEXT_H 1
| #define HAVE_LANGINFO_H 1
| #define HAVE_LOCALE_H 1
| #define SIZEOF_RLIM_T 8
| #define SIZEOF_SIZE_T 4
| #define HAVE_STRUCT_STAT_ST_BLKSIZE 1
| #define HAVE_ST_BLKSIZE 1
| #define HAVE_STRUCT_STAT_ST_BLOCKS 1
| #define HAVE_ST_BLOCKS 1
| #define HAVE_STRUCT_STAT_ST_RDEV 1
| #define HAVE_ST_RDEV 1
| #define HAVE_STRUCT_STAT_ST_ATIMESPEC 1
| #define HAVE_STRUCT_STAT_ST_MTIMESPEC 1
| /* end confdefs.h. */
| #include <stdio.h>
| #ifdef HAVE_SYS_TYPES_H
| # include <sys/types.h>
| #endif
| #ifdef HAVE_SYS_STAT_H
| # include <sys/stat.h>
| #endif
| #ifdef STDC_HEADERS
| # include <stdlib.h>
| # include <stddef.h>
| #else
| # ifdef HAVE_STDLIB_H
| # include <stdlib.h>
| # endif
| #endif
| #ifdef HAVE_STRING_H
| # if !defined STDC_HEADERS && defined HAVE_MEMORY_H
| # include <memory.h>
| # endif
| # include <string.h>
| #endif
| #ifdef HAVE_STRINGS_H
| # include <strings.h>
| #endif
| #ifdef HAVE_INTTYPES_H
| # include <inttypes.h>
| #endif
| #ifdef HAVE_STDINT_H
| # include <stdint.h>
| #endif
| #ifdef HAVE_UNISTD_H
| # include <unistd.h>
| #endif
| int
| main ()
| {
| static struct stat ac_aggr;
| if (sizeof ac_aggr.st_mtimensec)
| return 0;
| ;
| return 0;
| }
configure:14840: result: no
configure:14851: checking for struct stat.st_ctim
configure:14879: gcc-mp-4.2 -c -O -pipe -I/opt/local/include -D_XOPEN_SOURCE -D_DARWIN_C_SOURCE conftest.c >&5
conftest.c: In function 'main':
conftest.c:128: error: 'struct stat' has no member named 'st_ctim'
configure:14885: $? = 1
configure: failed program was:
| /* confdefs.h. */
| #define PACKAGE_NAME ""
| #define PACKAGE_TARNAME ""
| #define PACKAGE_VERSION ""
| #define PACKAGE_STRING ""
| #define PACKAGE_BUGREPORT ""
| #define USE_BUILTIN_FRAME_ADDRESS 1
| #define STDC_HEADERS 1
| #define HAVE_SYS_TYPES_H 1
| #define HAVE_SYS_STAT_H 1
| #define HAVE_STDLIB_H 1
| #define HAVE_STRING_H 1
| #define HAVE_MEMORY_H 1
| #define HAVE_STRINGS_H 1
| #define HAVE_INTTYPES_H 1
| #define HAVE_STDINT_H 1
| #define HAVE_UNISTD_H 1
| #define HAVE_LONG_LONG 1
| #define HAVE_OFF_T 1
| #define SIZEOF_INT 4
| #define SIZEOF_SHORT 2
| #define SIZEOF_LONG 4
| #define SIZEOF_LONG_LONG 8
| #define SIZEOF___INT64 0
| #define SIZEOF_OFF_T 8
| #define SIZEOF_VOIDP 4
| #define SIZEOF_FLOAT 4
| #define SIZEOF_DOUBLE 8
| #define SIZEOF_TIME_T 4
| #define rb_pid_t pid_t
| #define PIDT2NUM(v) LONG2NUM(v)
| #define NUM2PIDT(v) NUM2LONG(v)
| #define rb_uid_t uid_t
| #define UIDT2NUM(v) ULONG2NUM(v)
| #define NUM2UIDT(v) NUM2ULONG(v)
| #define rb_gid_t gid_t
| #define GIDT2NUM(v) ULONG2NUM(v)
| #define NUM2GIDT(v) NUM2ULONG(v)
| #define HAVE_PROTOTYPES 1
| #define TOKEN_PASTE(x,y) x##y
| #define STRINGIZE(expr) STRINGIZE0(expr)
| #define HAVE_STDARG_PROTOTYPES 1
| #define NORETURN(x) __attribute__ ((noreturn)) x
| #define DEPRECATED(x) __attribute__ ((deprecated)) x
| #define NOINLINE(x) __attribute__ ((noinline)) x
| #define FUNC_STDCALL(x) __attribute__ ((stdcall)) x
| #define FUNC_CDECL(x) __attribute__ ((cdecl)) x
| #define FUNC_FASTCALL(x) __attribute__ ((fastcall)) x
| #define HAVE_DECL_SYS_NERR 1
| #define BROKEN_SETREUID 1
| #define BROKEN_SETREGID 1
| #define HAVE_LIBDL 1
| #define HAVE_DIRENT_H 1
| #define STDC_HEADERS 1
| #define HAVE_SYS_WAIT_H 1
| #define HAVE_STDLIB_H 1
| #define HAVE_STRING_H 1
| #define HAVE_UNISTD_H 1
| #define HAVE_LIMITS_H 1
| #define HAVE_SYS_FILE_H 1
| #define HAVE_SYS_IOCTL_H 1
| #define HAVE_SYS_SYSCALL_H 1
| #define HAVE_FCNTL_H 1
| #define HAVE_SYS_FCNTL_H 1
| #define HAVE_SYS_SELECT_H 1
| #define HAVE_SYS_TIME_H 1
| #define HAVE_SYS_TIMES_H 1
| #define HAVE_SYS_PARAM_H 1
| #define HAVE_PWD_H 1
| #define HAVE_GRP_H 1
| #define HAVE_UTIME_H 1
| #define HAVE_MEMORY_H 1
| #define HAVE_SYS_RESOURCE_H 1
| #define HAVE_NETINET_IN_SYSTM_H 1
| #define HAVE_FLOAT_H 1
| #define HAVE_PTHREAD_H 1
| #define HAVE_UCONTEXT_H 1
| #define HAVE_LANGINFO_H 1
| #define HAVE_LOCALE_H 1
| #define SIZEOF_RLIM_T 8
| #define SIZEOF_SIZE_T 4
| #define HAVE_STRUCT_STAT_ST_BLKSIZE 1
| #define HAVE_ST_BLKSIZE 1
| #define HAVE_STRUCT_STAT_ST_BLOCKS 1
| #define HAVE_ST_BLOCKS 1
| #define HAVE_STRUCT_STAT_ST_RDEV 1
| #define HAVE_ST_RDEV 1
| #define HAVE_STRUCT_STAT_ST_ATIMESPEC 1
| #define HAVE_STRUCT_STAT_ST_MTIMESPEC 1
| /* end confdefs.h. */
| #include <stdio.h>
| #ifdef HAVE_SYS_TYPES_H
| # include <sys/types.h>
| #endif
| #ifdef HAVE_SYS_STAT_H
| # include <sys/stat.h>
| #endif
| #ifdef STDC_HEADERS
| # include <stdlib.h>
| # include <stddef.h>
| #else
| # ifdef HAVE_STDLIB_H
| # include <stdlib.h>
| # endif
| #endif
| #ifdef HAVE_STRING_H
| # if !defined STDC_HEADERS && defined HAVE_MEMORY_H
| # include <memory.h>
| # endif
| # include <string.h>
| #endif
| #ifdef HAVE_STRINGS_H
| # include <strings.h>
| #endif
| #ifdef HAVE_INTTYPES_H
| # include <inttypes.h>
| #endif
| #ifdef HAVE_STDINT_H
| # include <stdint.h>
| #endif
| #ifdef HAVE_UNISTD_H
| # include <unistd.h>
| #endif
| int
| main ()
| {
| static struct stat ac_aggr;
| if (ac_aggr.st_ctim)
| return 0;
| ;
| return 0;
| }
configure:14918: gcc-mp-4.2 -c -O -pipe -I/opt/local/include -D_XOPEN_SOURCE -D_DARWIN_C_SOURCE conftest.c >&5
conftest.c: In function 'main':
conftest.c:128: error: 'struct stat' has no member named 'st_ctim'
configure:14924: $? = 1
configure: failed program was:
| /* confdefs.h. */
| #define PACKAGE_NAME ""
| #define PACKAGE_TARNAME ""
| #define PACKAGE_VERSION ""
| #define PACKAGE_STRING ""
| #define PACKAGE_BUGREPORT ""
| #define USE_BUILTIN_FRAME_ADDRESS 1
| #define STDC_HEADERS 1
| #define HAVE_SYS_TYPES_H 1
| #define HAVE_SYS_STAT_H 1
| #define HAVE_STDLIB_H 1
| #define HAVE_STRING_H 1
| #define HAVE_MEMORY_H 1
| #define HAVE_STRINGS_H 1
| #define HAVE_INTTYPES_H 1
| #define HAVE_STDINT_H 1
| #define HAVE_UNISTD_H 1
| #define HAVE_LONG_LONG 1
| #define HAVE_OFF_T 1
| #define SIZEOF_INT 4
| #define SIZEOF_SHORT 2
| #define SIZEOF_LONG 4
| #define SIZEOF_LONG_LONG 8
| #define SIZEOF___INT64 0
| #define SIZEOF_OFF_T 8
| #define SIZEOF_VOIDP 4
| #define SIZEOF_FLOAT 4
| #define SIZEOF_DOUBLE 8
| #define SIZEOF_TIME_T 4
| #define rb_pid_t pid_t
| #define PIDT2NUM(v) LONG2NUM(v)
| #define NUM2PIDT(v) NUM2LONG(v)
| #define rb_uid_t uid_t
| #define UIDT2NUM(v) ULONG2NUM(v)
| #define NUM2UIDT(v) NUM2ULONG(v)
| #define rb_gid_t gid_t
| #define GIDT2NUM(v) ULONG2NUM(v)
| #define NUM2GIDT(v) NUM2ULONG(v)
| #define HAVE_PROTOTYPES 1
| #define TOKEN_PASTE(x,y) x##y
| #define STRINGIZE(expr) STRINGIZE0(expr)
| #define HAVE_STDARG_PROTOTYPES 1
| #define NORETURN(x) __attribute__ ((noreturn)) x
| #define DEPRECATED(x) __attribute__ ((deprecated)) x
| #define NOINLINE(x) __attribute__ ((noinline)) x
| #define FUNC_STDCALL(x) __attribute__ ((stdcall)) x
| #define FUNC_CDECL(x) __attribute__ ((cdecl)) x
| #define FUNC_FASTCALL(x) __attribute__ ((fastcall)) x
| #define HAVE_DECL_SYS_NERR 1
| #define BROKEN_SETREUID 1
| #define BROKEN_SETREGID 1
| #define HAVE_LIBDL 1
| #define HAVE_DIRENT_H 1
| #define STDC_HEADERS 1
| #define HAVE_SYS_WAIT_H 1
| #define HAVE_STDLIB_H 1
| #define HAVE_STRING_H 1
| #define HAVE_UNISTD_H 1
| #define HAVE_LIMITS_H 1
| #define HAVE_SYS_FILE_H 1
| #define HAVE_SYS_IOCTL_H 1
| #define HAVE_SYS_SYSCALL_H 1
| #define HAVE_FCNTL_H 1
| #define HAVE_SYS_FCNTL_H 1
| #define HAVE_SYS_SELECT_H 1
| #define HAVE_SYS_TIME_H 1
| #define HAVE_SYS_TIMES_H 1
| #define HAVE_SYS_PARAM_H 1
| #define HAVE_PWD_H 1
| #define HAVE_GRP_H 1
| #define HAVE_UTIME_H 1
| #define HAVE_MEMORY_H 1
| #define HAVE_SYS_RESOURCE_H 1
| #define HAVE_NETINET_IN_SYSTM_H 1
| #define HAVE_FLOAT_H 1
| #define HAVE_PTHREAD_H 1
| #define HAVE_UCONTEXT_H 1
| #define HAVE_LANGINFO_H 1
| #define HAVE_LOCALE_H 1
| #define SIZEOF_RLIM_T 8
| #define SIZEOF_SIZE_T 4
| #define HAVE_STRUCT_STAT_ST_BLKSIZE 1
| #define HAVE_ST_BLKSIZE 1
| #define HAVE_STRUCT_STAT_ST_BLOCKS 1
| #define HAVE_ST_BLOCKS 1
| #define HAVE_STRUCT_STAT_ST_RDEV 1
| #define HAVE_ST_RDEV 1
| #define HAVE_STRUCT_STAT_ST_ATIMESPEC 1
| #define HAVE_STRUCT_STAT_ST_MTIMESPEC 1
| /* end confdefs.h. */
| #include <stdio.h>
| #ifdef HAVE_SYS_TYPES_H
| # include <sys/types.h>
| #endif
| #ifdef HAVE_SYS_STAT_H
| # include <sys/stat.h>
| #endif
| #ifdef STDC_HEADERS
| # include <stdlib.h>
| # include <stddef.h>
| #else
| # ifdef HAVE_STDLIB_H
| # include <stdlib.h>
| # endif
| #endif
| #ifdef HAVE_STRING_H
| # if !defined STDC_HEADERS && defined HAVE_MEMORY_H
| # include <memory.h>
| # endif
| # include <string.h>
| #endif
| #ifdef HAVE_STRINGS_H
| # include <strings.h>
| #endif
| #ifdef HAVE_INTTYPES_H
| # include <inttypes.h>
| #endif
| #ifdef HAVE_STDINT_H
| # include <stdint.h>
| #endif
| #ifdef HAVE_UNISTD_H
| # include <unistd.h>
| #endif
| int
| main ()
| {
| static struct stat ac_aggr;
| if (sizeof ac_aggr.st_ctim)
| return 0;
| ;
| return 0;
| }
configure:14942: result: no
configure:14953: checking for struct stat.st_ctimespec
configure:14981: gcc-mp-4.2 -c -O -pipe -I/opt/local/include -D_XOPEN_SOURCE -D_DARWIN_C_SOURCE conftest.c >&5
conftest.c: In function 'main':
conftest.c:128: error: used struct type value where scalar is required
configure:14987: $? = 1
configure: failed program was:
| /* confdefs.h. */
| #define PACKAGE_NAME ""
| #define PACKAGE_TARNAME ""
| #define PACKAGE_VERSION ""
| #define PACKAGE_STRING ""
| #define PACKAGE_BUGREPORT ""
| #define USE_BUILTIN_FRAME_ADDRESS 1
| #define STDC_HEADERS 1
| #define HAVE_SYS_TYPES_H 1
| #define HAVE_SYS_STAT_H 1
| #define HAVE_STDLIB_H 1
| #define HAVE_STRING_H 1
| #define HAVE_MEMORY_H 1
| #define HAVE_STRINGS_H 1
| #define HAVE_INTTYPES_H 1
| #define HAVE_STDINT_H 1
| #define HAVE_UNISTD_H 1
| #define HAVE_LONG_LONG 1
| #define HAVE_OFF_T 1
| #define SIZEOF_INT 4
| #define SIZEOF_SHORT 2
| #define SIZEOF_LONG 4
| #define SIZEOF_LONG_LONG 8
| #define SIZEOF___INT64 0
| #define SIZEOF_OFF_T 8
| #define SIZEOF_VOIDP 4
| #define SIZEOF_FLOAT 4
| #define SIZEOF_DOUBLE 8
| #define SIZEOF_TIME_T 4
| #define rb_pid_t pid_t
| #define PIDT2NUM(v) LONG2NUM(v)
| #define NUM2PIDT(v) NUM2LONG(v)
| #define rb_uid_t uid_t
| #define UIDT2NUM(v) ULONG2NUM(v)
| #define NUM2UIDT(v) NUM2ULONG(v)
| #define rb_gid_t gid_t
| #define GIDT2NUM(v) ULONG2NUM(v)
| #define NUM2GIDT(v) NUM2ULONG(v)
| #define HAVE_PROTOTYPES 1
| #define TOKEN_PASTE(x,y) x##y
| #define STRINGIZE(expr) STRINGIZE0(expr)
| #define HAVE_STDARG_PROTOTYPES 1
| #define NORETURN(x) __attribute__ ((noreturn)) x
| #define DEPRECATED(x) __attribute__ ((deprecated)) x
| #define NOINLINE(x) __attribute__ ((noinline)) x
| #define FUNC_STDCALL(x) __attribute__ ((stdcall)) x
| #define FUNC_CDECL(x) __attribute__ ((cdecl)) x
| #define FUNC_FASTCALL(x) __attribute__ ((fastcall)) x
| #define HAVE_DECL_SYS_NERR 1
| #define BROKEN_SETREUID 1
| #define BROKEN_SETREGID 1
| #define HAVE_LIBDL 1
| #define HAVE_DIRENT_H 1
| #define STDC_HEADERS 1
| #define HAVE_SYS_WAIT_H 1
| #define HAVE_STDLIB_H 1
| #define HAVE_STRING_H 1
| #define HAVE_UNISTD_H 1
| #define HAVE_LIMITS_H 1
| #define HAVE_SYS_FILE_H 1
| #define HAVE_SYS_IOCTL_H 1
| #define HAVE_SYS_SYSCALL_H 1
| #define HAVE_FCNTL_H 1
| #define HAVE_SYS_FCNTL_H 1
| #define HAVE_SYS_SELECT_H 1
| #define HAVE_SYS_TIME_H 1
| #define HAVE_SYS_TIMES_H 1
| #define HAVE_SYS_PARAM_H 1
| #define HAVE_PWD_H 1
| #define HAVE_GRP_H 1
| #define HAVE_UTIME_H 1
| #define HAVE_MEMORY_H 1
| #define HAVE_SYS_RESOURCE_H 1
| #define HAVE_NETINET_IN_SYSTM_H 1
| #define HAVE_FLOAT_H 1
| #define HAVE_PTHREAD_H 1
| #define HAVE_UCONTEXT_H 1
| #define HAVE_LANGINFO_H 1
| #define HAVE_LOCALE_H 1
| #define SIZEOF_RLIM_T 8
| #define SIZEOF_SIZE_T 4
| #define HAVE_STRUCT_STAT_ST_BLKSIZE 1
| #define HAVE_ST_BLKSIZE 1
| #define HAVE_STRUCT_STAT_ST_BLOCKS 1
| #define HAVE_ST_BLOCKS 1
| #define HAVE_STRUCT_STAT_ST_RDEV 1
| #define HAVE_ST_RDEV 1
| #define HAVE_STRUCT_STAT_ST_ATIMESPEC 1
| #define HAVE_STRUCT_STAT_ST_MTIMESPEC 1
| /* end confdefs.h. */
| #include <stdio.h>
| #ifdef HAVE_SYS_TYPES_H
| # include <sys/types.h>
| #endif
| #ifdef HAVE_SYS_STAT_H
| # include <sys/stat.h>
| #endif
| #ifdef STDC_HEADERS
| # include <stdlib.h>
| # include <stddef.h>
| #else
| # ifdef HAVE_STDLIB_H
| # include <stdlib.h>
| # endif
| #endif
| #ifdef HAVE_STRING_H
| # if !defined STDC_HEADERS && defined HAVE_MEMORY_H
| # include <memory.h>
| # endif
| # include <string.h>
| #endif
| #ifdef HAVE_STRINGS_H
| # include <strings.h>
| #endif
| #ifdef HAVE_INTTYPES_H
| # include <inttypes.h>
| #endif
| #ifdef HAVE_STDINT_H
| # include <stdint.h>
| #endif
| #ifdef HAVE_UNISTD_H
| # include <unistd.h>
| #endif
| int
| main ()
| {
| static struct stat ac_aggr;
| if (ac_aggr.st_ctimespec)
| return 0;
| ;
| return 0;
| }
configure:15020: gcc-mp-4.2 -c -O -pipe -I/opt/local/include -D_XOPEN_SOURCE -D_DARWIN_C_SOURCE conftest.c >&5
configure:15026: $? = 0
configure:15044: result: yes
configure:15055: checking for struct stat.st_ctimensec
configure:15083: gcc-mp-4.2 -c -O -pipe -I/opt/local/include -D_XOPEN_SOURCE -D_DARWIN_C_SOURCE conftest.c >&5
conftest.c: In function 'main':
conftest.c:129: error: 'struct stat' has no member named 'st_ctimensec'
configure:15089: $? = 1
configure: failed program was:
| /* confdefs.h. */
| #define PACKAGE_NAME ""
| #define PACKAGE_TARNAME ""
| #define PACKAGE_VERSION ""
| #define PACKAGE_STRING ""
| #define PACKAGE_BUGREPORT ""
| #define USE_BUILTIN_FRAME_ADDRESS 1
| #define STDC_HEADERS 1
| #define HAVE_SYS_TYPES_H 1
| #define HAVE_SYS_STAT_H 1
| #define HAVE_STDLIB_H 1
| #define HAVE_STRING_H 1
| #define HAVE_MEMORY_H 1
| #define HAVE_STRINGS_H 1
| #define HAVE_INTTYPES_H 1
| #define HAVE_STDINT_H 1
| #define HAVE_UNISTD_H 1
| #define HAVE_LONG_LONG 1
| #define HAVE_OFF_T 1
| #define SIZEOF_INT 4
| #define SIZEOF_SHORT 2
| #define SIZEOF_LONG 4
| #define SIZEOF_LONG_LONG 8
| #define SIZEOF___INT64 0
| #define SIZEOF_OFF_T 8
| #define SIZEOF_VOIDP 4
| #define SIZEOF_FLOAT 4
| #define SIZEOF_DOUBLE 8
| #define SIZEOF_TIME_T 4
| #define rb_pid_t pid_t
| #define PIDT2NUM(v) LONG2NUM(v)
| #define NUM2PIDT(v) NUM2LONG(v)
| #define rb_uid_t uid_t
| #define UIDT2NUM(v) ULONG2NUM(v)
| #define NUM2UIDT(v) NUM2ULONG(v)
| #define rb_gid_t gid_t
| #define GIDT2NUM(v) ULONG2NUM(v)
| #define NUM2GIDT(v) NUM2ULONG(v)
| #define HAVE_PROTOTYPES 1
| #define TOKEN_PASTE(x,y) x##y
| #define STRINGIZE(expr) STRINGIZE0(expr)
| #define HAVE_STDARG_PROTOTYPES 1
| #define NORETURN(x) __attribute__ ((noreturn)) x
| #define DEPRECATED(x) __attribute__ ((deprecated)) x
| #define NOINLINE(x) __attribute__ ((noinline)) x
| #define FUNC_STDCALL(x) __attribute__ ((stdcall)) x
| #define FUNC_CDECL(x) __attribute__ ((cdecl)) x
| #define FUNC_FASTCALL(x) __attribute__ ((fastcall)) x
| #define HAVE_DECL_SYS_NERR 1
| #define BROKEN_SETREUID 1
| #define BROKEN_SETREGID 1
| #define HAVE_LIBDL 1
| #define HAVE_DIRENT_H 1
| #define STDC_HEADERS 1
| #define HAVE_SYS_WAIT_H 1
| #define HAVE_STDLIB_H 1
| #define HAVE_STRING_H 1
| #define HAVE_UNISTD_H 1
| #define HAVE_LIMITS_H 1
| #define HAVE_SYS_FILE_H 1
| #define HAVE_SYS_IOCTL_H 1
| #define HAVE_SYS_SYSCALL_H 1
| #define HAVE_FCNTL_H 1
| #define HAVE_SYS_FCNTL_H 1
| #define HAVE_SYS_SELECT_H 1
| #define HAVE_SYS_TIME_H 1
| #define HAVE_SYS_TIMES_H 1
| #define HAVE_SYS_PARAM_H 1
| #define HAVE_PWD_H 1
| #define HAVE_GRP_H 1
| #define HAVE_UTIME_H 1
| #define HAVE_MEMORY_H 1
| #define HAVE_SYS_RESOURCE_H 1
| #define HAVE_NETINET_IN_SYSTM_H 1
| #define HAVE_FLOAT_H 1
| #define HAVE_PTHREAD_H 1
| #define HAVE_UCONTEXT_H 1
| #define HAVE_LANGINFO_H 1
| #define HAVE_LOCALE_H 1
| #define SIZEOF_RLIM_T 8
| #define SIZEOF_SIZE_T 4
| #define HAVE_STRUCT_STAT_ST_BLKSIZE 1
| #define HAVE_ST_BLKSIZE 1
| #define HAVE_STRUCT_STAT_ST_BLOCKS 1
| #define HAVE_ST_BLOCKS 1
| #define HAVE_STRUCT_STAT_ST_RDEV 1
| #define HAVE_ST_RDEV 1
| #define HAVE_STRUCT_STAT_ST_ATIMESPEC 1
| #define HAVE_STRUCT_STAT_ST_MTIMESPEC 1
| #define HAVE_STRUCT_STAT_ST_CTIMESPEC 1
| /* end confdefs.h. */
| #include <stdio.h>
| #ifdef HAVE_SYS_TYPES_H
| # include <sys/types.h>
| #endif
| #ifdef HAVE_SYS_STAT_H
| # include <sys/stat.h>
| #endif
| #ifdef STDC_HEADERS
| # include <stdlib.h>
| # include <stddef.h>
| #else
| # ifdef HAVE_STDLIB_H
| # include <stdlib.h>
| # endif
| #endif
| #ifdef HAVE_STRING_H
| # if !defined STDC_HEADERS && defined HAVE_MEMORY_H
| # include <memory.h>
| # endif
| # include <string.h>
| #endif
| #ifdef HAVE_STRINGS_H
| # include <strings.h>
| #endif
| #ifdef HAVE_INTTYPES_H
| # include <inttypes.h>
| #endif
| #ifdef HAVE_STDINT_H
| # include <stdint.h>
| #endif
| #ifdef HAVE_UNISTD_H
| # include <unistd.h>
| #endif
| int
| main ()
| {
| static struct stat ac_aggr;
| if (ac_aggr.st_ctimensec)
| return 0;
| ;
| return 0;
| }
configure:15122: gcc-mp-4.2 -c -O -pipe -I/opt/local/include -D_XOPEN_SOURCE -D_DARWIN_C_SOURCE conftest.c >&5
conftest.c: In function 'main':
conftest.c:129: error: 'struct stat' has no member named 'st_ctimensec'
configure:15128: $? = 1
configure: failed program was:
| /* confdefs.h. */
| #define PACKAGE_NAME ""
| #define PACKAGE_TARNAME ""
| #define PACKAGE_VERSION ""
| #define PACKAGE_STRING ""
| #define PACKAGE_BUGREPORT ""
| #define USE_BUILTIN_FRAME_ADDRESS 1
| #define STDC_HEADERS 1
| #define HAVE_SYS_TYPES_H 1
| #define HAVE_SYS_STAT_H 1
| #define HAVE_STDLIB_H 1
| #define HAVE_STRING_H 1
| #define HAVE_MEMORY_H 1
| #define HAVE_STRINGS_H 1
| #define HAVE_INTTYPES_H 1
| #define HAVE_STDINT_H 1
| #define HAVE_UNISTD_H 1
| #define HAVE_LONG_LONG 1
| #define HAVE_OFF_T 1
| #define SIZEOF_INT 4
| #define SIZEOF_SHORT 2
| #define SIZEOF_LONG 4
| #define SIZEOF_LONG_LONG 8
| #define SIZEOF___INT64 0
| #define SIZEOF_OFF_T 8
| #define SIZEOF_VOIDP 4
| #define SIZEOF_FLOAT 4
| #define SIZEOF_DOUBLE 8
| #define SIZEOF_TIME_T 4
| #define rb_pid_t pid_t
| #define PIDT2NUM(v) LONG2NUM(v)
| #define NUM2PIDT(v) NUM2LONG(v)
| #define rb_uid_t uid_t
| #define UIDT2NUM(v) ULONG2NUM(v)
| #define NUM2UIDT(v) NUM2ULONG(v)
| #define rb_gid_t gid_t
| #define GIDT2NUM(v) ULONG2NUM(v)
| #define NUM2GIDT(v) NUM2ULONG(v)
| #define HAVE_PROTOTYPES 1
| #define TOKEN_PASTE(x,y) x##y
| #define STRINGIZE(expr) STRINGIZE0(expr)
| #define HAVE_STDARG_PROTOTYPES 1
| #define NORETURN(x) __attribute__ ((noreturn)) x
| #define DEPRECATED(x) __attribute__ ((deprecated)) x
| #define NOINLINE(x) __attribute__ ((noinline)) x
| #define FUNC_STDCALL(x) __attribute__ ((stdcall)) x
| #define FUNC_CDECL(x) __attribute__ ((cdecl)) x
| #define FUNC_FASTCALL(x) __attribute__ ((fastcall)) x
| #define HAVE_DECL_SYS_NERR 1
| #define BROKEN_SETREUID 1
| #define BROKEN_SETREGID 1
| #define HAVE_LIBDL 1
| #define HAVE_DIRENT_H 1
| #define STDC_HEADERS 1
| #define HAVE_SYS_WAIT_H 1
| #define HAVE_STDLIB_H 1
| #define HAVE_STRING_H 1
| #define HAVE_UNISTD_H 1
| #define HAVE_LIMITS_H 1
| #define HAVE_SYS_FILE_H 1
| #define HAVE_SYS_IOCTL_H 1
| #define HAVE_SYS_SYSCALL_H 1
| #define HAVE_FCNTL_H 1
| #define HAVE_SYS_FCNTL_H 1
| #define HAVE_SYS_SELECT_H 1
| #define HAVE_SYS_TIME_H 1
| #define HAVE_SYS_TIMES_H 1
| #define HAVE_SYS_PARAM_H 1
| #define HAVE_PWD_H 1
| #define HAVE_GRP_H 1
| #define HAVE_UTIME_H 1
| #define HAVE_MEMORY_H 1
| #define HAVE_SYS_RESOURCE_H 1
| #define HAVE_NETINET_IN_SYSTM_H 1
| #define HAVE_FLOAT_H 1
| #define HAVE_PTHREAD_H 1
| #define HAVE_UCONTEXT_H 1
| #define HAVE_LANGINFO_H 1
| #define HAVE_LOCALE_H 1
| #define SIZEOF_RLIM_T 8
| #define SIZEOF_SIZE_T 4
| #define HAVE_STRUCT_STAT_ST_BLKSIZE 1
| #define HAVE_ST_BLKSIZE 1
| #define HAVE_STRUCT_STAT_ST_BLOCKS 1
| #define HAVE_ST_BLOCKS 1
| #define HAVE_STRUCT_STAT_ST_RDEV 1
| #define HAVE_ST_RDEV 1
| #define HAVE_STRUCT_STAT_ST_ATIMESPEC 1
| #define HAVE_STRUCT_STAT_ST_MTIMESPEC 1
| #define HAVE_STRUCT_STAT_ST_CTIMESPEC 1
| /* end confdefs.h. */
| #include <stdio.h>
| #ifdef HAVE_SYS_TYPES_H
| # include <sys/types.h>
| #endif
| #ifdef HAVE_SYS_STAT_H
| # include <sys/stat.h>
| #endif
| #ifdef STDC_HEADERS
| # include <stdlib.h>
| # include <stddef.h>
| #else
| # ifdef HAVE_STDLIB_H
| # include <stdlib.h>
| # endif
| #endif
| #ifdef HAVE_STRING_H
| # if !defined STDC_HEADERS && defined HAVE_MEMORY_H
| # include <memory.h>
| # endif
| # include <string.h>
| #endif
| #ifdef HAVE_STRINGS_H
| # include <strings.h>
| #endif
| #ifdef HAVE_INTTYPES_H
| # include <inttypes.h>
| #endif
| #ifdef HAVE_STDINT_H
| # include <stdint.h>
| #endif
| #ifdef HAVE_UNISTD_H
| # include <unistd.h>
| #endif
| int
| main ()
| {
| static struct stat ac_aggr;
| if (sizeof ac_aggr.st_ctimensec)
| return 0;
| ;
| return 0;
| }
configure:15146: result: no
configure:15158: checking for struct timespec
configure:15188: gcc-mp-4.2 -c -O -pipe -I/opt/local/include -D_XOPEN_SOURCE -D_DARWIN_C_SOURCE conftest.c >&5
configure:15194: $? = 0
configure:15209: result: yes
configure:15221: checking for fd_mask
configure:15251: gcc-mp-4.2 -c -O -pipe -I/opt/local/include -D_XOPEN_SOURCE -D_DARWIN_C_SOURCE conftest.c >&5
configure:15257: $? = 0
configure:15272: result: yes
configure:15284: checking for int8_t
configure:15311: gcc-mp-4.2 -c -O -pipe -I/opt/local/include -D_XOPEN_SOURCE -D_DARWIN_C_SOURCE conftest.c >&5
configure:15317: $? = 0
configure:15340: result: yes
configure:15353: checking for uint8_t
configure:15380: gcc-mp-4.2 -c -O -pipe -I/opt/local/include -D_XOPEN_SOURCE -D_DARWIN_C_SOURCE conftest.c >&5
configure:15386: $? = 0
configure:15409: result: yes
configure:15422: checking for int16_t
configure:15449: gcc-mp-4.2 -c -O -pipe -I/opt/local/include -D_XOPEN_SOURCE -D_DARWIN_C_SOURCE conftest.c >&5
configure:15455: $? = 0
configure:15478: result: yes
configure:15491: checking for uint16_t
configure:15518: gcc-mp-4.2 -c -O -pipe -I/opt/local/include -D_XOPEN_SOURCE -D_DARWIN_C_SOURCE conftest.c >&5
configure:15524: $? = 0
configure:15547: result: yes
configure:15560: checking for int32_t
configure:15587: gcc-mp-4.2 -c -O -pipe -I/opt/local/include -D_XOPEN_SOURCE -D_DARWIN_C_SOURCE conftest.c >&5
configure:15593: $? = 0
configure:15616: result: yes
configure:15629: checking for uint32_t
configure:15656: gcc-mp-4.2 -c -O -pipe -I/opt/local/include -D_XOPEN_SOURCE -D_DARWIN_C_SOURCE conftest.c >&5
configure:15662: $? = 0
configure:15685: result: yes
configure:15698: checking for int64_t
configure:15725: gcc-mp-4.2 -c -O -pipe -I/opt/local/include -D_XOPEN_SOURCE -D_DARWIN_C_SOURCE conftest.c >&5
configure:15731: $? = 0
configure:15754: result: yes
configure:15767: checking for uint64_t
configure:15794: gcc-mp-4.2 -c -O -pipe -I/opt/local/include -D_XOPEN_SOURCE -D_DARWIN_C_SOURCE conftest.c >&5
configure:15800: $? = 0
configure:15823: result: yes
configure:15836: checking for int128_t
configure:15863: gcc-mp-4.2 -c -O -pipe -I/opt/local/include -D_XOPEN_SOURCE -D_DARWIN_C_SOURCE conftest.c >&5
conftest.c:135: error: expected '=', ',', ';', 'asm' or '__attribute__' before 't'
conftest.c:135: error: 't' undeclared here (not in a function)
configure:15869: $? = 1
configure: failed program was:
| /* confdefs.h. */
| #define PACKAGE_NAME ""
| #define PACKAGE_TARNAME ""
| #define PACKAGE_VERSION ""
| #define PACKAGE_STRING ""
| #define PACKAGE_BUGREPORT ""
| #define USE_BUILTIN_FRAME_ADDRESS 1
| #define STDC_HEADERS 1
| #define HAVE_SYS_TYPES_H 1
| #define HAVE_SYS_STAT_H 1
| #define HAVE_STDLIB_H 1
| #define HAVE_STRING_H 1
| #define HAVE_MEMORY_H 1
| #define HAVE_STRINGS_H 1
| #define HAVE_INTTYPES_H 1
| #define HAVE_STDINT_H 1
| #define HAVE_UNISTD_H 1
| #define HAVE_LONG_LONG 1
| #define HAVE_OFF_T 1
| #define SIZEOF_INT 4
| #define SIZEOF_SHORT 2
| #define SIZEOF_LONG 4
| #define SIZEOF_LONG_LONG 8
| #define SIZEOF___INT64 0
| #define SIZEOF_OFF_T 8
| #define SIZEOF_VOIDP 4
| #define SIZEOF_FLOAT 4
| #define SIZEOF_DOUBLE 8
| #define SIZEOF_TIME_T 4
| #define rb_pid_t pid_t
| #define PIDT2NUM(v) LONG2NUM(v)
| #define NUM2PIDT(v) NUM2LONG(v)
| #define rb_uid_t uid_t
| #define UIDT2NUM(v) ULONG2NUM(v)
| #define NUM2UIDT(v) NUM2ULONG(v)
| #define rb_gid_t gid_t
| #define GIDT2NUM(v) ULONG2NUM(v)
| #define NUM2GIDT(v) NUM2ULONG(v)
| #define HAVE_PROTOTYPES 1
| #define TOKEN_PASTE(x,y) x##y
| #define STRINGIZE(expr) STRINGIZE0(expr)
| #define HAVE_STDARG_PROTOTYPES 1
| #define NORETURN(x) __attribute__ ((noreturn)) x
| #define DEPRECATED(x) __attribute__ ((deprecated)) x
| #define NOINLINE(x) __attribute__ ((noinline)) x
| #define FUNC_STDCALL(x) __attribute__ ((stdcall)) x
| #define FUNC_CDECL(x) __attribute__ ((cdecl)) x
| #define FUNC_FASTCALL(x) __attribute__ ((fastcall)) x
| #define HAVE_DECL_SYS_NERR 1
| #define BROKEN_SETREUID 1
| #define BROKEN_SETREGID 1
| #define HAVE_LIBDL 1
| #define HAVE_DIRENT_H 1
| #define STDC_HEADERS 1
| #define HAVE_SYS_WAIT_H 1
| #define HAVE_STDLIB_H 1
| #define HAVE_STRING_H 1
| #define HAVE_UNISTD_H 1
| #define HAVE_LIMITS_H 1
| #define HAVE_SYS_FILE_H 1
| #define HAVE_SYS_IOCTL_H 1
| #define HAVE_SYS_SYSCALL_H 1
| #define HAVE_FCNTL_H 1
| #define HAVE_SYS_FCNTL_H 1
| #define HAVE_SYS_SELECT_H 1
| #define HAVE_SYS_TIME_H 1
| #define HAVE_SYS_TIMES_H 1
| #define HAVE_SYS_PARAM_H 1
| #define HAVE_PWD_H 1
| #define HAVE_GRP_H 1
| #define HAVE_UTIME_H 1
| #define HAVE_MEMORY_H 1
| #define HAVE_SYS_RESOURCE_H 1
| #define HAVE_NETINET_IN_SYSTM_H 1
| #define HAVE_FLOAT_H 1
| #define HAVE_PTHREAD_H 1
| #define HAVE_UCONTEXT_H 1
| #define HAVE_LANGINFO_H 1
| #define HAVE_LOCALE_H 1
| #define SIZEOF_RLIM_T 8
| #define SIZEOF_SIZE_T 4
| #define HAVE_STRUCT_STAT_ST_BLKSIZE 1
| #define HAVE_ST_BLKSIZE 1
| #define HAVE_STRUCT_STAT_ST_BLOCKS 1
| #define HAVE_ST_BLOCKS 1
| #define HAVE_STRUCT_STAT_ST_RDEV 1
| #define HAVE_ST_RDEV 1
| #define HAVE_STRUCT_STAT_ST_ATIMESPEC 1
| #define HAVE_STRUCT_STAT_ST_MTIMESPEC 1
| #define HAVE_STRUCT_STAT_ST_CTIMESPEC 1
| #define HAVE_STRUCT_TIMESPEC 1
| #define HAVE_RB_FD_INIT 1
| #define HAVE_INT8_T 1
| #define HAVE_UINT8_T 1
| #define HAVE_INT16_T 1
| #define HAVE_UINT16_T 1
| #define HAVE_INT32_T 1
| #define HAVE_UINT32_T 1
| #define HAVE_INT64_T 1
| #define HAVE_UINT64_T 1
| /* end confdefs.h. */
| #include <stdio.h>
| #ifdef HAVE_SYS_TYPES_H
| # include <sys/types.h>
| #endif
| #ifdef HAVE_SYS_STAT_H
| # include <sys/stat.h>
| #endif
| #ifdef STDC_HEADERS
| # include <stdlib.h>
| # include <stddef.h>
| #else
| # ifdef HAVE_STDLIB_H
| # include <stdlib.h>
| # endif
| #endif
| #ifdef HAVE_STRING_H
| # if !defined STDC_HEADERS && defined HAVE_MEMORY_H
| # include <memory.h>
| # endif
| # include <string.h>
| #endif
| #ifdef HAVE_STRINGS_H
| # include <strings.h>
| #endif
| #ifdef HAVE_INTTYPES_H
| # include <inttypes.h>
| #endif
| #ifdef HAVE_STDINT_H
| # include <stdint.h>
| #endif
| #ifdef HAVE_UNISTD_H
| # include <unistd.h>
| #endif
| typedef int128_t t; int s = sizeof(t) == 42;
| int
| main ()
| {
|
| ;
| return 0;
| }
configure:15892: result: no
configure:15905: checking for uint1