|
/tmp/ruby-build.20220607215706.16321.hja12y ~
|
|
/tmp/ruby-build.20220607215706.16321.hja12y/ruby-2.6.10 /tmp/ruby-build.20220607215706.16321.hja12y ~
|
|
checking for ruby... /usr/bin/ruby
|
|
tool/config.guess already exists
|
|
tool/config.sub already exists
|
|
checking build system type... aarch64-unknown-linux-gnu
|
|
checking host system type... aarch64-unknown-linux-gnu
|
|
checking target system type... aarch64-unknown-linux-gnu
|
|
checking for gcc... gcc
|
|
checking whether the C compiler works... yes
|
|
checking for C compiler default output file name... a.out
|
|
checking for suffix of executables...
|
|
checking whether we are cross compiling... no
|
|
checking for suffix of object files... o
|
|
checking whether we are using the GNU C compiler... yes
|
|
checking whether gcc accepts -g... yes
|
|
checking for gcc option to accept ISO C89... none needed
|
|
checking for g++... g++
|
|
checking whether we are using the GNU C++ compiler... yes
|
|
checking whether g++ accepts -g... yes
|
|
checking how to run the C preprocessor... gcc -E
|
|
checking for grep that handles long lines and -e... /bin/grep
|
|
checking for egrep... /bin/grep -E
|
|
checking whether gcc needs -traditional... no
|
|
checking for ld... ld
|
|
checking whether the linker is GNU ld... yes
|
|
checking whether gcc -E accepts -o... yes
|
|
checking for gcc... /usr/bin/gcc
|
|
checking for ranlib... ranlib
|
|
checking for ar... ar
|
|
checking for ar flags... rcD
|
|
checking for as... as
|
|
checking for objdump... objdump
|
|
checking for objcopy... objcopy
|
|
checking for nm... nm
|
|
checking whether ln -s works... yes
|
|
checking whether make sets $(MAKE)... yes
|
|
checking for a BSD-compatible install... /usr/bin/install -c
|
|
checking for a thread-safe mkdir -p... /bin/mkdir -p
|
|
checking for dtrace... no
|
|
checking for dot... no
|
|
checking for doxygen... no
|
|
checking for pkg-config... no
|
|
checking for ANSI C header files... yes
|
|
checking for sys/types.h... yes
|
|
checking for sys/stat.h... yes
|
|
checking for stdlib.h... yes
|
|
checking for string.h... yes
|
|
checking for memory.h... yes
|
|
checking for strings.h... yes
|
|
checking for inttypes.h... yes
|
|
checking for stdint.h... yes
|
|
checking for unistd.h... yes
|
|
checking minix/config.h usability... no
|
|
checking minix/config.h presence... no
|
|
checking for minix/config.h... no
|
|
checking whether it is safe to define __EXTENSIONS__... yes
|
|
checking for cd using physical directory... cd -P
|
|
checking whether CFLAGS is valid... yes
|
|
checking whether LDFLAGS is valid... yes
|
|
checking whether -Wl,-R. is accepted as LDFLAGS... yes
|
|
checking whether -Wl,-rpath,. is accepted as LDFLAGS... yes
|
|
checking whether -Wdeclaration-after-statement is accepted as CFLAGS... yes
|
|
checking whether -Wdeprecated-declarations is accepted as CFLAGS... yes
|
|
checking whether -Wdivision-by-zero is accepted as CFLAGS... no
|
|
checking whether -Wduplicated-cond is accepted as CFLAGS... yes
|
|
checking whether -Wimplicit-function-declaration is accepted as CFLAGS... yes
|
|
checking whether -Wimplicit-int is accepted as CFLAGS... yes
|
|
checking whether -Wmisleading-indentation is accepted as CFLAGS... yes
|
|
checking whether -Wpointer-arith is accepted as CFLAGS... yes
|
|
checking whether -Wrestrict is accepted as CFLAGS... yes
|
|
checking whether -Wshorten-64-to-32 is accepted as CFLAGS... no
|
|
checking whether -Wwrite-strings is accepted as CFLAGS... yes
|
|
checking whether -Wimplicit-fallthrough=0 is accepted as CFLAGS... yes
|
|
checking whether -Wmissing-noreturn is accepted as CFLAGS... yes
|
|
checking whether -Wno-cast-function-type is accepted as CFLAGS... yes
|
|
checking whether -Wno-constant-logical-operand is accepted as CFLAGS... yes
|
|
checking whether -Wno-long-long is accepted as CFLAGS... yes
|
|
checking whether -Wno-missing-field-initializers is accepted as CFLAGS... yes
|
|
checking whether -Wno-overlength-strings is accepted as CFLAGS... yes
|
|
checking whether -Wno-packed-bitfield-compat is accepted as CFLAGS... yes
|
|
checking whether -Wno-parentheses-equality is accepted as CFLAGS... yes
|
|
checking whether -Wno-self-assign is accepted as CFLAGS... yes
|
|
checking whether -Wno-tautological-compare is accepted as CFLAGS... yes
|
|
checking whether -Wno-unused-parameter is accepted as CFLAGS... yes
|
|
checking whether -Wno-unused-value is accepted as CFLAGS... yes
|
|
checking whether -Wsuggest-attribute=format is accepted as CFLAGS... yes
|
|
checking whether -Wsuggest-attribute=noreturn is accepted as CFLAGS... yes
|
|
checking whether -Wunused-variable is accepted as CFLAGS... yes
|
|
checking whether -diag-disable=175,188,2259 is accepted as CFLAGS... no
|
|
checking whether -Wextra-tokens is accepted as CFLAGS... no
|
|
checking whether -Wall -Wextra is accepted as CFLAGS... yes
|
|
checking whether -Qunused-arguments is accepted as CFLAGS... no
|
|
checking whether -D_FORTIFY_SOURCE=2 is accepted as CFLAGS... yes
|
|
checking whether -fstack-protector-strong is accepted as CFLAGS... yes
|
|
checking whether -fstack-protector-strong is accepted as LDFLAGS... yes
|
|
checking whether -Wl,--compress-debug-sections=zlib is accepted as LDFLAGS... yes
|
|
checking whether -std=gnu99 is accepted as CFLAGS... yes
|
|
checking whether -fno-strict-overflow is accepted as CFLAGS... yes
|
|
checking whether -ggdb3 is accepted as CFLAGS... yes
|
|
checking whether -fvisibility=hidden is accepted as CFLAGS... yes
|
|
checking whether -fno-fast-math is accepted as CFLAGS... yes
|
|
checking whether -fexcess-precision=standard is accepted as CFLAGS... yes
|
|
checking whether -fp-model precise is accepted as CFLAGS... no
|
|
checking whether compiler has statement and declarations in expressions... yes
|
|
checking for crypt in -lcrypt... yes
|
|
checking for dlopen in -ldl... yes
|
|
checking for shl_load in -ldld... no
|
|
checking for shutdown in -lsocket... no
|
|
checking for dirent.h that defines DIR... yes
|
|
checking for library containing opendir... none required
|
|
checking for stdbool.h that conforms to C99... yes
|
|
checking for _Bool... yes
|
|
checking for sys/wait.h that is POSIX.1 compatible... yes
|
|
checking a.out.h usability... yes
|
|
checking a.out.h presence... yes
|
|
checking for a.out.h... yes
|
|
checking atomic.h usability... no
|
|
checking atomic.h presence... no
|
|
checking for atomic.h... no
|
|
checking direct.h usability... no
|
|
checking direct.h presence... no
|
|
checking for direct.h... no
|
|
checking grp.h usability... yes
|
|
checking grp.h presence... yes
|
|
checking for grp.h... yes
|
|
checking fcntl.h usability... yes
|
|
checking fcntl.h presence... yes
|
|
checking for fcntl.h... yes
|
|
checking float.h usability... yes
|
|
checking float.h presence... yes
|
|
checking for float.h... yes
|
|
checking ieeefp.h usability... no
|
|
checking ieeefp.h presence... no
|
|
checking for ieeefp.h... no
|
|
checking intrinsics.h usability... no
|
|
checking intrinsics.h presence... no
|
|
checking for intrinsics.h... no
|
|
checking langinfo.h usability... yes
|
|
checking langinfo.h presence... yes
|
|
checking for langinfo.h... yes
|
|
checking limits.h usability... yes
|
|
checking limits.h presence... yes
|
|
checking for limits.h... yes
|
|
checking locale.h usability... yes
|
|
checking locale.h presence... yes
|
|
checking for locale.h... yes
|
|
checking malloc.h usability... yes
|
|
checking malloc.h presence... yes
|
|
checking for malloc.h... yes
|
|
checking malloc/malloc.h usability... no
|
|
checking malloc/malloc.h presence... no
|
|
checking for malloc/malloc.h... no
|
|
checking malloc_np.h usability... no
|
|
checking malloc_np.h presence... no
|
|
checking for malloc_np.h... no
|
|
checking net/socket.h usability... no
|
|
checking net/socket.h presence... no
|
|
checking for net/socket.h... no
|
|
checking process.h usability... no
|
|
checking process.h presence... no
|
|
checking for process.h... no
|
|
checking pwd.h usability... yes
|
|
checking pwd.h presence... yes
|
|
checking for pwd.h... yes
|
|
checking sanitizer/asan_interface.h usability... yes
|
|
checking sanitizer/asan_interface.h presence... yes
|
|
checking for sanitizer/asan_interface.h... yes
|
|
checking sanitizer/msan_interface.h usability... no
|
|
checking sanitizer/msan_interface.h presence... no
|
|
checking for sanitizer/msan_interface.h... no
|
|
checking setjmpex.h usability... no
|
|
checking setjmpex.h presence... no
|
|
checking for setjmpex.h... no
|
|
checking stdalign.h usability... yes
|
|
checking stdalign.h presence... yes
|
|
checking for stdalign.h... yes
|
|
checking sys/attr.h usability... no
|
|
checking sys/attr.h presence... no
|
|
checking for sys/attr.h... no
|
|
checking sys/eventfd.h usability... yes
|
|
checking sys/eventfd.h presence... yes
|
|
checking for sys/eventfd.h... yes
|
|
checking sys/fcntl.h usability... yes
|
|
checking sys/fcntl.h presence... yes
|
|
checking for sys/fcntl.h... yes
|
|
checking sys/file.h usability... yes
|
|
checking sys/file.h presence... yes
|
|
checking for sys/file.h... yes
|
|
checking sys/id.h usability... no
|
|
checking sys/id.h presence... no
|
|
checking for sys/id.h... no
|
|
checking sys/ioctl.h usability... yes
|
|
checking sys/ioctl.h presence... yes
|
|
checking for sys/ioctl.h... yes
|
|
checking sys/mkdev.h usability... no
|
|
checking sys/mkdev.h presence... no
|
|
checking for sys/mkdev.h... no
|
|
checking sys/param.h usability... yes
|
|
checking sys/param.h presence... yes
|
|
checking for sys/param.h... yes
|
|
checking sys/prctl.h usability... yes
|
|
checking sys/prctl.h presence... yes
|
|
checking for sys/prctl.h... yes
|
|
checking sys/resource.h usability... yes
|
|
checking sys/resource.h presence... yes
|
|
checking for sys/resource.h... yes
|
|
checking sys/select.h usability... yes
|
|
checking sys/select.h presence... yes
|
|
checking for sys/select.h... yes
|
|
checking sys/sendfile.h usability... yes
|
|
checking sys/sendfile.h presence... yes
|
|
checking for sys/sendfile.h... yes
|
|
checking sys/socket.h usability... yes
|
|
checking sys/socket.h presence... yes
|
|
checking for sys/socket.h... yes
|
|
checking sys/syscall.h usability... yes
|
|
checking sys/syscall.h presence... yes
|
|
checking for sys/syscall.h... yes
|
|
checking sys/sysmacros.h usability... yes
|
|
checking sys/sysmacros.h presence... yes
|
|
checking for sys/sysmacros.h... yes
|
|
checking sys/time.h usability... yes
|
|
checking sys/time.h presence... yes
|
|
checking for sys/time.h... yes
|
|
checking sys/times.h usability... yes
|
|
checking sys/times.h presence... yes
|
|
checking for sys/times.h... yes
|
|
checking sys/uio.h usability... yes
|
|
checking sys/uio.h presence... yes
|
|
checking for sys/uio.h... yes
|
|
checking sys/utime.h usability... no
|
|
checking sys/utime.h presence... no
|
|
checking for sys/utime.h... no
|
|
checking syscall.h usability... yes
|
|
checking syscall.h presence... yes
|
|
checking for syscall.h... yes
|
|
checking time.h usability... yes
|
|
checking time.h presence... yes
|
|
checking for time.h... yes
|
|
checking ucontext.h usability... yes
|
|
checking ucontext.h presence... yes
|
|
checking for ucontext.h... yes
|
|
checking utime.h usability... yes
|
|
checking utime.h presence... yes
|
|
checking for utime.h... yes
|
|
checking gmp.h usability... yes
|
|
checking gmp.h presence... yes
|
|
checking for gmp.h... yes
|
|
checking for library containing __gmpz_init... -lgmp
|
|
checking for special C compiler options needed for large files... no
|
|
checking for _FILE_OFFSET_BITS value needed for large files... no
|
|
checking whether byte ordering is bigendian... no
|
|
checking for an ANSI C-conforming const... yes
|
|
checking whether char is unsigned... yes
|
|
checking for inline... inline
|
|
checking for working volatile... yes
|
|
checking for typeof syntax and keyword spelling... typeof
|
|
checking for long long... yes
|
|
checking for off_t... yes
|
|
checking char bit... 8
|
|
checking size of int... 4
|
|
checking size of short... 2
|
|
checking size of long... 8
|
|
checking size of long long... 8
|
|
checking size of __int64... 0
|
|
checking size of __int128... 16
|
|
checking size of off_t... 8
|
|
checking size of void*... 8
|
|
checking size of float... 4
|
|
checking size of double... 8
|
|
checking size of time_t... 8
|
|
checking size of clock_t... 8
|
|
checking packed struct attribute... x __attribute__((packed))
|
|
checking whether -Wno-address-of-packed-member is accepted as CFLAGS... yes
|
|
checking for printf prefix for long long... ll
|
|
checking for pid_t... yes
|
|
checking for convertible type of pid_t... INT
|
|
checking for uid_t... yes
|
|
checking for convertible type of uid_t... UINT
|
|
checking for gid_t... yes
|
|
checking for convertible type of gid_t... UINT
|
|
checking for time_t... yes
|
|
checking for convertible type of time_t... LONG
|
|
checking for dev_t... yes
|
|
checking for convertible type of dev_t... ULONG
|
|
checking for mode_t... yes
|
|
checking for convertible type of mode_t... UINT
|
|
checking for rlim_t... yes
|
|
checking for convertible type of rlim_t... ULONG
|
|
checking for off_t... (cached) yes
|
|
checking for convertible type of off_t... LONG
|
|
checking for clockid_t... yes
|
|
checking for convertible type of clockid_t... INT
|
|
checking for prototypes... yes
|
|
checking token paste string... ansi
|
|
checking stringization... #expr
|
|
checking string literal concatenation... yes
|
|
checking for variable length prototypes and stdarg.h... yes
|
|
checking for variable length macro... yes
|
|
checking for alignas() syntax... __attribute__((__aligned__(x)))
|
|
checking for alignof() syntax... alignof
|
|
checking for CONSTFUNC function attribute... __attribute__ ((__const__)) x
|
|
checking for PUREFUNC function attribute... __attribute__ ((__pure__)) x
|
|
checking for NORETURN function attribute... __attribute__ ((__noreturn__)) x
|
|
checking for DEPRECATED function attribute... __attribute__ ((__deprecated__)) x
|
|
checking for DEPRECATED_BY function attribute... __attribute__ ((__deprecated__("by "#n))) x
|
|
checking for DEPRECATED_TYPE type attribute... __attribute__ ((__deprecated__ mesg)) x
|
|
checking for NOINLINE function attribute... __attribute__ ((__noinline__)) x
|
|
checking for ALWAYS_INLINE function attribute... __attribute__ ((__always_inline__)) x
|
|
checking for NO_SANITIZE function attribute... __attribute__ ((__no_sanitize__(san))) x
|
|
checking for NO_SANITIZE_ADDRESS function attribute... __attribute__ ((__no_sanitize_address__)) x
|
|
checking for NO_ADDRESS_SAFETY_ANALYSIS function attribute... __attribute__ ((__no_address_safety_analysis__)) x
|
|
checking for WARN_UNUSED_RESULT function attribute... __attribute__ ((__warn_unused_result__)) x
|
|
checking for MAYBE_UNUSED function attribute... __attribute__ ((__unused__)) x
|
|
checking for ERRORFUNC function attribute... __attribute__ ((__error__ mesg)) x
|
|
checking for WARNINGFUNC function attribute... __attribute__ ((__warning__ mesg)) x
|
|
checking for WEAK function attribute... __attribute__ ((__weak__)) x
|
|
checking for FUNC_STDCALL function attribute... x
|
|
checking for FUNC_CDECL function attribute... x
|
|
checking for FUNC_FASTCALL function attribute... x
|
|
checking for FUNC_UNOPTIMIZED function attribute... __attribute__ ((__optimize__("O0"))) x
|
|
checking for FUNC_MINIMIZED function attribute... __attribute__ ((__optimize__("-Os","-fomit-frame-pointer"))) x
|
|
checking for function alias... alias
|
|
checking for __atomic builtins... yes
|
|
checking for __sync builtins... yes
|
|
checking for __builtin_unreachable... yes
|
|
checking for exported function attribute... __attribute__ ((__visibility__("default")))
|
|
checking for function name string predefined identifier... __func__
|
|
checking if enum over int is allowed... yes
|
|
checking whether sys_nerr is declared... no
|
|
checking whether getenv is declared... yes
|
|
checking for size_t... yes
|
|
checking size of size_t... 8
|
|
checking size of ptrdiff_t... 8
|
|
checking for printf prefix for size_t... z
|
|
checking for printf prefix for ptrdiff_t... t
|
|
checking for struct stat.st_blksize... yes
|
|
checking for struct stat.st_blocks... yes
|
|
checking for struct stat.st_rdev... yes
|
|
checking size of struct stat.st_size... SIZEOF_OFF_T
|
|
checking size of struct stat.st_blocks... SIZEOF_OFF_T
|
|
checking size of struct stat.st_ino... SIZEOF_LONG
|
|
checking for struct stat.st_atim... yes
|
|
checking for struct stat.st_atimespec... no
|
|
checking for struct stat.st_atimensec... no
|
|
checking for struct stat.st_mtim... yes
|
|
checking for struct stat.st_mtimespec... no
|
|
checking for struct stat.st_mtimensec... no
|
|
checking for struct stat.st_ctim... yes
|
|
checking for struct stat.st_ctimespec... no
|
|
checking for struct stat.st_ctimensec... no
|
|
checking for struct stat.st_birthtimespec... no
|
|
checking for struct timeval... yes
|
|
checking size of struct timeval.tv_sec... SIZEOF_TIME_T
|
|
checking for struct timespec... yes
|
|
checking for struct timezone... yes
|
|
checking for fd_mask... yes
|
|
checking for int8_t... yes
|
|
checking size of int8_t... 1
|
|
checking for uint8_t... yes
|
|
checking size of uint8_t... 1
|
|
checking for int16_t... yes
|
|
checking size of int16_t... 2
|
|
checking for uint16_t... yes
|
|
checking size of uint16_t... 2
|
|
checking for int32_t... yes
|
|
checking size of int32_t... 4
|
|
checking for uint32_t... yes
|
|
checking size of uint32_t... 4
|
|
checking for int64_t... yes
|
|
checking size of int64_t... 8
|
|
checking for uint64_t... yes
|
|
checking size of uint64_t... 8
|
|
checking for int128_t... __int128
|
|
checking for uint128_t... unsigned __int128
|
|
checking for intptr_t... yes
|
|
checking size of intptr_t... 8
|
|
checking for uintptr_t... yes
|
|
checking size of uintptr_t... 8
|
|
checking for printf prefix for intptr_t... NONE
|
|
checking for ssize_t... yes
|
|
checking size of ssize_t... 8
|
|
checking for printf prefix for int64_t... NONE
|
|
checking for stack end address... __libc_stack_end
|
|
checking for uid_t in sys/types.h... (cached) yes
|
|
checking type of array argument to getgroups... gid_t
|
|
checking return type of signal handlers... void
|
|
checking for working alloca.h... yes
|
|
checking for alloca... yes
|
|
checking for dynamic size alloca... ok
|
|
checking for working memcmp... yes
|
|
checking for broken erfc of glibc-2.3.6 on IA64... no
|
|
checking for acosh... yes
|
|
checking for cbrt... yes
|
|
checking for crypt... yes
|
|
checking for dup2... yes
|
|
checking for erf... yes
|
|
checking for explicit_bzero... yes
|
|
checking for ffs... yes
|
|
checking for finite... yes
|
|
checking for flock... yes
|
|
checking for hypot... yes
|
|
checking for isinf... yes
|
|
checking for isnan... yes
|
|
checking for lgamma_r... yes
|
|
checking for memmove... yes
|
|
checking for nan... yes
|
|
checking for nextafter... yes
|
|
checking for setproctitle... no
|
|
checking for strchr... yes
|
|
checking for strerror... yes
|
|
checking for strlcat... no
|
|
checking for strlcpy... no
|
|
checking for strstr... yes
|
|
checking for tgamma... yes
|
|
checking sys/pstat.h usability... no
|
|
checking sys/pstat.h presence... no
|
|
checking for sys/pstat.h... no
|
|
checking for signbit... yes
|
|
checking for broken memmem... no
|
|
checking for pid_t... (cached) yes
|
|
checking vfork.h usability... no
|
|
checking vfork.h presence... no
|
|
checking for vfork.h... no
|
|
checking for fork... yes
|
|
checking for vfork... yes
|
|
checking for working fork... yes
|
|
checking for working vfork... (cached) yes
|
|
checking for __syscall... no
|
|
checking for _longjmp... yes
|
|
checking for arc4random_buf... no
|
|
checking for atan2l... yes
|
|
checking for atan2f... yes
|
|
checking for chroot... yes
|
|
checking for chsize... no
|
|
checking for clock_gettime... yes
|
|
checking for cosh... yes
|
|
checking for crypt_r... yes
|
|
checking for daemon... (cached) no
|
|
checking for dirfd... yes
|
|
checking for dl_iterate_phdr... yes
|
|
checking for dlopen... yes
|
|
checking for dladdr... yes
|
|
checking for dup... yes
|
|
checking for dup3... yes
|
|
checking for eaccess... yes
|
|
checking for endgrent... yes
|
|
checking for eventfd... yes
|
|
checking for fchmod... yes
|
|
checking for fchown... yes
|
|
checking for fcntl... yes
|
|
checking for fdatasync... yes
|
|
checking for fdopendir... yes
|
|
checking for fgetattrlist... no
|
|
checking for fmod... yes
|
|
checking for fstatat... yes
|
|
checking for fsync... yes
|
|
checking for ftruncate... yes
|
|
checking for ftruncate64... yes
|
|
checking for getattrlist... no
|
|
checking for getcwd... yes
|
|
checking for getgidx... no
|
|
checking for getgrnam... yes
|
|
checking for getgrnam_r... yes
|
|
checking for getgroups... yes
|
|
checking for getlogin... yes
|
|
checking for getlogin_r... yes
|
|
checking for getpgid... yes
|
|
checking for getpgrp... yes
|
|
checking for getpriority... yes
|
|
checking for getpwnam... yes
|
|
checking for getpwnam_r... yes
|
|
checking for getpwuid... yes
|
|
checking for getpwuid_r... yes
|
|
checking for getresgid... yes
|
|
checking for getresuid... yes
|
|
checking for getrlimit... yes
|
|
checking for getsid... yes
|
|
checking for gettimeofday... yes
|
|
checking for getuidx... no
|
|
checking for gmtime_r... yes
|
|
checking for grantpt... yes
|
|
checking for initgroups... yes
|
|
checking for ioctl... yes
|
|
checking for isfinite... no
|
|
checking for issetugid... no
|
|
checking for killpg... yes
|
|
checking for lchmod... yes
|
|
checking for lchown... yes
|
|
checking for link... yes
|
|
checking for llabs... yes
|
|
checking for lockf... yes
|
|
checking for log2... yes
|
|
checking for lstat... yes
|
|
checking for lutimes... yes
|
|
checking for malloc_usable_size... yes
|
|
checking for malloc_size... no
|
|
checking for mblen... yes
|
|
checking for memalign... yes
|
|
checking for memset_s... no
|
|
checking for writev... yes
|
|
checking for memrchr... yes
|
|
checking for memmem... yes
|
|
checking for mkfifo... yes
|
|
checking for mknod... yes
|
|
checking for mktime... yes
|
|
checking for openat... yes
|
|
checking for pipe2... yes
|
|
checking for poll... yes
|
|
checking for posix_fadvise... yes
|
|
checking for posix_memalign... yes
|
|
checking for ppoll... yes
|
|
checking for pread... yes
|
|
checking for pwrite... yes
|
|
checking for qsort_r... yes
|
|
checking for qsort_s... no
|
|
checking for readlink... yes
|
|
checking for round... yes
|
|
checking for sched_getaffinity... yes
|
|
checking for seekdir... yes
|
|
checking for select_large_fdset... no
|
|
checking for sendfile... yes
|
|
checking for setegid... yes
|
|
checking for setenv... yes
|
|
checking for seteuid... yes
|
|
checking for setgid... yes
|
|
checking for setgroups... yes
|
|
checking for setpgid... yes
|
|
checking for setpgrp... yes
|
|
checking for setregid... yes
|
|
checking for setresgid... yes
|
|
checking for setresuid... yes
|
|
checking for setreuid... yes
|
|
checking for setrgid... no
|
|
checking for setrlimit... yes
|
|
checking for setruid... no
|
|
checking for setsid... yes
|
|
checking for setuid... yes
|
|
checking for shutdown... yes
|
|
checking for sigaction... yes
|
|
checking for sigaltstack... yes
|
|
checking for sigprocmask... yes
|
|
checking for sinh... yes
|
|
checking for spawnv... no
|
|
checking for symlink... yes
|
|
checking for syscall... yes
|
|
checking for sysconf... yes
|
|
checking for tanh... yes
|
|
checking for telldir... yes
|
|
checking for timegm... yes
|
|
checking for times... yes
|
|
checking for truncate... yes
|
|
checking for truncate64... yes
|
|
checking for unsetenv... yes
|
|
checking for utimensat... yes
|
|
checking for utimes... yes
|
|
checking for wait4... yes
|
|
checking for waitpid... yes
|
|
checking if getcwd allocates buffer if NULL is given... yes
|
|
checking crypt.h usability... yes
|
|
checking crypt.h presence... yes
|
|
checking for crypt.h... yes
|
|
checking for struct crypt_data.initialized... yes
|
|
checking for __builtin_alloca_with_align... yes
|
|
checking for __builtin_assume_aligned... yes
|
|
checking for __builtin_bswap16... yes
|
|
checking for __builtin_bswap32... yes
|
|
checking for __builtin_bswap64... yes
|
|
checking for __builtin_popcount... yes
|
|
checking for __builtin_popcountll... yes
|
|
checking for __builtin_clz... yes
|
|
checking for __builtin_clzl... yes
|
|
checking for __builtin_clzll... yes
|
|
checking for __builtin_ctz... yes
|
|
checking for __builtin_ctzll... yes
|
|
checking for __builtin_add_overflow... yes
|
|
checking for __builtin_sub_overflow... yes
|
|
checking for __builtin_mul_overflow... yes
|
|
checking for __builtin_mul_overflow_p... yes
|
|
checking for __builtin_constant_p... yes
|
|
checking for __builtin_choose_expr... yes
|
|
checking for __builtin_choose_expr_constant_p... yes
|
|
checking for __builtin_types_compatible_p... yes
|
|
checking for __builtin_trap... yes
|
|
checking whether qsort_r is GNU version... yes
|
|
checking whether qsort_r is BSD version... no
|
|
checking whether atan2 handles Inf as C99... yes
|
|
checking for clock_getres... yes
|
|
checking for timer_create in -lrt... yes
|
|
checking for timer_settime in -lrt... yes
|
|
checking for unsetenv returns a value... yes
|
|
checking whether struct tm is in sys/time.h or time.h... time.h
|
|
checking for struct tm.tm_zone... yes
|
|
checking for struct tm.tm_gmtoff... yes
|
|
checking for external int daylight... yes
|
|
checking for negative time_t for gmtime(3)... yes
|
|
checking for localtime(3) overflow correctly... yes
|
|
checking for sig_t... yes
|
|
checking whether right shift preserve sign bit... yes
|
|
checking whether _SC_CLK_TCK is supported... yes
|
|
checking stack growing direction on aarch64... -1
|
|
checking native coroutine implementation for aarch64-linux... no
|
|
checking for pthread_create in -lthr... no
|
|
checking for pthread_create in -lpthread... yes
|
|
checking for pthread_np.h... no
|
|
checking whether pthread_t is scalar type... yes
|
|
checking for sched_yield... yes
|
|
checking for pthread_attr_setinheritsched... yes
|
|
checking for pthread_attr_get_np... no
|
|
checking for pthread_attr_getstack... yes
|
|
checking for pthread_attr_getguardsize... yes
|
|
checking for pthread_get_stackaddr_np... no
|
|
checking for pthread_get_stacksize_np... no
|
|
checking for thr_stksegment... no
|
|
checking for pthread_stackseg_np... no
|
|
checking for pthread_getthrds_np... no
|
|
checking for pthread_condattr_setclock... yes
|
|
checking for pthread_sigmask... yes
|
|
checking for pthread_setname_np... yes
|
|
checking for pthread_set_name_np... no
|
|
checking for pthread_getattr_np... yes
|
|
checking arguments of pthread_setname_np... (pthread_self(), name)
|
|
checking if mcontext_t is a pointer... no
|
|
checking for getcontext... yes
|
|
checking for setcontext... yes
|
|
checking if fork works with pthread... yes
|
|
checking whether ELF binaries are produced... yes
|
|
checking elf.h usability... yes
|
|
checking elf.h presence... yes
|
|
checking for elf.h... yes
|
|
checking elf_abi.h usability... no
|
|
checking elf_abi.h presence... no
|
|
checking for elf_abi.h... no
|
|
checking for uncompress in -lz... yes
|
|
checking mach-o/loader.h usability... no
|
|
checking mach-o/loader.h presence... no
|
|
checking for mach-o/loader.h... no
|
|
checking whether OS depend dynamic link works... yes
|
|
checking for backtrace... yes
|
|
checking for broken backtrace... no
|
|
checking valgrind/memcheck.h usability... no
|
|
checking valgrind/memcheck.h presence... no
|
|
checking for valgrind/memcheck.h... no
|
|
checking for strip... strip
|
|
checking whether -Wl,--no-undefined is accepted as LDFLAGS... yes
|
|
checking whether wrapper for LD_LIBRARY_PATH is needed... no
|
|
checking whether dtrace USDT is available... no
|
|
checking for __builtin_setjmp... yes with cast ()
|
|
checking for _setjmpex as a macro or function... no
|
|
checking for _setjmp as a macro or function... yes
|
|
checking for sigsetjmp as a macro or function... no
|
|
checking for setjmp type... __builtin_setjmp
|
|
checking for prefix of external symbols... NONE
|
|
checking pthread.h usability... yes
|
|
checking pthread.h presence... yes
|
|
checking for pthread.h... yes
|
|
checking if make is GNU make... yes
|
|
.ext/include/aarch64-linux/ruby/config.h updated
|
|
configure: ruby library version = 2.6.0
|
|
configure: creating ./config.status
|
|
config.status: creating GNUmakefile
|
|
config.status: creating Makefile
|
|
config.status: creating ruby-2.6.pc
|
|
---
|
|
Configuration summary for ruby version 2.6.10
|
|
|
|
* Installation prefix: /home/agrevok/.rbenv/versions/2.6.10
|
|
* exec prefix: ${prefix}
|
|
* arch: aarch64-linux
|
|
* site arch: ${arch}
|
|
* RUBY_BASE_NAME: ruby
|
|
* enable shared: yes
|
|
* ruby lib prefix: ${libdir}/${RUBY_BASE_NAME}
|
|
* site libraries path: ${rubylibprefix}/${sitearch}
|
|
* vendor path: ${rubylibprefix}/vendor_ruby
|
|
* target OS: linux
|
|
* compiler: gcc
|
|
* with pthread: yes
|
|
* enable shared libs: yes
|
|
* dynamic library ext: so
|
|
* CFLAGS: ${optflags} ${debugflags} ${warnflags}
|
|
* LDFLAGS: -L. -L/home/agrevok/.rbenv/versions/2.6.10/lib \
|
|
-fstack-protector-strong -rdynamic \
|
|
-Wl,-export-dynamic
|
|
* DLDFLAGS: -L/home/agrevok/.rbenv/versions/2.6.10/lib \
|
|
-Wl,--compress-debug-sections=zlib
|
|
* optflags: -O3
|
|
* debugflags: -ggdb3
|
|
* warnflags: -Wall -Wextra -Wdeclaration-after-statement \
|
|
-Wdeprecated-declarations -Wduplicated-cond \
|
|
-Wimplicit-function-declaration -Wimplicit-int \
|
|
-Wmisleading-indentation -Wpointer-arith \
|
|
-Wrestrict -Wwrite-strings \
|
|
-Wimplicit-fallthrough=0 -Wmissing-noreturn \
|
|
-Wno-cast-function-type \
|
|
-Wno-constant-logical-operand -Wno-long-long \
|
|
-Wno-missing-field-initializers \
|
|
-Wno-overlength-strings \
|
|
-Wno-packed-bitfield-compat \
|
|
-Wno-parentheses-equality -Wno-self-assign \
|
|
-Wno-tautological-compare -Wno-unused-parameter \
|
|
-Wno-unused-value -Wsuggest-attribute=format \
|
|
-Wsuggest-attribute=noreturn -Wunused-variable
|
|
* strip command: strip -S -x
|
|
* install doc: yes
|
|
* JIT support: yes
|
|
* man page type: doc
|
|
|
|
---
|
|
BASERUBY = /usr/bin/ruby --disable=gems
|
|
CC = gcc
|
|
LD = ld
|
|
LDSHARED = gcc -shared
|
|
CFLAGS = -O3 -ggdb3 -Wall -Wextra -Wdeclaration-after-statement -Wdeprecated-declarations -Wduplicated-cond -Wimplicit-function-declaration -Wimplicit-int -Wmisleading-indentation -Wpointer-arith -Wrestrict -Wwrite-strings -Wimplicit-fallthrough=0 -Wmissing-noreturn -Wno-cast-function-type -Wno-constant-logical-operand -Wno-long-long -Wno-missing-field-initializers -Wno-overlength-strings -Wno-packed-bitfield-compat -Wno-parentheses-equality -Wno-self-assign -Wno-tautological-compare -Wno-unused-parameter -Wno-unused-value -Wsuggest-attribute=format -Wsuggest-attribute=noreturn -Wunused-variable -std=gnu99 -fPIC
|
|
XCFLAGS = -D_FORTIFY_SOURCE=2 -fstack-protector-strong -fno-strict-overflow -fvisibility=hidden -fexcess-precision=standard -DRUBY_EXPORT -DCANONICALIZATION_FOR_MATHN
|
|
CPPFLAGS = -I/home/agrevok/.rbenv/versions/2.6.10/include -I. -I.ext/include/aarch64-linux -I./include -I. -I./enc/unicode/12.1.0
|
|
DLDFLAGS = -L/home/agrevok/.rbenv/versions/2.6.10/lib -Wl,--compress-debug-sections=zlib -Wl,-soname,libruby.so.2.6 -fstack-protector-strong
|
|
SOLIBS = -lz -lpthread -lrt -lrt -lgmp -ldl -lcrypt -lm
|
|
LANG = C.UTF-8
|
|
LC_ALL =
|
|
LC_CTYPE =
|
|
gcc (Ubuntu 11.2.0-19ubuntu1) 11.2.0
|
|
Copyright (C) 2021 Free Software Foundation, Inc.
|
|
This is free software; see the source for copying conditions. There is NO
|
|
warranty; not even for MERCHANTABILITY or FITNESS FOR A PARTICULAR PURPOSE.
|
|
|
|
compiling ./main.c
|
|
compiling dmydln.c
|
|
compiling miniinit.c
|
|
compiling dmyext.c
|
|
compiling miniprelude.c
|
|
making dummy probes.h
|
|
compiling ast.c
|
|
compiling bignum.c
|
|
compiling class.c
|
|
compiling compar.c
|
|
compiling compile.c
|
|
compiling complex.c
|
|
compiling cont.c
|
|
compiling debug.c
|
|
compiling debug_counter.c
|
|
compiling dir.c
|
|
compiling dln_find.c
|
|
compiling encoding.c
|
|
compiling enum.c
|
|
compiling enumerator.c
|
|
compiling error.c
|
|
compiling eval.c
|
|
compiling file.c
|
|
compiling gc.c
|
|
compiling hash.c
|
|
gc.c: In function ‘mark_current_machine_context’:
|
|
gc.c:4377:36: warning: expression does not compute the number of elements in this array; element type is ‘struct __jmp_buf_tag’, not ‘VALUE’ {aka ‘long unsigned int’} [-Wsizeof-array-div]
|
|
4377 | VALUE v[sizeof(rb_jmp_buf) / sizeof(VALUE)];
|
|
| ^
|
|
gc.c:4377:36: note: add parentheses around the second ‘sizeof’ to silence this warning
|
|
compiling inits.c
|
|
compiling io.c
|
|
compiling iseq.c
|
|
compiling load.c
|
|
gc.c: At top level:
|
|
cc1: note: unrecognized command-line option ‘-Wno-self-assign’ may have been intended to silence earlier diagnostics
|
|
cc1: note: unrecognized command-line option ‘-Wno-parentheses-equality’ may have been intended to silence earlier diagnostics
|
|
cc1: note: unrecognized command-line option ‘-Wno-constant-logical-operand’ may have been intended to silence earlier diagnostics
|
|
compiling marshal.c
|
|
compiling math.c
|
|
making mjit_config.h
|
|
compiling mjit_compile.c
|
|
compiling node.c
|
|
compiling numeric.c
|
|
compiling object.c
|
|
compiling pack.c
|
|
compiling parse.c
|
|
compiling proc.c
|
|
compiling process.c
|
|
process.c: In function ‘rb_getlogin’:
|
|
process.c:5514:5: warning: ISO C90 forbids mixed declarations and code [-Wdeclaration-after-statement]
|
|
5514 | VALUE maybe_result = rb_str_buf_new(loginsize);
|
|
| ^~~~~
|
|
process.c:5520:5: warning: ISO C90 forbids mixed declarations and code [-Wdeclaration-after-statement]
|
|
5520 | int gle;
|
|
| ^~~
|
|
process.c: In function ‘rb_getpwdirnam_for_login’:
|
|
process.c:5575:5: warning: ISO C90 forbids mixed declarations and code [-Wdeclaration-after-statement]
|
|
5575 | char *login = RSTRING_PTR(login_name);
|
|
| ^~~~
|
|
process.c:5588:5: warning: ISO C90 forbids mixed declarations and code [-Wdeclaration-after-statement]
|
|
5588 | VALUE getpwnm_tmp = rb_str_tmp_new(bufsizenm);
|
|
| ^~~~~
|
|
process.c:5594:5: warning: ISO C90 forbids mixed declarations and code [-Wdeclaration-after-statement]
|
|
5594 | int enm;
|
|
| ^~~
|
|
process.c:5621:5: warning: ISO C90 forbids mixed declarations and code [-Wdeclaration-after-statement]
|
|
5621 | VALUE result = rb_str_new_cstr(pwptr->pw_dir);
|
|
| ^~~~~
|
|
process.c: In function ‘rb_getpwdiruid’:
|
|
process.c:5668:5: warning: ISO C90 forbids mixed declarations and code [-Wdeclaration-after-statement]
|
|
5668 | VALUE getpwid_tmp = rb_str_tmp_new(bufsizeid);
|
|
| ^~~~~
|
|
process.c:5674:5: warning: ISO C90 forbids mixed declarations and code [-Wdeclaration-after-statement]
|
|
5674 | int eid;
|
|
| ^~~
|
|
process.c:5700:5: warning: ISO C90 forbids mixed declarations and code [-Wdeclaration-after-statement]
|
|
5700 | VALUE result = rb_str_new_cstr(pwptr->pw_dir);
|
|
| ^~~~~
|
|
compiling random.c
|
|
compiling range.c
|
|
process.c: At top level:
|
|
cc1: note: unrecognized command-line option ‘-Wno-self-assign’ may have been intended to silence earlier diagnostics
|
|
cc1: note: unrecognized command-line option ‘-Wno-parentheses-equality’ may have been intended to silence earlier diagnostics
|
|
cc1: note: unrecognized command-line option ‘-Wno-constant-logical-operand’ may have been intended to silence earlier diagnostics
|
|
compiling rational.c
|
|
compiling re.c
|
|
compiling regcomp.c
|
|
compiling regenc.c
|
|
compiling regerror.c
|
|
compiling regexec.c
|
|
compiling regparse.c
|
|
compiling regsyntax.c
|
|
compiling ruby.c
|
|
compiling safe.c
|
|
compiling signal.c
|
|
compiling sprintf.c
|
|
compiling st.c
|
|
compiling strftime.c
|
|
strftime.c: In function ‘rb_strftime_with_timespec’:
|
|
strftime.c:388:39: warning: comparison is always false due to limited range of data type [-Wtype-limits]
|
|
388 | if (vtm->wday < 0 || vtm->wday > 6)
|
|
| ^
|
|
strftime.c:399:39: warning: comparison is always false due to limited range of data type [-Wtype-limits]
|
|
399 | if (vtm->wday < 0 || vtm->wday > 6)
|
|
| ^
|
|
compiling string.c
|
|
compiling struct.c
|
|
string.c: In function ‘str_replace_shared_without_enc’:
|
|
string.c:1189:13: warning: ISO C90 forbids mixed declarations and code [-Wdeclaration-after-statement]
|
|
1189 | char *ptr2 = STR_HEAP_PTR(str2);
|
|
| ^~~~
|
|
string.c: In function ‘rb_str_setbyte’:
|
|
string.c:5471:5: warning: ISO C90 forbids mixed declarations and code [-Wdeclaration-after-statement]
|
|
5471 | VALUE v = rb_to_int(value);
|
|
| ^~~~~
|
|
string.c: In function ‘get_reg_grapheme_cluster’:
|
|
string.c:8521:9: warning: ISO C90 forbids mixed declarations and code [-Wdeclaration-after-statement]
|
|
8521 | int r = onig_new(®_grapheme_cluster, source, source + source_len,
|
|
| ^~~
|
|
compiling symbol.c
|
|
strftime.c: At top level:
|
|
cc1: note: unrecognized command-line option ‘-Wno-self-assign’ may have been intended to silence earlier diagnostics
|
|
cc1: note: unrecognized command-line option ‘-Wno-parentheses-equality’ may have been intended to silence earlier diagnostics
|
|
cc1: note: unrecognized command-line option ‘-Wno-constant-logical-operand’ may have been intended to silence earlier diagnostics
|
|
compiling thread.c
|
|
compiling time.c
|
|
compiling transcode.c
|
|
compiling transient_heap.c
|
|
compiling util.c
|
|
compiling variable.c
|
|
string.c: At top level:
|
|
cc1: note: unrecognized command-line option ‘-Wno-self-assign’ may have been intended to silence earlier diagnostics
|
|
cc1: note: unrecognized command-line option ‘-Wno-parentheses-equality’ may have been intended to silence earlier diagnostics
|
|
cc1: note: unrecognized command-line option ‘-Wno-constant-logical-operand’ may have been intended to silence earlier diagnostics
|
|
./revision.h unchanged
|
|
compiling vm.c
|
|
compiling vm_backtrace.c
|
|
vm.c: In function ‘check_machine_stack_size’:
|
|
vm.c:2368:14: warning: comparison of integer expressions of different signedness: ‘size_t’ {aka ‘long unsigned int’} and ‘long int’ [-Wsign-compare]
|
|
2368 | if (size < PTHREAD_STACK_MIN) {
|
|
| ^
|
|
compiling vm_dump.c
|
|
compiling vm_trace.c
|
|
compiling ./missing/setproctitle.c
|
|
compiling ./missing/strlcat.c
|
|
compiling ./missing/strlcpy.c
|
|
compiling addr2line.c
|
|
compiling dmyenc.c
|
|
compiling dln.c
|
|
compiling localeinit.c
|
|
compiling prelude.c
|
|
compiling array.c
|
|
compiling mjit.c
|
|
compiling enc/ascii.c
|
|
compiling enc/us_ascii.c
|
|
compiling enc/unicode.c
|
|
compiling enc/utf_8.c
|
|
enc/unicode.c: In function ‘onigenc_unicode_get_case_fold_codes_by_str’:
|
|
enc/unicode.c:557:28: warning: ‘ncs’ may be used uninitialized [-Wmaybe-uninitialized]
|
|
557 | for (i = 0; i < ncs[0]; i++) {
|
|
| ~~~^~~
|
|
enc/unicode.c:519:15: note: ‘ncs’ declared here
|
|
519 | int fn, ncs[3];
|
|
| ^~~
|
|
compiling enc/trans/newline.c
|
|
enc/unicode.c: At top level:
|
|
cc1: note: unrecognized command-line option ‘-Wno-self-assign’ may have been intended to silence earlier diagnostics
|
|
cc1: note: unrecognized command-line option ‘-Wno-parentheses-equality’ may have been intended to silence earlier diagnostics
|
|
cc1: note: unrecognized command-line option ‘-Wno-constant-logical-operand’ may have been intended to silence earlier diagnostics
|
|
compiling version.c
|
|
vm.c: At top level:
|
|
cc1: note: unrecognized command-line option ‘-Wno-self-assign’ may have been intended to silence earlier diagnostics
|
|
cc1: note: unrecognized command-line option ‘-Wno-parentheses-equality’ may have been intended to silence earlier diagnostics
|
|
cc1: note: unrecognized command-line option ‘-Wno-constant-logical-operand’ may have been intended to silence earlier diagnostics
|
|
building rb_mjit_header.h
|
|
linking miniruby
|
|
rb_mjit_header.h updated
|
|
generating encdb.h
|
|
building .ext/include/aarch64-linux/rb_mjit_min_header-2.6.10.h
|
|
./miniruby -I./lib -I. -I.ext/common ./tool/transform_mjit_header.rb "gcc " rb_mjit_header.h .ext/include/aarch64-linux/rb_mjit_min_header-2.6.10.h
|
|
encdb.h updated
|
|
./tool/ifchange "--timestamp=.rbconfig.time" rbconfig.rb rbconfig.tmp
|
|
rbconfig.rb updated
|
|
creating verconf.h
|
|
generating enc.mk
|
|
verconf.h updated
|
|
compiling loadpath.c
|
|
making srcs under enc
|
|
make[1]: Entering directory '/tmp/ruby-build.20220607215706.16321.hja12y/ruby-2.6.10'
|
|
make[1]: Nothing to be done for 'srcs'.
|
|
make[1]: Leaving directory '/tmp/ruby-build.20220607215706.16321.hja12y/ruby-2.6.10'
|
|
generating transdb.h
|
|
linking static-library libruby-static.a
|
|
|
|
Transforming external functions to static:
|
|
transform_mjit_header: making external definition of 'Init_vm_stack_canary' static inline
|
|
transform_mjit_header: making external definition of 'rb_vm_opt_struct_aset' static inline
|
|
transform_mjit_header: making external definition of 'rb_vm_opt_struct_aref' static inline
|
|
transform_mjit_header: making external definition of 'rb_find_defined_class_by_owner' static inline
|
|
transform_mjit_header: making external definition of 'rb_eql_opt' static inline
|
|
transform_mjit_header: changing definition of 'rb_equal_opt' to declaration
|
|
transform_mjit_header: changing definition of 'rb_vm_search_method_slowpath' to declaration
|
|
transform_mjit_header: making external definition of 'rb_vm_rewrite_cref' static inline
|
|
transform_mjit_header: making external definition of 'rb_vm_push_frame' static inline
|
|
transform_mjit_header: making external definition of 'rb_vm_block_ep_update' static inline
|
|
transform_mjit_header: making external definition of 'rb_vm_cref_new_toplevel' static inline
|
|
transform_mjit_header: making external definition of 'rb_vm_frame_block_handler' static inline
|
|
transform_mjit_header: making external definition of 'rb_vm_ep_local_ep' static inline
|
|
transform_mjit_header: making declaration of 'rb_vm_rewrite_cref' static inline
|
|
transform_mjit_header: making declaration of 'rb_vm_frame_block_handler' static inline
|
|
transform_mjit_header: making declaration of 'rb_vm_block_ep_update' static inline
|
|
transform_mjit_header: making declaration of 'rb_vm_ep_local_ep' static inline
|
|
transform_mjit_header: making declaration of 'Init_vm_stack_canary' static inline
|
|
transform_mjit_header: making declaration of 'rb_eql_opt' static inline
|
|
transform_mjit_header: making external definition of 'rb_scan_args_set' static inline
|
|
transform_mjit_header: making declaration of 'rb_scan_args_set' static inline
|
|
transform_mjit_header: SKIPPED to transform getlogin_r
|
|
transform_mjit_header: SKIPPED to transform pread64
|
|
transform_mjit_header: SKIPPED to transform pread
|
|
transform_mjit_header: SKIPPED to transform read
|
|
transform_mjit_header: SKIPPED to transform bsearch
|
|
transform_mjit_header: SKIPPED to transform fread_unlocked
|
|
transform_mjit_header: SKIPPED to transform fgets_unlocked
|
|
transform_mjit_header: SKIPPED to transform fread
|
|
transform_mjit_header: SKIPPED to transform fgets
|
|
transform_mjit_header: SKIPPED to transform vdprintf
|
|
transform_mjit_header: SKIPPED to transform dprintf
|
|
transform_mjit_header: SKIPPED to transform vfprintf
|
|
transform_mjit_header: SKIPPED to transform vprintf
|
|
transform_mjit_header: SKIPPED to transform printf
|
|
transform_mjit_header: SKIPPED to transform fprintf
|
|
transform_mjit_header: SKIPPED to transform getline
|
|
transform_mjit_header: SKIPPED to transform putchar_unlocked
|
|
transform_mjit_header: SKIPPED to transform putc_unlocked
|
|
transform_mjit_header: SKIPPED to transform fputc_unlocked
|
|
transform_mjit_header: SKIPPED to transform putchar
|
|
transform_mjit_header: SKIPPED to transform getchar_unlocked
|
|
transform_mjit_header: SKIPPED to transform getc_unlocked
|
|
transform_mjit_header: SKIPPED to transform fgetc_unlocked
|
|
transform_mjit_header: SKIPPED to transform getchar
|
|
ln -sf ../../../.ext/include/aarch64-linux/rb_mjit_min_header-2.6.10.h include/ruby-2.6.0/aarch64-linux/rb_mjit_min_header-2.6.10.h
|
|
transdb.h updated
|
|
linking shared-library libruby.so.2.6.10
|
|
generating makefiles ext/configure-ext.mk
|
|
making enc
|
|
making trans
|
|
make[1]: Entering directory '/tmp/ruby-build.20220607215706.16321.hja12y/ruby-2.6.10'
|
|
make[1]: Entering directory '/tmp/ruby-build.20220607215706.16321.hja12y/ruby-2.6.10'
|
|
compiling ./enc/trans/transdb.c
|
|
compiling ./enc/encdb.c
|
|
compiling ./enc/trans/big5.c
|
|
ext/configure-ext.mk updated
|
|
compiling ./enc/trans/chinese.c
|
|
make[1]: Entering directory '/tmp/ruby-build.20220607215706.16321.hja12y/ruby-2.6.10'
|
|
configuring json
|
|
configuring json/generator
|
|
configuring json/parser
|
|
compiling ./enc/big5.c
|
|
compiling ./enc/cp949.c
|
|
compiling ./enc/trans/ebcdic.c
|
|
compiling ./enc/emacs_mule.c
|
|
compiling ./enc/euc_jp.c
|
|
compiling ./enc/trans/emoji.c
|
|
compiling ./enc/euc_kr.c
|
|
compiling ./enc/trans/emoji_iso2022_kddi.c
|
|
compiling ./enc/euc_tw.c
|
|
compiling ./enc/trans/emoji_sjis_docomo.c
|
|
configuring fcntl
|
|
configuring continuation
|
|
configuring coverage
|
|
configuring gdbm
|
|
compiling ./enc/gb2312.c
|
|
compiling ./enc/gb18030.c
|
|
compiling ./enc/trans/emoji_sjis_kddi.c
|
|
configuring rubyvm
|
|
compiling ./enc/trans/emoji_sjis_softbank.c
|
|
compiling ./enc/gbk.c
|
|
compiling ./enc/iso_8859_1.c
|
|
compiling ./enc/trans/escape.c
|
|
configuring syslog
|
|
compiling ./enc/iso_8859_2.c
|
|
compiling ./enc/iso_8859_3.c
|
|
configuring pty
|
|
compiling ./enc/trans/gb18030.c
|
|
compiling ./enc/iso_8859_4.c
|
|
compiling ./enc/trans/gbk.c
|
|
compiling ./enc/iso_8859_5.c
|
|
compiling ./enc/iso_8859_6.c
|
|
compiling ./enc/iso_8859_7.c
|
|
compiling ./enc/trans/iso2022.c
|
|
compiling ./enc/iso_8859_8.c
|
|
compiling ./enc/trans/japanese.c
|
|
compiling ./enc/iso_8859_9.c
|
|
compiling ./enc/trans/japanese_euc.c
|
|
compiling ./enc/iso_8859_10.c
|
|
compiling ./enc/trans/japanese_sjis.c
|
|
compiling ./enc/iso_8859_11.c
|
|
compiling ./enc/iso_8859_13.c
|
|
compiling ./enc/trans/korean.c
|
|
configuring nkf
|
|
compiling ./enc/iso_8859_14.c
|
|
compiling ./enc/iso_8859_15.c
|
|
configuring strscan
|
|
compiling ./enc/iso_8859_16.c
|
|
compiling ./enc/trans/single_byte.c
|
|
compiling ./enc/koi8_r.c
|
|
configuring psych
|
|
compiling ./enc/koi8_u.c
|
|
compiling ./enc/trans/utf8_mac.c
|
|
compiling ./enc/shift_jis.c
|
|
compiling ./enc/trans/utf_16_32.c
|
|
compiling ./enc/utf_16be.c
|
|
compiling ./enc/utf_16le.c
|
|
linking transcoder transdb.so
|
|
linking transcoder big5.so
|
|
linking transcoder chinese.so
|
|
compiling ./enc/utf_32be.c
|
|
linking transcoder ebcdic.so
|
|
compiling ./enc/utf_32le.c
|
|
linking transcoder emoji.so
|
|
linking transcoder emoji_iso2022_kddi.so
|
|
linking transcoder emoji_sjis_docomo.so
|
|
linking transcoder emoji_sjis_kddi.so
|
|
compiling ./enc/windows_31j.c
|
|
compiling ./enc/windows_1250.c
|
|
linking transcoder emoji_sjis_softbank.so
|
|
linking transcoder escape.so
|
|
linking transcoder gb18030.so
|
|
linking transcoder gbk.so
|
|
linking transcoder iso2022.so
|
|
configuring sdbm
|
|
linking transcoder japanese.so
|
|
compiling ./enc/windows_1251.c
|
|
configuring dbm
|
|
linking transcoder japanese_euc.so
|
|
linking transcoder japanese_sjis.so
|
|
linking transcoder korean.so
|
|
linking transcoder single_byte.so
|
|
compiling ./enc/windows_1252.c
|
|
linking transcoder utf8_mac.so
|
|
linking transcoder utf_16_32.so
|
|
make[1]: Leaving directory '/tmp/ruby-build.20220607215706.16321.hja12y/ruby-2.6.10'
|
|
compiling ./enc/windows_1253.c
|
|
configuring pathname
|
|
compiling ./enc/windows_1254.c
|
|
compiling ./enc/windows_1257.c
|
|
linking encoding encdb.so
|
|
linking encoding big5.so
|
|
linking encoding cp949.so
|
|
linking encoding emacs_mule.so
|
|
configuring -test-/arith_seq/extract
|
|
configuring -test-/array/resize
|
|
configuring -test-/bignum
|
|
linking encoding euc_jp.so
|
|
configuring -test-/bug-14834
|
|
configuring -test-/bug-3571
|
|
configuring -test-/bug-5832
|
|
configuring -test-/bug_reporter
|
|
configuring -test-/class
|
|
configuring -test-/debug
|
|
linking encoding euc_kr.so
|
|
configuring -test-/dln/empty
|
|
configuring -test-/exception
|
|
configuring -test-/fatal
|
|
linking encoding euc_tw.so
|
|
configuring -test-/file
|
|
linking encoding gb2312.so
|
|
linking encoding gb18030.so
|
|
linking encoding gbk.so
|
|
linking encoding iso_8859_1.so
|
|
linking encoding iso_8859_2.so
|
|
linking encoding iso_8859_3.so
|
|
linking encoding iso_8859_4.so
|
|
linking encoding iso_8859_5.so
|
|
linking encoding iso_8859_6.so
|
|
linking encoding iso_8859_7.so
|
|
linking encoding iso_8859_8.so
|
|
linking encoding iso_8859_9.so
|
|
linking encoding iso_8859_10.so
|
|
linking encoding iso_8859_11.so
|
|
linking encoding iso_8859_13.so
|
|
linking encoding iso_8859_14.so
|
|
linking encoding iso_8859_15.so
|
|
configuring racc/cparse
|
|
linking encoding iso_8859_16.so
|
|
linking encoding koi8_r.so
|
|
linking encoding koi8_u.so
|
|
linking encoding shift_jis.so
|
|
linking encoding utf_16be.so
|
|
linking encoding utf_16le.so
|
|
linking encoding utf_32be.so
|
|
linking encoding utf_32le.so
|
|
linking encoding windows_31j.so
|
|
linking encoding windows_1250.so
|
|
linking encoding windows_1251.so
|
|
linking encoding windows_1252.so
|
|
linking encoding windows_1253.so
|
|
linking encoding windows_1254.so
|
|
linking encoding windows_1257.so
|
|
make[1]: Leaving directory '/tmp/ruby-build.20220607215706.16321.hja12y/ruby-2.6.10'
|
|
configuring readline
|
|
configuring rbconfig/sizeof
|
|
configuring -test-/float
|
|
configuring -test-/funcall
|
|
configuring -test-/gvl/call_without_gvl
|
|
configuring -test-/hash
|
|
configuring -test-/integer
|
|
configuring -test-/iseq_load
|
|
configuring -test-/iter
|
|
configuring -test-/load/dot.dot
|
|
configuring -test-/load/protect
|
|
configuring -test-/marshal/compat
|
|
configuring -test-/marshal/internal_ivar
|
|
configuring -test-/marshal/usr
|
|
configuring -test-/memory_status
|
|
configuring -test-/method
|
|
configuring -test-/notimplement
|
|
configuring -test-/num2int
|
|
configuring -test-/path_to_class
|
|
configuring -test-/popen_deadlock
|
|
configuring -test-/postponed_job
|
|
configuring -test-/printf
|
|
configuring -test-/proc
|
|
configuring -test-/rational
|
|
configuring -test-/recursion
|
|
configuring -test-/regexp
|
|
configuring -test-/scan_args
|
|
configuring -test-/st/foreach
|
|
configuring -test-/st/numhash
|
|
configuring -test-/st/update
|
|
configuring -test-/string
|
|
configuring -test-/struct
|
|
configuring -test-/symbol
|
|
configuring -test-/thread_fd_close
|
|
configuring -test-/time
|
|
configuring -test-/tracepoint
|
|
configuring -test-/typeddata
|
|
configuring -test-/vm
|
|
configuring -test-/wait_for_single_fd
|
|
making encs
|
|
make[1]: Entering directory '/tmp/ruby-build.20220607215706.16321.hja12y/ruby-2.6.10'
|
|
make[1]: Nothing to be done for 'encs'.
|
|
make[1]: Leaving directory '/tmp/ruby-build.20220607215706.16321.hja12y/ruby-2.6.10'
|
|
configuring etc
|
|
configuring fiddle
|
|
configuring ripper
|
|
configuring digest
|
|
configuring digest/bubblebabble
|
|
configuring digest/md5
|
|
configuring cgi/escape
|
|
configuring bigdecimal
|
|
configuring stringio
|
|
configuring objspace
|
|
configuring socket
|
|
configuring digest/rmd160
|
|
configuring digest/sha1
|
|
configuring zlib
|
|
configuring bigdecimal/util
|
|
configuring io/console
|
|
configuring digest/sha2
|
|
configuring io/nonblock
|
|
configuring fiber
|
|
configuring date
|
|
configuring io/wait
|
|
configuring openssl
|
|
make[1]: Leaving directory '/tmp/ruby-build.20220607215706.16321.hja12y/ruby-2.6.10'
|
|
generating makefile exts.mk
|
|
exts.mk updated
|
|
make[1]: Entering directory '/tmp/ruby-build.20220607215706.16321.hja12y/ruby-2.6.10'
|
|
make[2]: Entering directory '/tmp/ruby-build.20220607215706.16321.hja12y/ruby-2.6.10/ext/json'
|
|
make[2]: Entering directory '/tmp/ruby-build.20220607215706.16321.hja12y/ruby-2.6.10/ext/continuation'
|
|
make[2]: Entering directory '/tmp/ruby-build.20220607215706.16321.hja12y/ruby-2.6.10/ext/fcntl'
|
|
compiling continuation.c
|
|
compiling fcntl.c
|
|
make[2]: Entering directory '/tmp/ruby-build.20220607215706.16321.hja12y/ruby-2.6.10/ext/coverage'
|
|
compiling coverage.c
|
|
make[2]: Leaving directory '/tmp/ruby-build.20220607215706.16321.hja12y/ruby-2.6.10/ext/json'
|
|
installing default coverage libraries
|
|
make[2]: Entering directory '/tmp/ruby-build.20220607215706.16321.hja12y/ruby-2.6.10/ext/rubyvm'
|
|
installing default libraries
|
|
linking shared-object fcntl.so
|
|
make[2]: Leaving directory '/tmp/ruby-build.20220607215706.16321.hja12y/ruby-2.6.10/ext/rubyvm'
|
|
make[2]: Entering directory '/tmp/ruby-build.20220607215706.16321.hja12y/ruby-2.6.10/ext/syslog'
|
|
compiling syslog.c
|
|
make[2]: Leaving directory '/tmp/ruby-build.20220607215706.16321.hja12y/ruby-2.6.10/ext/fcntl'
|
|
make[2]: Entering directory '/tmp/ruby-build.20220607215706.16321.hja12y/ruby-2.6.10/ext/pty'
|
|
compiling pty.c
|
|
linking shared-object continuation.so
|
|
linking shared-object coverage.so
|
|
make[2]: Leaving directory '/tmp/ruby-build.20220607215706.16321.hja12y/ruby-2.6.10/ext/continuation'
|
|
installing default pty libraries
|
|
make[2]: Leaving directory '/tmp/ruby-build.20220607215706.16321.hja12y/ruby-2.6.10/ext/coverage'
|
|
make[2]: Entering directory '/tmp/ruby-build.20220607215706.16321.hja12y/ruby-2.6.10/ext/nkf'
|
|
compiling nkf.c
|
|
make[2]: Entering directory '/tmp/ruby-build.20220607215706.16321.hja12y/ruby-2.6.10/ext/strscan'
|
|
compiling strscan.c
|
|
installing default syslog libraries
|
|
linking shared-object syslog.so
|
|
make[2]: Leaving directory '/tmp/ruby-build.20220607215706.16321.hja12y/ruby-2.6.10/ext/syslog'
|
|
linking shared-object pty.so
|
|
installing default nkf libraries
|
|
make[2]: Entering directory '/tmp/ruby-build.20220607215706.16321.hja12y/ruby-2.6.10/ext/psych'
|
|
compiling psych_to_ruby.c
|
|
linking shared-object strscan.so
|
|
make[2]: Leaving directory '/tmp/ruby-build.20220607215706.16321.hja12y/ruby-2.6.10/ext/pty'
|
|
compiling psych_parser.c
|
|
make[2]: Leaving directory '/tmp/ruby-build.20220607215706.16321.hja12y/ruby-2.6.10/ext/strscan'
|
|
compiling psych_emitter.c
|
|
make[2]: Entering directory '/tmp/ruby-build.20220607215706.16321.hja12y/ruby-2.6.10/ext/sdbm'
|
|
compiling _sdbm.c
|
|
compiling init.c
|
|
compiling psych_yaml_tree.c
|
|
compiling psych.c
|
|
compiling ../.././ext/psych/yaml/reader.c
|
|
linking shared-object nkf.so
|
|
linking shared-object sdbm.so
|
|
make[2]: Leaving directory '/tmp/ruby-build.20220607215706.16321.hja12y/ruby-2.6.10/ext/nkf'
|
|
compiling ../.././ext/psych/yaml/parser.c
|
|
make[2]: Entering directory '/tmp/ruby-build.20220607215706.16321.hja12y/ruby-2.6.10/ext/pathname'
|
|
compiling pathname.c
|
|
make[2]: Entering directory '/tmp/ruby-build.20220607215706.16321.hja12y/ruby-2.6.10/ext/-test-/arith_seq/extract'
|
|
compiling extract.c
|
|
make[2]: Leaving directory '/tmp/ruby-build.20220607215706.16321.hja12y/ruby-2.6.10/ext/sdbm'
|
|
installing default pathname libraries
|
|
make[2]: Entering directory '/tmp/ruby-build.20220607215706.16321.hja12y/ruby-2.6.10/ext/-test-/array/resize'
|
|
compiling resize.c
|
|
linking shared-object -test-/arith_seq/extract.so
|
|
make[2]: Leaving directory '/tmp/ruby-build.20220607215706.16321.hja12y/ruby-2.6.10/ext/-test-/arith_seq/extract'
|
|
compiling ../.././ext/psych/yaml/dumper.c
|
|
make[2]: Entering directory '/tmp/ruby-build.20220607215706.16321.hja12y/ruby-2.6.10/ext/-test-/bignum'
|
|
compiling mul.c
|
|
linking shared-object -test-/array/resize.so
|
|
make[2]: Leaving directory '/tmp/ruby-build.20220607215706.16321.hja12y/ruby-2.6.10/ext/-test-/array/resize'
|
|
compiling intpack.c
|
|
compiling ../.././ext/psych/yaml/writer.c
|
|
linking shared-object pathname.so
|
|
make[2]: Leaving directory '/tmp/ruby-build.20220607215706.16321.hja12y/ruby-2.6.10/ext/pathname'
|
|
compiling ../.././ext/psych/yaml/scanner.c
|
|
compiling ../.././ext/psych/yaml/emitter.c
|
|
compiling big2str.c
|
|
compiling ../.././ext/psych/yaml/api.c
|
|
../.././ext/psych/yaml/api.c: In function ‘yaml_document_delete’:
|
|
../.././ext/psych/yaml/api.c:1122:7: warning: variable ‘context’ set but not used [-Wunused-but-set-variable]
|
|
1122 | } context;
|
|
| ^~~~~~~
|
|
compiling str2big.c
|
|
../.././ext/psych/yaml/api.c: At top level:
|
|
cc1: note: unrecognized command-line option ‘-Wno-self-assign’ may have been intended to silence earlier diagnostics
|
|
cc1: note: unrecognized command-line option ‘-Wno-parentheses-equality’ may have been intended to silence earlier diagnostics
|
|
cc1: note: unrecognized command-line option ‘-Wno-constant-logical-operand’ may have been intended to silence earlier diagnostics
|
|
compiling div.c
|
|
compiling ../.././ext/psych/yaml/loader.c
|
|
make[2]: Entering directory '/tmp/ruby-build.20220607215706.16321.hja12y/ruby-2.6.10/ext/-test-/bug-14834'
|
|
compiling bug-14384.c
|
|
compiling init.c
|
|
compiling bigzero.c
|
|
make[2]: Entering directory '/tmp/ruby-build.20220607215706.16321.hja12y/ruby-2.6.10/ext/-test-/bug-3571'
|
|
compiling bug.c
|
|
linking shared-object -test-/bignum.so
|
|
linking shared-object -test-/bug_14834.so
|
|
make[2]: Leaving directory '/tmp/ruby-build.20220607215706.16321.hja12y/ruby-2.6.10/ext/-test-/bignum'
|
|
make[2]: Entering directory '/tmp/ruby-build.20220607215706.16321.hja12y/ruby-2.6.10/ext/-test-/bug-5832'
|
|
compiling bug.c
|
|
make[2]: Leaving directory '/tmp/ruby-build.20220607215706.16321.hja12y/ruby-2.6.10/ext/-test-/bug-14834'
|
|
make[2]: Entering directory '/tmp/ruby-build.20220607215706.16321.hja12y/ruby-2.6.10/ext/-test-/bug_reporter'
|
|
compiling bug_reporter.c
|
|
linking shared-object psych.so
|
|
make[2]: Leaving directory '/tmp/ruby-build.20220607215706.16321.hja12y/ruby-2.6.10/ext/psych'
|
|
linking shared-object -test-/bug_3571.so
|
|
linking shared-object -test-/bug_reporter.so
|
|
make[2]: Entering directory '/tmp/ruby-build.20220607215706.16321.hja12y/ruby-2.6.10/ext/-test-/class'
|
|
compiling init.c
|
|
linking shared-object -test-/bug_5832.so
|
|
make[2]: Leaving directory '/tmp/ruby-build.20220607215706.16321.hja12y/ruby-2.6.10/ext/-test-/bug-3571'
|
|
make[2]: Leaving directory '/tmp/ruby-build.20220607215706.16321.hja12y/ruby-2.6.10/ext/-test-/bug_reporter'
|
|
compiling class2name.c
|
|
make[2]: Entering directory '/tmp/ruby-build.20220607215706.16321.hja12y/ruby-2.6.10/ext/-test-/debug'
|
|
compiling init.c
|
|
make[2]: Leaving directory '/tmp/ruby-build.20220607215706.16321.hja12y/ruby-2.6.10/ext/-test-/bug-5832'
|
|
compiling profile_frames.c
|
|
make[2]: Entering directory '/tmp/ruby-build.20220607215706.16321.hja12y/ruby-2.6.10/ext/-test-/dln/empty'
|
|
compiling empty.c
|
|
compiling inspector.c
|
|
linking shared-object -test-/dln/empty.so
|
|
make[2]: Entering directory '/tmp/ruby-build.20220607215706.16321.hja12y/ruby-2.6.10/ext/-test-/exception'
|
|
compiling init.c
|
|
linking shared-object -test-/class.so
|
|
make[2]: Leaving directory '/tmp/ruby-build.20220607215706.16321.hja12y/ruby-2.6.10/ext/-test-/dln/empty'
|
|
compiling dataerror.c
|
|
make[2]: Leaving directory '/tmp/ruby-build.20220607215706.16321.hja12y/ruby-2.6.10/ext/-test-/class'
|
|
compiling ensured.c
|
|
make[2]: Entering directory '/tmp/ruby-build.20220607215706.16321.hja12y/ruby-2.6.10/ext/-test-/fatal'
|
|
compiling rb_fatal.c
|
|
make[2]: Entering directory '/tmp/ruby-build.20220607215706.16321.hja12y/ruby-2.6.10/ext/-test-/file'
|
|
compiling init.c
|
|
compiling enc_raise.c
|
|
linking shared-object -test-/debug.so
|
|
make[2]: Leaving directory '/tmp/ruby-build.20220607215706.16321.hja12y/ruby-2.6.10/ext/-test-/debug'
|
|
compiling fs.c
|
|
make[2]: Entering directory '/tmp/ruby-build.20220607215706.16321.hja12y/ruby-2.6.10/ext/-test-/float'
|
|
linking shared-object -test-/exception.so
|
|
compiling nextafter.c
|
|
linking shared-object -test-/fatal/rb_fatal.so
|
|
make[2]: Leaving directory '/tmp/ruby-build.20220607215706.16321.hja12y/ruby-2.6.10/ext/-test-/exception'
|
|
compiling stat.c
|
|
make[2]: Leaving directory '/tmp/ruby-build.20220607215706.16321.hja12y/ruby-2.6.10/ext/-test-/fatal'
|
|
compiling init.c
|
|
make[2]: Entering directory '/tmp/ruby-build.20220607215706.16321.hja12y/ruby-2.6.10/ext/-test-/funcall'
|
|
make[2]: Entering directory '/tmp/ruby-build.20220607215706.16321.hja12y/ruby-2.6.10/ext/-test-/gvl/call_without_gvl'
|
|
compiling funcall.c
|
|
compiling call_without_gvl.c
|
|
linking shared-object -test-/file.so
|
|
linking shared-object -test-/float.so
|
|
make[2]: Leaving directory '/tmp/ruby-build.20220607215706.16321.hja12y/ruby-2.6.10/ext/-test-/file'
|
|
make[2]: Entering directory '/tmp/ruby-build.20220607215706.16321.hja12y/ruby-2.6.10/ext/-test-/hash'
|
|
make[2]: Leaving directory '/tmp/ruby-build.20220607215706.16321.hja12y/ruby-2.6.10/ext/-test-/float'
|
|
compiling delete.c
|
|
compiling init.c
|
|
linking shared-object -test-/gvl/call_without_gvl.so
|
|
make[2]: Entering directory '/tmp/ruby-build.20220607215706.16321.hja12y/ruby-2.6.10/ext/-test-/integer'
|
|
make[2]: Leaving directory '/tmp/ruby-build.20220607215706.16321.hja12y/ruby-2.6.10/ext/-test-/gvl/call_without_gvl'
|
|
compiling core_ext.c
|
|
compiling init.c
|
|
linking shared-object -test-/funcall.so
|
|
linking shared-object -test-/hash.so
|
|
make[2]: Leaving directory '/tmp/ruby-build.20220607215706.16321.hja12y/ruby-2.6.10/ext/-test-/funcall'
|
|
compiling my_integer.c
|
|
make[2]: Leaving directory '/tmp/ruby-build.20220607215706.16321.hja12y/ruby-2.6.10/ext/-test-/hash'
|
|
make[2]: Entering directory '/tmp/ruby-build.20220607215706.16321.hja12y/ruby-2.6.10/ext/-test-/iseq_load'
|
|
compiling iseq_load.c
|
|
make[2]: Entering directory '/tmp/ruby-build.20220607215706.16321.hja12y/ruby-2.6.10/ext/-test-/iter'
|
|
compiling yield.c
|
|
make[2]: Entering directory '/tmp/ruby-build.20220607215706.16321.hja12y/ruby-2.6.10/ext/-test-/load/dot.dot'
|
|
compiling dot.dot.c
|
|
linking shared-object -test-/iseq_load.so
|
|
linking shared-object -test-/load/dot.dot.so
|
|
make[2]: Leaving directory '/tmp/ruby-build.20220607215706.16321.hja12y/ruby-2.6.10/ext/-test-/iseq_load'
|
|
compiling break.c
|
|
linking shared-object -test-/integer.so
|
|
make[2]: Leaving directory '/tmp/ruby-build.20220607215706.16321.hja12y/ruby-2.6.10/ext/-test-/load/dot.dot'
|
|
compiling init.c
|
|
make[2]: Leaving directory '/tmp/ruby-build.20220607215706.16321.hja12y/ruby-2.6.10/ext/-test-/integer'
|
|
make[2]: Entering directory '/tmp/ruby-build.20220607215706.16321.hja12y/ruby-2.6.10/ext/-test-/load/protect'
|
|
compiling protect.c
|
|
make[2]: Entering directory '/tmp/ruby-build.20220607215706.16321.hja12y/ruby-2.6.10/ext/-test-/marshal/compat'
|
|
compiling usrcompat.c
|
|
make[2]: Entering directory '/tmp/ruby-build.20220607215706.16321.hja12y/ruby-2.6.10/ext/-test-/marshal/internal_ivar'
|
|
linking shared-object -test-/iter.so
|
|
compiling internal_ivar.c
|
|
linking shared-object -test-/load/protect.so
|
|
make[2]: Leaving directory '/tmp/ruby-build.20220607215706.16321.hja12y/ruby-2.6.10/ext/-test-/iter'
|
|
make[2]: Entering directory '/tmp/ruby-build.20220607215706.16321.hja12y/ruby-2.6.10/ext/-test-/marshal/usr'
|
|
compiling usrmarshal.c
|
|
make[2]: Leaving directory '/tmp/ruby-build.20220607215706.16321.hja12y/ruby-2.6.10/ext/-test-/load/protect'
|
|
make[2]: Entering directory '/tmp/ruby-build.20220607215706.16321.hja12y/ruby-2.6.10/ext/-test-/method'
|
|
compiling init.c
|
|
linking shared-object -test-/marshal/internal_ivar.so
|
|
linking shared-object -test-/marshal/usr.so
|
|
make[2]: Leaving directory '/tmp/ruby-build.20220607215706.16321.hja12y/ruby-2.6.10/ext/-test-/marshal/internal_ivar'
|
|
linking shared-object -test-/marshal/compat.so
|
|
compiling arity.c
|
|
make[2]: Entering directory '/tmp/ruby-build.20220607215706.16321.hja12y/ruby-2.6.10/ext/-test-/notimplement'
|
|
compiling bug.c
|
|
make[2]: Leaving directory '/tmp/ruby-build.20220607215706.16321.hja12y/ruby-2.6.10/ext/-test-/marshal/usr'
|
|
make[2]: Entering directory '/tmp/ruby-build.20220607215706.16321.hja12y/ruby-2.6.10/ext/-test-/num2int'
|
|
compiling num2int.c
|
|
make[2]: Leaving directory '/tmp/ruby-build.20220607215706.16321.hja12y/ruby-2.6.10/ext/-test-/marshal/compat'
|
|
make[2]: Entering directory '/tmp/ruby-build.20220607215706.16321.hja12y/ruby-2.6.10/ext/-test-/path_to_class'
|
|
compiling path_to_class.c
|
|
linking shared-object -test-/num2int.so
|
|
linking shared-object -test-/path_to_class.so
|
|
linking shared-object -test-/notimplement.so
|
|
make[2]: Leaving directory '/tmp/ruby-build.20220607215706.16321.hja12y/ruby-2.6.10/ext/-test-/path_to_class'
|
|
make[2]: Leaving directory '/tmp/ruby-build.20220607215706.16321.hja12y/ruby-2.6.10/ext/-test-/num2int'
|
|
make[2]: Leaving directory '/tmp/ruby-build.20220607215706.16321.hja12y/ruby-2.6.10/ext/-test-/notimplement'
|
|
make[2]: Entering directory '/tmp/ruby-build.20220607215706.16321.hja12y/ruby-2.6.10/ext/-test-/popen_deadlock'
|
|
make[2]: Entering directory '/tmp/ruby-build.20220607215706.16321.hja12y/ruby-2.6.10/ext/-test-/postponed_job'
|
|
compiling infinite_loop_dlsym.c
|
|
make[2]: Entering directory '/tmp/ruby-build.20220607215706.16321.hja12y/ruby-2.6.10/ext/-test-/printf'
|
|
compiling printf.c
|
|
compiling postponed_job.c
|
|
linking shared-object -test-/method.so
|
|
make[2]: Leaving directory '/tmp/ruby-build.20220607215706.16321.hja12y/ruby-2.6.10/ext/-test-/method'
|
|
make[2]: Entering directory '/tmp/ruby-build.20220607215706.16321.hja12y/ruby-2.6.10/ext/-test-/proc'
|
|
compiling super.c
|
|
linking shared-object -test-/postponed_job.so
|
|
make[2]: Leaving directory '/tmp/ruby-build.20220607215706.16321.hja12y/ruby-2.6.10/ext/-test-/postponed_job'
|
|
compiling init.c
|
|
compiling receiver.c
|
|
linking shared-object -test-/printf.so
|
|
make[2]: Leaving directory '/tmp/ruby-build.20220607215706.16321.hja12y/ruby-2.6.10/ext/-test-/printf'
|
|
linking shared-object -test-/popen_deadlock/infinite_loop_dlsym.so
|
|
make[2]: Entering directory '/tmp/ruby-build.20220607215706.16321.hja12y/ruby-2.6.10/ext/-test-/rational'
|
|
compiling rat.c
|
|
make[2]: Leaving directory '/tmp/ruby-build.20220607215706.16321.hja12y/ruby-2.6.10/ext/-test-/popen_deadlock'
|
|
make[2]: Entering directory '/tmp/ruby-build.20220607215706.16321.hja12y/ruby-2.6.10/ext/-test-/recursion'
|
|
compiling recursion.c
|
|
make[2]: Entering directory '/tmp/ruby-build.20220607215706.16321.hja12y/ruby-2.6.10/ext/-test-/regexp'
|
|
compiling init.c
|
|
linking shared-object -test-/rational.so
|
|
linking shared-object -test-/proc.so
|
|
linking shared-object -test-/recursion.so
|
|
make[2]: Leaving directory '/tmp/ruby-build.20220607215706.16321.hja12y/ruby-2.6.10/ext/-test-/rational'
|
|
compiling parse_depth_limit.c
|
|
make[2]: Leaving directory '/tmp/ruby-build.20220607215706.16321.hja12y/ruby-2.6.10/ext/-test-/proc'
|
|
make[2]: Leaving directory '/tmp/ruby-build.20220607215706.16321.hja12y/ruby-2.6.10/ext/-test-/recursion'
|
|
make[2]: Entering directory '/tmp/ruby-build.20220607215706.16321.hja12y/ruby-2.6.10/ext/-test-/scan_args'
|
|
make[2]: Entering directory '/tmp/ruby-build.20220607215706.16321.hja12y/ruby-2.6.10/ext/-test-/st/foreach'
|
|
compiling scan_args.c
|
|
compiling foreach.c
|
|
make[2]: Entering directory '/tmp/ruby-build.20220607215706.16321.hja12y/ruby-2.6.10/ext/-test-/st/numhash'
|
|
compiling numhash.c
|
|
linking shared-object -test-/st/foreach.so
|
|
linking shared-object -test-/regexp.so
|
|
linking shared-object -test-/st/numhash.so
|
|
make[2]: Leaving directory '/tmp/ruby-build.20220607215706.16321.hja12y/ruby-2.6.10/ext/-test-/st/foreach'
|
|
make[2]: Entering directory '/tmp/ruby-build.20220607215706.16321.hja12y/ruby-2.6.10/ext/-test-/st/update'
|
|
compiling update.c
|
|
linking shared-object -test-/scan_args.so
|
|
make[2]: Leaving directory '/tmp/ruby-build.20220607215706.16321.hja12y/ruby-2.6.10/ext/-test-/regexp'
|
|
make[2]: Entering directory '/tmp/ruby-build.20220607215706.16321.hja12y/ruby-2.6.10/ext/-test-/string'
|
|
compiling normalize.c
|
|
make[2]: Leaving directory '/tmp/ruby-build.20220607215706.16321.hja12y/ruby-2.6.10/ext/-test-/st/numhash'
|
|
compiling fstring.c
|
|
make[2]: Leaving directory '/tmp/ruby-build.20220607215706.16321.hja12y/ruby-2.6.10/ext/-test-/scan_args'
|
|
compiling capacity.c
|
|
make[2]: Entering directory '/tmp/ruby-build.20220607215706.16321.hja12y/ruby-2.6.10/ext/-test-/struct'
|
|
compiling member.c
|
|
compiling duplicate.c
|
|
compiling enc_str_buf_cat.c
|
|
linking shared-object -test-/st/update.so
|
|
compiling new.c
|
|
make[2]: Leaving directory '/tmp/ruby-build.20220607215706.16321.hja12y/ruby-2.6.10/ext/-test-/st/update'
|
|
compiling init.c
|
|
compiling len.c
|
|
make[2]: Entering directory '/tmp/ruby-build.20220607215706.16321.hja12y/ruby-2.6.10/ext/-test-/symbol'
|
|
compiling init.c
|
|
compiling type.c
|
|
linking shared-object -test-/struct.so
|
|
make[2]: Leaving directory '/tmp/ruby-build.20220607215706.16321.hja12y/ruby-2.6.10/ext/-test-/struct'
|
|
compiling init.c
|
|
make[2]: Entering directory '/tmp/ruby-build.20220607215706.16321.hja12y/ruby-2.6.10/ext/-test-/thread_fd_close'
|
|
compiling thread_fd_close.c
|
|
make[2]: Entering directory '/tmp/ruby-build.20220607215706.16321.hja12y/ruby-2.6.10/ext/-test-/time'
|
|
compiling new.c
|
|
linking shared-object -test-/symbol.so
|
|
make[2]: Leaving directory '/tmp/ruby-build.20220607215706.16321.hja12y/ruby-2.6.10/ext/-test-/symbol'
|
|
compiling leap_second.c
|
|
linking shared-object -test-/thread_fd_close.so
|
|
compiling modify.c
|
|
make[2]: Entering directory '/tmp/ruby-build.20220607215706.16321.hja12y/ruby-2.6.10/ext/-test-/tracepoint'
|
|
make[2]: Leaving directory '/tmp/ruby-build.20220607215706.16321.hja12y/ruby-2.6.10/ext/-test-/thread_fd_close'
|
|
compiling gc_hook.c
|
|
compiling init.c
|
|
compiling ellipsize.c
|
|
linking shared-object -test-/time.so
|
|
compiling tracepoint.c
|
|
make[2]: Entering directory '/tmp/ruby-build.20220607215706.16321.hja12y/ruby-2.6.10/ext/-test-/typeddata'
|
|
compiling typeddata.c
|
|
make[2]: Leaving directory '/tmp/ruby-build.20220607215706.16321.hja12y/ruby-2.6.10/ext/-test-/time'
|
|
compiling enc_associate.c
|
|
linking shared-object -test-/typeddata.so
|
|
linking shared-object -test-/tracepoint.so
|
|
make[2]: Entering directory '/tmp/ruby-build.20220607215706.16321.hja12y/ruby-2.6.10/ext/-test-/vm'
|
|
compiling rb_str_dup.c
|
|
compiling at_exit.c
|
|
make[2]: Leaving directory '/tmp/ruby-build.20220607215706.16321.hja12y/ruby-2.6.10/ext/-test-/typeddata'
|
|
compiling set_len.c
|
|
make[2]: Leaving directory '/tmp/ruby-build.20220607215706.16321.hja12y/ruby-2.6.10/ext/-test-/tracepoint'
|
|
compiling cstr.c
|
|
make[2]: Entering directory '/tmp/ruby-build.20220607215706.16321.hja12y/ruby-2.6.10/ext/-test-/wait_for_single_fd'
|
|
compiling wait_for_single_fd.c
|
|
make[2]: Entering directory '/tmp/ruby-build.20220607215706.16321.hja12y/ruby-2.6.10/ext/racc/cparse'
|
|
compiling cparse.c
|
|
linking shared-object -test-/vm/at_exit.so
|
|
compiling coderange.c
|
|
make[2]: Leaving directory '/tmp/ruby-build.20220607215706.16321.hja12y/ruby-2.6.10/ext/-test-/vm'
|
|
compiling qsort.c
|
|
linking shared-object -test-/wait_for_single_fd.so
|
|
linking shared-object racc/cparse.so
|
|
make[2]: Leaving directory '/tmp/ruby-build.20220607215706.16321.hja12y/ruby-2.6.10/ext/-test-/wait_for_single_fd'
|
|
compiling nofree.c
|
|
make[2]: Leaving directory '/tmp/ruby-build.20220607215706.16321.hja12y/ruby-2.6.10/ext/racc/cparse'
|
|
make[2]: Entering directory '/tmp/ruby-build.20220607215706.16321.hja12y/ruby-2.6.10/ext/readline'
|
|
compiling readline.c
|
|
make[2]: Entering directory '/tmp/ruby-build.20220607215706.16321.hja12y/ruby-2.6.10/ext/rbconfig/sizeof'
|
|
compiling sizes.c
|
|
make[2]: Entering directory '/tmp/ruby-build.20220607215706.16321.hja12y/ruby-2.6.10/ext/etc'
|
|
compiling etc.c
|
|
linking shared-object -test-/string.so
|
|
compiling limits.c
|
|
make[2]: Leaving directory '/tmp/ruby-build.20220607215706.16321.hja12y/ruby-2.6.10/ext/-test-/string'
|
|
linking shared-object etc.so
|
|
make[2]: Entering directory '/tmp/ruby-build.20220607215706.16321.hja12y/ruby-2.6.10/ext/fiddle'
|
|
compiling closure.c
|
|
make[2]: Leaving directory '/tmp/ruby-build.20220607215706.16321.hja12y/ruby-2.6.10/ext/etc'
|
|
compiling conversions.c
|
|
linking shared-object readline.so
|
|
linking shared-object rbconfig/sizeof.so
|
|
make[2]: Leaving directory '/tmp/ruby-build.20220607215706.16321.hja12y/ruby-2.6.10/ext/readline'
|
|
compiling fiddle.c
|
|
make[2]: Leaving directory '/tmp/ruby-build.20220607215706.16321.hja12y/ruby-2.6.10/ext/rbconfig/sizeof'
|
|
compiling function.c
|
|
compiling handle.c
|
|
make[2]: Entering directory '/tmp/ruby-build.20220607215706.16321.hja12y/ruby-2.6.10/ext/ripper'
|
|
compiling ripper.c
|
|
make[2]: Entering directory '/tmp/ruby-build.20220607215706.16321.hja12y/ruby-2.6.10/ext/digest'
|
|
compiling digest.c
|
|
make[2]: Entering directory '/tmp/ruby-build.20220607215706.16321.hja12y/ruby-2.6.10/ext/cgi/escape'
|
|
compiling escape.c
|
|
compiling pointer.c
|
|
installing default digest libraries
|
|
linking shared-object cgi/escape.so
|
|
linking shared-object digest.so
|
|
make[2]: Leaving directory '/tmp/ruby-build.20220607215706.16321.hja12y/ruby-2.6.10/ext/cgi/escape'
|
|
installing digest libraries
|
|
make[2]: Leaving directory '/tmp/ruby-build.20220607215706.16321.hja12y/ruby-2.6.10/ext/digest'
|
|
make[2]: Entering directory '/tmp/ruby-build.20220607215706.16321.hja12y/ruby-2.6.10/ext/bigdecimal'
|
|
compiling bigdecimal.c
|
|
make[2]: Entering directory '/tmp/ruby-build.20220607215706.16321.hja12y/ruby-2.6.10/ext/stringio'
|
|
compiling stringio.c
|
|
installing default fiddle libraries
|
|
stringio.c: In function ‘strio_ungetbyte’:
|
|
stringio.c:814:9: warning: ISO C90 forbids mixed declarations and code [-Wdeclaration-after-statement]
|
|
814 | VALUE v = rb_funcall(c, rb_intern("modulo"), 1, INT2FIX(256));
|
|
| ^~~~~
|
|
stringio.c:822:5: warning: ISO C90 forbids mixed declarations and code [-Wdeclaration-after-statement]
|
|
822 | const char *cp = RSTRING_PTR(c);
|
|
| ^~~~~
|
|
linking shared-object fiddle.so
|
|
make[2]: Leaving directory '/tmp/ruby-build.20220607215706.16321.hja12y/ruby-2.6.10/ext/fiddle'
|
|
make[2]: Entering directory '/tmp/ruby-build.20220607215706.16321.hja12y/ruby-2.6.10/ext/objspace'
|
|
compiling object_tracing.c
|
|
stringio.c: At top level:
|
|
cc1: note: unrecognized command-line option ‘-Wno-self-assign’ may have been intended to silence earlier diagnostics
|
|
cc1: note: unrecognized command-line option ‘-Wno-parentheses-equality’ may have been intended to silence earlier diagnostics
|
|
cc1: note: unrecognized command-line option ‘-Wno-constant-logical-operand’ may have been intended to silence earlier diagnostics
|
|
linking shared-object stringio.so
|
|
make[2]: Leaving directory '/tmp/ruby-build.20220607215706.16321.hja12y/ruby-2.6.10/ext/stringio'
|
|
compiling objspace.c
|
|
compiling objspace_dump.c
|
|
checking ../.././parse.y and ../.././ext/ripper/eventids2.c
|
|
installing default ripper libraries
|
|
installing default bigdecimal libraries
|
|
make[2]: Entering directory '/tmp/ruby-build.20220607215706.16321.hja12y/ruby-2.6.10/ext/socket'
|
|
compiling init.c
|
|
linking shared-object objspace.so
|
|
make[2]: Leaving directory '/tmp/ruby-build.20220607215706.16321.hja12y/ruby-2.6.10/ext/objspace'
|
|
compiling constants.c
|
|
linking shared-object bigdecimal.so
|
|
make[2]: Leaving directory '/tmp/ruby-build.20220607215706.16321.hja12y/ruby-2.6.10/ext/bigdecimal'
|
|
compiling basicsocket.c
|
|
In file included from init.c:11:
|
|
rubysocket.h:118:36: warning: argument 2 of type ‘char *’ declared as a pointer [-Warray-parameter=]
|
|
118 | char *if_indextoname(unsigned int, char *);
|
|
| ^~~~~~
|
|
In file included from rubysocket.h:97,
|
|
from init.c:11:
|
|
/usr/include/net/if.h:195:35: note: previously declared as an array ‘char[16]’
|
|
195 | char __ifname[IF_NAMESIZE]) __THROW
|
|
| ~~~~~^~~~~~~~~~~~~~~~~~~~~
|
|
cc1: note: unrecognized command-line option ‘-Wno-self-assign’ may have been intended to silence earlier diagnostics
|
|
cc1: note: unrecognized command-line option ‘-Wno-parentheses-equality’ may have been intended to silence earlier diagnostics
|
|
cc1: note: unrecognized command-line option ‘-Wno-constant-logical-operand’ may have been intended to silence earlier diagnostics
|
|
make[2]: Entering directory '/tmp/ruby-build.20220607215706.16321.hja12y/ruby-2.6.10/ext/zlib'
|
|
compiling zlib.c
|
|
In file included from constants.c:11:
|
|
rubysocket.h:118:36: warning: argument 2 of type ‘char *’ declared as a pointer [-Warray-parameter=]
|
|
118 | char *if_indextoname(unsigned int, char *);
|
|
| ^~~~~~
|
|
In file included from rubysocket.h:97,
|
|
from constants.c:11:
|
|
/usr/include/net/if.h:195:35: note: previously declared as an array ‘char[16]’
|
|
195 | char __ifname[IF_NAMESIZE]) __THROW
|
|
| ~~~~~^~~~~~~~~~~~~~~~~~~~~
|
|
In file included from basicsocket.c:11:
|
|
rubysocket.h:118:36: warning: argument 2 of type ‘char *’ declared as a pointer [-Warray-parameter=]
|
|
118 | char *if_indextoname(unsigned int, char *);
|
|
| ^~~~~~
|
|
In file included from rubysocket.h:97,
|
|
from basicsocket.c:11:
|
|
/usr/include/net/if.h:195:35: note: previously declared as an array ‘char[16]’
|
|
195 | char __ifname[IF_NAMESIZE]) __THROW
|
|
| ~~~~~^~~~~~~~~~~~~~~~~~~~~
|
|
cc1: note: unrecognized command-line option ‘-Wno-self-assign’ may have been intended to silence earlier diagnostics
|
|
cc1: note: unrecognized command-line option ‘-Wno-parentheses-equality’ may have been intended to silence earlier diagnostics
|
|
cc1: note: unrecognized command-line option ‘-Wno-constant-logical-operand’ may have been intended to silence earlier diagnostics
|
|
make[2]: Entering directory '/tmp/ruby-build.20220607215706.16321.hja12y/ruby-2.6.10/ext/io/console'
|
|
compiling console.c
|
|
cc1: note: unrecognized command-line option ‘-Wno-self-assign’ may have been intended to silence earlier diagnostics
|
|
cc1: note: unrecognized command-line option ‘-Wno-parentheses-equality’ may have been intended to silence earlier diagnostics
|
|
cc1: note: unrecognized command-line option ‘-Wno-constant-logical-operand’ may have been intended to silence earlier diagnostics
|
|
compiling socket.c
|
|
linking shared-object io/console.so
|
|
In file included from socket.c:11:
|
|
rubysocket.h:118:36: warning: argument 2 of type ‘char *’ declared as a pointer [-Warray-parameter=]
|
|
118 | char *if_indextoname(unsigned int, char *);
|
|
| ^~~~~~
|
|
In file included from rubysocket.h:97,
|
|
from socket.c:11:
|
|
/usr/include/net/if.h:195:35: note: previously declared as an array ‘char[16]’
|
|
195 | char __ifname[IF_NAMESIZE]) __THROW
|
|
| ~~~~~^~~~~~~~~~~~~~~~~~~~~
|
|
installing default console libraries
|
|
make[2]: Leaving directory '/tmp/ruby-build.20220607215706.16321.hja12y/ruby-2.6.10/ext/io/console'
|
|
compiling ipsocket.c
|
|
linking shared-object zlib.so
|
|
make[2]: Leaving directory '/tmp/ruby-build.20220607215706.16321.hja12y/ruby-2.6.10/ext/zlib'
|
|
cc1: note: unrecognized command-line option ‘-Wno-self-assign’ may have been intended to silence earlier diagnostics
|
|
cc1: note: unrecognized command-line option ‘-Wno-parentheses-equality’ may have been intended to silence earlier diagnostics
|
|
cc1: note: unrecognized command-line option ‘-Wno-constant-logical-operand’ may have been intended to silence earlier diagnostics
|
|
compiling tcpsocket.c
|
|
make[2]: Entering directory '/tmp/ruby-build.20220607215706.16321.hja12y/ruby-2.6.10/ext/io/nonblock'
|
|
compiling nonblock.c
|
|
linking shared-object ripper.so
|
|
make[2]: Leaving directory '/tmp/ruby-build.20220607215706.16321.hja12y/ruby-2.6.10/ext/ripper'
|
|
compiling tcpserver.c
|
|
In file included from ipsocket.c:11:
|
|
rubysocket.h:118:36: warning: argument 2 of type ‘char *’ declared as a pointer [-Warray-parameter=]
|
|
118 | char *if_indextoname(unsigned int, char *);
|
|
| ^~~~~~
|
|
In file included from rubysocket.h:97,
|
|
from ipsocket.c:11:
|
|
/usr/include/net/if.h:195:35: note: previously declared as an array ‘char[16]’
|
|
195 | char __ifname[IF_NAMESIZE]) __THROW
|
|
| ~~~~~^~~~~~~~~~~~~~~~~~~~~
|
|
linking shared-object io/nonblock.so
|
|
cc1: note: unrecognized command-line option ‘-Wno-self-assign’ may have been intended to silence earlier diagnostics
|
|
cc1: note: unrecognized command-line option ‘-Wno-parentheses-equality’ may have been intended to silence earlier diagnostics
|
|
cc1: note: unrecognized command-line option ‘-Wno-constant-logical-operand’ may have been intended to silence earlier diagnostics
|
|
make[2]: Entering directory '/tmp/ruby-build.20220607215706.16321.hja12y/ruby-2.6.10/ext/io/wait'
|
|
compiling wait.c
|
|
make[2]: Leaving directory '/tmp/ruby-build.20220607215706.16321.hja12y/ruby-2.6.10/ext/io/nonblock'
|
|
compiling sockssocket.c
|
|
In file included from tcpsocket.c:11:
|
|
rubysocket.h:118:36: warning: argument 2 of type ‘char *’ declared as a pointer [-Warray-parameter=]
|
|
118 | char *if_indextoname(unsigned int, char *);
|
|
| ^~~~~~
|
|
In file included from rubysocket.h:97,
|
|
from tcpsocket.c:11:
|
|
/usr/include/net/if.h:195:35: note: previously declared as an array ‘char[16]’
|
|
195 | char __ifname[IF_NAMESIZE]) __THROW
|
|
| ~~~~~^~~~~~~~~~~~~~~~~~~~~
|
|
cc1: note: unrecognized command-line option ‘-Wno-self-assign’ may have been intended to silence earlier diagnostics
|
|
cc1: note: unrecognized command-line option ‘-Wno-parentheses-equality’ may have been intended to silence earlier diagnostics
|
|
cc1: note: unrecognized command-line option ‘-Wno-constant-logical-operand’ may have been intended to silence earlier diagnostics
|
|
make[2]: Entering directory '/tmp/ruby-build.20220607215706.16321.hja12y/ruby-2.6.10/ext/fiber'
|
|
compiling fiber.c
|
|
linking shared-object fiber.so
|
|
make[2]: Leaving directory '/tmp/ruby-build.20220607215706.16321.hja12y/ruby-2.6.10/ext/fiber'
|
|
compiling udpsocket.c
|
|
In file included from sockssocket.c:11:
|
|
rubysocket.h:118:36: warning: argument 2 of type ‘char *’ declared as a pointer [-Warray-parameter=]
|
|
118 | char *if_indextoname(unsigned int, char *);
|
|
| ^~~~~~
|
|
In file included from rubysocket.h:97,
|
|
from sockssocket.c:11:
|
|
/usr/include/net/if.h:195:35: note: previously declared as an array ‘char[16]’
|
|
195 | char __ifname[IF_NAMESIZE]) __THROW
|
|
| ~~~~~^~~~~~~~~~~~~~~~~~~~~
|
|
cc1: note: unrecognized command-line option ‘-Wno-self-assign’ may have been intended to silence earlier diagnostics
|
|
cc1: note: unrecognized command-line option ‘-Wno-parentheses-equality’ may have been intended to silence earlier diagnostics
|
|
cc1: note: unrecognized command-line option ‘-Wno-constant-logical-operand’ may have been intended to silence earlier diagnostics
|
|
In file included from tcpserver.c:11:
|
|
rubysocket.h:118:36: warning: argument 2 of type ‘char *’ declared as a pointer [-Warray-parameter=]
|
|
118 | char *if_indextoname(unsigned int, char *);
|
|
| ^~~~~~
|
|
In file included from rubysocket.h:97,
|
|
from tcpserver.c:11:
|
|
/usr/include/net/if.h:195:35: note: previously declared as an array ‘char[16]’
|
|
195 | char __ifname[IF_NAMESIZE]) __THROW
|
|
| ~~~~~^~~~~~~~~~~~~~~~~~~~~
|
|
linking shared-object io/wait.so
|
|
cc1: note: unrecognized command-line option ‘-Wno-self-assign’ may have been intended to silence earlier diagnostics
|
|
cc1: note: unrecognized command-line option ‘-Wno-parentheses-equality’ may have been intended to silence earlier diagnostics
|
|
cc1: note: unrecognized command-line option ‘-Wno-constant-logical-operand’ may have been intended to silence earlier diagnostics
|
|
make[2]: Entering directory '/tmp/ruby-build.20220607215706.16321.hja12y/ruby-2.6.10/ext/date'
|
|
compiling date_core.c
|
|
make[2]: Entering directory '/tmp/ruby-build.20220607215706.16321.hja12y/ruby-2.6.10/ext/openssl'
|
|
compiling openssl_missing.c
|
|
make[2]: Leaving directory '/tmp/ruby-build.20220607215706.16321.hja12y/ruby-2.6.10/ext/io/wait'
|
|
compiling date_parse.c
|
|
In file included from udpsocket.c:11:
|
|
rubysocket.h:118:36: warning: argument 2 of type ‘char *’ declared as a pointer [-Warray-parameter=]
|
|
118 | char *if_indextoname(unsigned int, char *);
|
|
| ^~~~~~
|
|
In file included from rubysocket.h:97,
|
|
from udpsocket.c:11:
|
|
/usr/include/net/if.h:195:35: note: previously declared as an array ‘char[16]’
|
|
195 | char __ifname[IF_NAMESIZE]) __THROW
|
|
| ~~~~~^~~~~~~~~~~~~~~~~~~~~
|
|
date_core.c: In function ‘check_limit’:
|
|
date_core.c:4313:5: warning: ISO C90 forbids mixed declarations and code [-Wdeclaration-after-statement]
|
|
4313 | size_t slen = RSTRING_LEN(str);
|
|
| ^~~~~~
|
|
date_core.c: In function ‘date_s_parse’:
|
|
date_core.c:4417:9: warning: ISO C90 forbids mixed declarations and code [-Wdeclaration-after-statement]
|
|
4417 | VALUE hash = date_s__parse(argc2, argv2, klass);
|
|
| ^~~~~
|
|
date_core.c: In function ‘date_s_iso8601’:
|
|
date_core.c:4485:9: warning: ISO C90 forbids mixed declarations and code [-Wdeclaration-after-statement]
|
|
4485 | VALUE hash = date_s__iso8601(argc2, argv2, klass);
|
|
| ^~~~~
|
|
date_core.c: In function ‘date_s_rfc3339’:
|
|
date_core.c:4544:9: warning: ISO C90 forbids mixed declarations and code [-Wdeclaration-after-statement]
|
|
4544 | VALUE hash = date_s__rfc3339(argc2, argv2, klass);
|
|
| ^~~~~
|
|
date_core.c: In function ‘date_s_xmlschema’:
|
|
date_core.c:4603:9: warning: ISO C90 forbids mixed declarations and code [-Wdeclaration-after-statement]
|
|
4603 | VALUE hash = date_s__xmlschema(argc2, argv2, klass);
|
|
| ^~~~~
|
|
date_core.c: In function ‘date_s_rfc2822’:
|
|
date_core.c:4664:9: warning: ISO C90 forbids mixed declarations and code [-Wdeclaration-after-statement]
|
|
4664 | VALUE hash = date_s__rfc2822(argc2, argv2, klass);
|
|
| ^~~~~
|
|
date_core.c: In function ‘date_s_httpdate’:
|
|
date_core.c:4723:9: warning: ISO C90 forbids mixed declarations and code [-Wdeclaration-after-statement]
|
|
4723 | VALUE hash = date_s__httpdate(argc2, argv2, klass);
|
|
| ^~~~~
|
|
date_core.c: In function ‘date_s_jisx0301’:
|
|
date_core.c:4786:9: warning: ISO C90 forbids mixed declarations and code [-Wdeclaration-after-statement]
|
|
4786 | VALUE hash = date_s__jisx0301(argc2, argv2, klass);
|
|
| ^~~~~
|
|
compiling ossl.c
|
|
cc1: note: unrecognized command-line option ‘-Wno-self-assign’ may have been intended to silence earlier diagnostics
|
|
cc1: note: unrecognized command-line option ‘-Wno-parentheses-equality’ may have been intended to silence earlier diagnostics
|
|
cc1: note: unrecognized command-line option ‘-Wno-constant-logical-operand’ may have been intended to silence earlier diagnostics
|
|
date_core.c: In function ‘datetime_s_parse’:
|
|
date_core.c:8149:9: warning: ISO C90 forbids mixed declarations and code [-Wdeclaration-after-statement]
|
|
8149 | VALUE hash = date_s__parse(argc2, argv2, klass);
|
|
| ^~~~~
|
|
date_core.c: In function ‘datetime_s_iso8601’:
|
|
date_core.c:8193:9: warning: ISO C90 forbids mixed declarations and code [-Wdeclaration-after-statement]
|
|
8193 | VALUE hash = date_s__iso8601(argc2, argv2, klass);
|
|
| ^~~~~
|
|
date_core.c: In function ‘datetime_s_rfc3339’:
|
|
date_core.c:8233:9: warning: ISO C90 forbids mixed declarations and code [-Wdeclaration-after-statement]
|
|
8233 | VALUE hash = date_s__rfc3339(argc2, argv2, klass);
|
|
| ^~~~~
|
|
date_core.c: In function ‘datetime_s_xmlschema’:
|
|
date_core.c:8273:9: warning: ISO C90 forbids mixed declarations and code [-Wdeclaration-after-statement]
|
|
8273 | VALUE hash = date_s__xmlschema(argc2, argv2, klass);
|
|
| ^~~~~
|
|
date_core.c: In function ‘datetime_s_rfc2822’:
|
|
date_core.c:8314:9: warning: ISO C90 forbids mixed declarations and code [-Wdeclaration-after-statement]
|
|
8314 | VALUE hash = date_s__rfc2822(argc2, argv2, klass);
|
|
| ^~~~~
|
|
date_core.c: In function ‘datetime_s_httpdate’:
|
|
date_core.c:8354:9: warning: ISO C90 forbids mixed declarations and code [-Wdeclaration-after-statement]
|
|
8354 | VALUE hash = date_s__httpdate(argc2, argv2, klass);
|
|
| ^~~~~
|
|
date_core.c: In function ‘datetime_s_jisx0301’:
|
|
date_core.c:8399:9: warning: ISO C90 forbids mixed declarations and code [-Wdeclaration-after-statement]
|
|
8399 | VALUE hash = date_s__jisx0301(argc2, argv2, klass);
|
|
| ^~~~~
|
|
compiling unixsocket.c
|
|
ossl.c: In function ‘ossl_clear_error’:
|
|
ossl.c:311:9: error: ‘ERR_get_error_line_data’ is deprecated: Since OpenSSL 3.0 [-Werror=deprecated-declarations]
|
|
311 | while ((e = ERR_get_error_line_data(&file, &line, &data, &flags))) {
|
|
| ^~~~~
|
|
In file included from ossl.h:21,
|
|
from ossl.c:10:
|
|
/usr/include/openssl/err.h:413:15: note: declared here
|
|
413 | unsigned long ERR_get_error_line_data(const char **file, int *line,
|
|
| ^~~~~~~~~~~~~~~~~~~~~~~
|
|
In file included from unixsocket.c:11:
|
|
rubysocket.h:118:36: warning: argument 2 of type ‘char *’ declared as a pointer [-Warray-parameter=]
|
|
118 | char *if_indextoname(unsigned int, char *);
|
|
| ^~~~~~
|
|
In file included from rubysocket.h:97,
|
|
from unixsocket.c:11:
|
|
/usr/include/net/if.h:195:35: note: previously declared as an array ‘char[16]’
|
|
195 | char __ifname[IF_NAMESIZE]) __THROW
|
|
| ~~~~~^~~~~~~~~~~~~~~~~~~~~
|
|
ossl.c: At top level:
|
|
cc1: note: unrecognized command-line option ‘-Wno-self-assign’ may have been intended to silence earlier diagnostics
|
|
cc1: note: unrecognized command-line option ‘-Wno-parentheses-equality’ may have been intended to silence earlier diagnostics
|
|
cc1: note: unrecognized command-line option ‘-Wno-constant-logical-operand’ may have been intended to silence earlier diagnostics
|
|
cc1: some warnings being treated as errors
|
|
make[2]: *** [Makefile:313: ossl.o] Error 1
|
|
make[2]: Leaving directory '/tmp/ruby-build.20220607215706.16321.hja12y/ruby-2.6.10/ext/openssl'
|
|
make[1]: *** [exts.mk:244: ext/openssl/all] Error 2
|
|
make[1]: *** Waiting for unfinished jobs....
|
|
compiling unixserver.c
|
|
cc1: note: unrecognized command-line option ‘-Wno-self-assign’ may have been intended to silence earlier diagnostics
|
|
cc1: note: unrecognized command-line option ‘-Wno-parentheses-equality’ may have been intended to silence earlier diagnostics
|
|
cc1: note: unrecognized command-line option ‘-Wno-constant-logical-operand’ may have been intended to silence earlier diagnostics
|
|
compiling date_strftime.c
|
|
compiling option.c
|
|
In file included from unixserver.c:11:
|
|
rubysocket.h:118:36: warning: argument 2 of type ‘char *’ declared as a pointer [-Warray-parameter=]
|
|
118 | char *if_indextoname(unsigned int, char *);
|
|
| ^~~~~~
|
|
In file included from rubysocket.h:97,
|
|
from unixserver.c:11:
|
|
/usr/include/net/if.h:195:35: note: previously declared as an array ‘char[16]’
|
|
195 | char __ifname[IF_NAMESIZE]) __THROW
|
|
| ~~~~~^~~~~~~~~~~~~~~~~~~~~
|
|
cc1: note: unrecognized command-line option ‘-Wno-self-assign’ may have been intended to silence earlier diagnostics
|
|
cc1: note: unrecognized command-line option ‘-Wno-parentheses-equality’ may have been intended to silence earlier diagnostics
|
|
cc1: note: unrecognized command-line option ‘-Wno-constant-logical-operand’ may have been intended to silence earlier diagnostics
|
|
compiling date_strptime.c
|
|
compiling ancdata.c
|
|
In file included from option.c:1:
|
|
rubysocket.h:118:36: warning: argument 2 of type ‘char *’ declared as a pointer [-Warray-parameter=]
|
|
118 | char *if_indextoname(unsigned int, char *);
|
|
| ^~~~~~
|
|
In file included from rubysocket.h:97,
|
|
from option.c:1:
|
|
/usr/include/net/if.h:195:35: note: previously declared as an array ‘char[16]’
|
|
195 | char __ifname[IF_NAMESIZE]) __THROW
|
|
| ~~~~~^~~~~~~~~~~~~~~~~~~~~
|
|
In file included from ancdata.c:1:
|
|
rubysocket.h:118:36: warning: argument 2 of type ‘char *’ declared as a pointer [-Warray-parameter=]
|
|
118 | char *if_indextoname(unsigned int, char *);
|
|
| ^~~~~~
|
|
In file included from rubysocket.h:97,
|
|
from ancdata.c:1:
|
|
/usr/include/net/if.h:195:35: note: previously declared as an array ‘char[16]’
|
|
195 | char __ifname[IF_NAMESIZE]) __THROW
|
|
| ~~~~~^~~~~~~~~~~~~~~~~~~~~
|
|
compiling raddrinfo.c
|
|
cc1: note: unrecognized command-line option ‘-Wno-self-assign’ may have been intended to silence earlier diagnostics
|
|
cc1: note: unrecognized command-line option ‘-Wno-parentheses-equality’ may have been intended to silence earlier diagnostics
|
|
cc1: note: unrecognized command-line option ‘-Wno-constant-logical-operand’ may have been intended to silence earlier diagnostics
|
|
installing default date_core libraries
|
|
compiling ifaddr.c
|
|
cc1: note: unrecognized command-line option ‘-Wno-self-assign’ may have been intended to silence earlier diagnostics
|
|
cc1: note: unrecognized command-line option ‘-Wno-parentheses-equality’ may have been intended to silence earlier diagnostics
|
|
cc1: note: unrecognized command-line option ‘-Wno-constant-logical-operand’ may have been intended to silence earlier diagnostics
|
|
date_core.c: At top level:
|
|
cc1: note: unrecognized command-line option ‘-Wno-self-assign’ may have been intended to silence earlier diagnostics
|
|
cc1: note: unrecognized command-line option ‘-Wno-parentheses-equality’ may have been intended to silence earlier diagnostics
|
|
cc1: note: unrecognized command-line option ‘-Wno-constant-logical-operand’ may have been intended to silence earlier diagnostics
|
|
installing default socket libraries
|
|
In file included from raddrinfo.c:11:
|
|
rubysocket.h:118:36: warning: argument 2 of type ‘char *’ declared as a pointer [-Warray-parameter=]
|
|
118 | char *if_indextoname(unsigned int, char *);
|
|
| ^~~~~~
|
|
In file included from rubysocket.h:97,
|
|
from raddrinfo.c:11:
|
|
/usr/include/net/if.h:195:35: note: previously declared as an array ‘char[16]’
|
|
195 | char __ifname[IF_NAMESIZE]) __THROW
|
|
| ~~~~~^~~~~~~~~~~~~~~~~~~~~
|
|
linking shared-object date_core.so
|
|
In file included from ifaddr.c:1:
|
|
rubysocket.h:118:36: warning: argument 2 of type ‘char *’ declared as a pointer [-Warray-parameter=]
|
|
118 | char *if_indextoname(unsigned int, char *);
|
|
| ^~~~~~
|
|
In file included from rubysocket.h:97,
|
|
from ifaddr.c:1:
|
|
/usr/include/net/if.h:195:35: note: previously declared as an array ‘char[16]’
|
|
195 | char __ifname[IF_NAMESIZE]) __THROW
|
|
| ~~~~~^~~~~~~~~~~~~~~~~~~~~
|
|
cc1: note: unrecognized command-line option ‘-Wno-self-assign’ may have been intended to silence earlier diagnostics
|
|
cc1: note: unrecognized command-line option ‘-Wno-parentheses-equality’ may have been intended to silence earlier diagnostics
|
|
cc1: note: unrecognized command-line option ‘-Wno-constant-logical-operand’ may have been intended to silence earlier diagnostics
|
|
make[2]: Leaving directory '/tmp/ruby-build.20220607215706.16321.hja12y/ruby-2.6.10/ext/date'
|
|
cc1: note: unrecognized command-line option ‘-Wno-self-assign’ may have been intended to silence earlier diagnostics
|
|
cc1: note: unrecognized command-line option ‘-Wno-parentheses-equality’ may have been intended to silence earlier diagnostics
|
|
cc1: note: unrecognized command-line option ‘-Wno-constant-logical-operand’ may have been intended to silence earlier diagnostics
|
|
linking shared-object socket.so
|
|
make[2]: Leaving directory '/tmp/ruby-build.20220607215706.16321.hja12y/ruby-2.6.10/ext/socket'
|
|
make[1]: Leaving directory '/tmp/ruby-build.20220607215706.16321.hja12y/ruby-2.6.10'
|
|
make: *** [uncommon.mk:286: build-ext] Error 2
|