Project

General

Profile

Bug #11342 » bug-11342.log

nobu (Nobuyoshi Nakada), 07/09/2015 11:35 PM

 
1
        CC = /usr/bin/gcc -m32
2
        LD = /usr/ccs/bin/ld
3
        LDSHARED = /usr/bin/gcc -m32 -shared
4
        CFLAGS =  -m32
5
        XCFLAGS = -D_FORTIFY_SOURCE=2 -fstack-protector -fno-strict-overflow -fvisibility=hidden -DRUBY_EXPORT -fPIE
6
        CPPFLAGS =   -I. -I.ext/include/i386-solaris2.11 -I./include -I.
7
        DLDFLAGS = -fstack-protector -pie  -m32
8
        SOLIBS =
9
Using built-in specs.
10
COLLECT_GCC=/usr/bin/gcc
11
COLLECT_LTO_WRAPPER=/usr/gcc/4.5/lib/gcc/i386-pc-solaris2.11/4.5.2/lto-wrapper
12
Target: i386-pc-solaris2.11
13
Configured with: /builds/hudson/workspace/nightly-update/build/i386/components/gcc45/gcc-4.5.2/configure CC=/ws/on11update-tools/SUNWspro/sunstudio12.1/bin/cc CXX=/ws/on11update-tools/SUNWspro/sunstudio12.1/bin/CC --prefix=/usr/gcc/4.5 --mandir=/usr/gcc/4.5/share/man --bindir=/usr/gcc/4.5/bin --libdir=/usr/gcc/4.5/lib --sbindir=/usr/gcc/4.5/sbin --infodir=/usr/gcc/4.5/share/info --libexecdir=/usr/gcc/4.5/lib --enable-languages=c,c++,fortran,objc --enable-shared --with-gmp-include=/usr/include/gmp --with-mpfr-include=/usr/include/mpfr --without-gnu-ld --with-ld=/usr/bin/ld --with-gnu-as --with-as=/usr/gnu/bin/as CFLAGS='-g -O2 '
14
Thread model: posix
15
gcc version 4.5.2 (GCC)
16
compiling main.c
17
compiling dmydln.c
18
compiling miniinit.c
19
compiling miniprelude.c
20
translating probes probes.d
21
compiling array.c
22
compiling bignum.c
23
compiling class.c
24
compiling compar.c
25
compiling complex.c
26
compiling dir.c
27
compiling dln_find.c
28
compiling encoding.c
29
compiling enum.c
30
compiling enumerator.c
31
compiling error.c
32
compiling eval.c
33
compiling load.c
34
compiling proc.c
35
compiling file.c
36
compiling gc.c
37
compiling hash.c
38
compiling inits.c
39
compiling io.c
40
compiling marshal.c
41
compiling math.c
42
compiling node.c
43
compiling numeric.c
44
compiling object.c
45
compiling pack.c
46
compiling parse.c
47
compiling process.c
48
process.c: In function ‘retry_fork_async_signal_safe’:
49
process.c:3548:13: warning: ‘vfork’ is deprecated (declared at /usr/include/unistd.h:531)
50
compiling random.c
51
compiling range.c
52
compiling rational.c
53
compiling re.c
54
compiling regcomp.c
55
compiling regenc.c
56
compiling regerror.c
57
compiling regexec.c
58
compiling regparse.c
59
compiling regsyntax.c
60
compiling ruby.c
61
compiling safe.c
62
compiling signal.c
63
compiling sprintf.c
64
compiling st.c
65
compiling strftime.c
66
compiling string.c
67
compiling struct.c
68
compiling symbol.c
69
compiling time.c
70
compiling transcode.c
71
compiling util.c
72
compiling variable.c
73
compiling version.c
74
compiling compile.c
75
compiling debug.c
76
compiling iseq.c
77
compiling vm.c
78
compiling vm_dump.c
79
compiling vm_backtrace.c
80
compiling vm_trace.c
81
compiling thread.c
82
compiling cont.c
83
processing probes in object files
84
compiling ./enc/ascii.c
85
compiling ./enc/us_ascii.c
86
compiling ./enc/unicode.c
87
compiling ./enc/utf_8.c
88
compiling newline.c
89
compiling ./missing/flock.c
90
compiling ./missing/isinf.c
91
compiling ./missing/setproctitle.c
92
compiling addr2line.c
93
compiling dmyext.c
94
compiling dmyenc.c
95
linking miniruby
96
rbconfig.rb updated
97
generating enc.mk
98
compiling dln.c
99
compiling localeinit.c
100
creating verconf.h
101
verconf.h updated
102
compiling loadpath.c
103
compiling prelude.c
104
generating a glommed object with DTrace probes for static library
105
linking static-library libruby-static.a
106
verifying static-library libruby-static.a
107
generating encdb.h
108
encdb.h updated
109
making enc
110
make[1]: Entering directory `/export/home/dolly/ruby-2.2.2'
111
compiling ./enc/encdb.c
112
linking encoding encdb.so
113
compiling ./enc/big5.c
114
linking encoding big5.so
115
compiling ./enc/cp949.c
116
linking encoding cp949.so
117
compiling ./enc/emacs_mule.c
118
linking encoding emacs_mule.so
119
compiling ./enc/euc_jp.c
120
linking encoding euc_jp.so
121
compiling ./enc/euc_kr.c
122
linking encoding euc_kr.so
123
compiling ./enc/euc_tw.c
124
linking encoding euc_tw.so
125
compiling ./enc/gb2312.c
126
linking encoding gb2312.so
127
compiling ./enc/gb18030.c
128
linking encoding gb18030.so
129
compiling ./enc/gbk.c
130
linking encoding gbk.so
131
compiling ./enc/iso_8859_1.c
132
linking encoding iso_8859_1.so
133
compiling ./enc/iso_8859_2.c
134
linking encoding iso_8859_2.so
135
compiling ./enc/iso_8859_3.c
136
linking encoding iso_8859_3.so
137
compiling ./enc/iso_8859_4.c
138
linking encoding iso_8859_4.so
139
compiling ./enc/iso_8859_5.c
140
linking encoding iso_8859_5.so
141
compiling ./enc/iso_8859_6.c
142
linking encoding iso_8859_6.so
143
compiling ./enc/iso_8859_7.c
144
linking encoding iso_8859_7.so
145
compiling ./enc/iso_8859_8.c
146
linking encoding iso_8859_8.so
147
compiling ./enc/iso_8859_9.c
148
linking encoding iso_8859_9.so
149
compiling ./enc/iso_8859_10.c
150
linking encoding iso_8859_10.so
151
compiling ./enc/iso_8859_11.c
152
linking encoding iso_8859_11.so
153
compiling ./enc/iso_8859_13.c
154
linking encoding iso_8859_13.so
155
compiling ./enc/iso_8859_14.c
156
linking encoding iso_8859_14.so
157
compiling ./enc/iso_8859_15.c
158
linking encoding iso_8859_15.so
159
compiling ./enc/iso_8859_16.c
160
linking encoding iso_8859_16.so
161
compiling ./enc/koi8_r.c
162
linking encoding koi8_r.so
163
compiling ./enc/koi8_u.c
164
linking encoding koi8_u.so
165
compiling ./enc/shift_jis.c
166
linking encoding shift_jis.so
167
compiling ./enc/utf_16be.c
168
linking encoding utf_16be.so
169
compiling ./enc/utf_16le.c
170
linking encoding utf_16le.so
171
compiling ./enc/utf_32be.c
172
linking encoding utf_32be.so
173
compiling ./enc/utf_32le.c
174
linking encoding utf_32le.so
175
compiling ./enc/windows_31j.c
176
linking encoding windows_31j.so
177
compiling ./enc/windows_1251.c
178
linking encoding windows_1251.so
179
make[1]: Leaving directory `/export/home/dolly/ruby-2.2.2'
180
making srcs under enc
181
make[1]: Entering directory `/export/home/dolly/ruby-2.2.2'
182
make[1]: Nothing to be done for `srcs'.
183
make[1]: Leaving directory `/export/home/dolly/ruby-2.2.2'
184
generating transdb.h
185
transdb.h updated
186
making trans
187
make[1]: Entering directory `/export/home/dolly/ruby-2.2.2'
188
compiling ./enc/trans/transdb.c
189
linking transcoder transdb.so
190
compiling ./enc/trans/big5.c
191
linking transcoder big5.so
192
compiling ./enc/trans/chinese.c
193
linking transcoder chinese.so
194
compiling ./enc/trans/emoji.c
195
linking transcoder emoji.so
196
compiling ./enc/trans/emoji_iso2022_kddi.c
197
linking transcoder emoji_iso2022_kddi.so
198
compiling ./enc/trans/emoji_sjis_docomo.c
199
linking transcoder emoji_sjis_docomo.so
200
compiling ./enc/trans/emoji_sjis_kddi.c
201
linking transcoder emoji_sjis_kddi.so
202
compiling ./enc/trans/emoji_sjis_softbank.c
203
linking transcoder emoji_sjis_softbank.so
204
compiling ./enc/trans/escape.c
205
linking transcoder escape.so
206
compiling ./enc/trans/gb18030.c
207
linking transcoder gb18030.so
208
compiling ./enc/trans/gbk.c
209
linking transcoder gbk.so
210
compiling ./enc/trans/iso2022.c
211
linking transcoder iso2022.so
212
compiling ./enc/trans/japanese.c
213
linking transcoder japanese.so
214
compiling ./enc/trans/japanese_euc.c
215
linking transcoder japanese_euc.so
216
compiling ./enc/trans/japanese_sjis.c
217
linking transcoder japanese_sjis.so
218
compiling ./enc/trans/korean.c
219
linking transcoder korean.so
220
compiling ./enc/trans/single_byte.c
221
linking transcoder single_byte.so
222
compiling ./enc/trans/utf8_mac.c
223
linking transcoder utf8_mac.so
224
compiling ./enc/trans/utf_16_32.c
225
linking transcoder utf_16_32.so
226
make[1]: Leaving directory `/export/home/dolly/ruby-2.2.2'
227
making encs
228
make[1]: Entering directory `/export/home/dolly/ruby-2.2.2'
229
make[1]: Leaving directory `/export/home/dolly/ruby-2.2.2'
230
file2lastrev.rb: does not seem to be under a vcs: .
231
make: [.revision.time] Error 1 (ignored)
232
./revision.h unchanged
233
generating makefile exts.mk
234
configuring -test-/array/resize
235
configuring -test-/bignum
236
configuring -test-/bug-3571
237
configuring -test-/bug-3662
238
configuring -test-/bug-5832
239
configuring -test-/bug_reporter
240
configuring -test-/class
241
configuring -test-/debug
242
configuring -test-/exception
243
configuring -test-/fatal
244
configuring -test-/file
245
configuring -test-/float
246
configuring -test-/funcall
247
configuring -test-/hash
248
configuring -test-/iseq_load
249
configuring -test-/iter
250
configuring -test-/load/dot.dot
251
configuring -test-/marshal/compat
252
configuring -test-/marshal/usr
253
configuring -test-/method
254
configuring -test-/num2int
255
configuring -test-/path_to_class
256
configuring -test-/postponed_job
257
configuring -test-/printf
258
configuring -test-/proc
259
configuring -test-/rational
260
configuring -test-/recursion
261
configuring -test-/st/foreach
262
configuring -test-/st/numhash
263
configuring -test-/st/update
264
configuring -test-/string
265
configuring -test-/struct
266
configuring -test-/symbol
267
configuring -test-/tracepoint
268
configuring -test-/typeddata
269
configuring -test-/wait_for_single_fd
270
configuring -test-/win32/console
271
Failed to configure -test-/win32/console. It will not be installed.
272
configuring -test-/win32/dln
273
Failed to configure -test-/win32/dln. It will not be installed.
274
Failed to configure -test-/win32/dln/empty. It will not be installed.
275
configuring -test-/win32/fd_setsize
276
Failed to configure -test-/win32/fd_setsize. It will not be installed.
277
configuring bigdecimal
278
configuring continuation
279
configuring coverage
280
configuring date
281
configuring dbm
282
header: ndbm.h
283
library: libc
284
configuring digest
285
configuring digest/bubblebabble
286
configuring digest/md5
287
configuring digest/rmd160
288
configuring digest/sha1
289
configuring digest/sha2
290
configuring etc
291
configuring fcntl
292
configuring fiber
293
configuring fiddle
294
configuring gdbm
295
configuring io/console
296
configuring io/nonblock
297
configuring io/wait
298
configuring json
299
configuring json/generator
300
configuring json/parser
301
configuring mathn/complex
302
configuring mathn/rational
303
configuring nkf
304
configuring objspace
305
configuring openssl
306
configuring pathname
307
configuring psych
308
configuring pty
309
configuring racc/cparse
310
configuring rbconfig/sizeof
311
configuring readline
312
configuring ripper
313
missing bison; abort
314
Failed to configure ripper. It will not be installed.
315
configuring sdbm
316
configuring socket
317
configuring stringio
318
configuring strscan
319
configuring syslog
320
configuring thread
321
configuring tk
322
...........
323
check struct members..
324
check libraries....
325
Use ActiveTcl libraries (if available).
326
Search tclConfig.sh and tkConfig.sh.....................
327
Valid [tclConfig.sh, tkConfig.sh] are found in [["/usr/lib", "/usr/lib"]]
328
Use [tclConfig.sh, tkConfig.sh] == ["/usr/lib/tclConfig.sh", "/usr/lib/tkConfig.sh"]
329
Use X11 libraries (or use TK_XINCLUDES/TK_XLIBSW information on tkConfig.sh).
330
 
331
Find Tcl/Tk libraries. Make tcltklib.so which is required by Ruby/Tk.
332
configuring tk/tkutil
333
configuring win32
334
Failed to configure win32. It will not be installed.
335
configuring win32ole
336
Failed to configure win32ole. It will not be installed.
337
configuring zlib
338
make[1]: Entering directory `/export/home/dolly/ruby-2.2.2'
339
make[2]: Entering directory `/export/home/dolly/ruby-2.2.2/ext/-test-/array/resize'
340
compiling resize.c
341
linking shared-object -test-/array/resize.so
342
make[2]: Leaving directory `/export/home/dolly/ruby-2.2.2/ext/-test-/array/resize'
343
make[2]: Entering directory `/export/home/dolly/ruby-2.2.2/ext/-test-/bignum'
344
compiling div.c
345
compiling str2big.c
346
compiling intpack.c
347
compiling mul.c
348
compiling bigzero.c
349
compiling init.c
350
compiling big2str.c
351
linking shared-object -test-/bignum.so
352
make[2]: Leaving directory `/export/home/dolly/ruby-2.2.2/ext/-test-/bignum'
353
make[2]: Entering directory `/export/home/dolly/ruby-2.2.2/ext/-test-/bug-3571'
354
compiling bug.c
355
linking shared-object -test-/bug-3571/bug.so
356
make[2]: Leaving directory `/export/home/dolly/ruby-2.2.2/ext/-test-/bug-3571'
357
make[2]: Entering directory `/export/home/dolly/ruby-2.2.2/ext/-test-/bug-3662'
358
compiling bug.c
359
linking shared-object -test-/bug-3662/bug.so
360
make[2]: Leaving directory `/export/home/dolly/ruby-2.2.2/ext/-test-/bug-3662'
361
make[2]: Entering directory `/export/home/dolly/ruby-2.2.2/ext/-test-/bug-5832'
362
compiling bug.c
363
linking shared-object -test-/bug-5832/bug.so
364
make[2]: Leaving directory `/export/home/dolly/ruby-2.2.2/ext/-test-/bug-5832'
365
make[2]: Entering directory `/export/home/dolly/ruby-2.2.2/ext/-test-/bug_reporter'
366
compiling bug_reporter.c
367
linking shared-object -test-/bug_reporter/bug_reporter.so
368
make[2]: Leaving directory `/export/home/dolly/ruby-2.2.2/ext/-test-/bug_reporter'
369
make[2]: Entering directory `/export/home/dolly/ruby-2.2.2/ext/-test-/class'
370
compiling class2name.c
371
compiling init.c
372
linking shared-object -test-/class.so
373
make[2]: Leaving directory `/export/home/dolly/ruby-2.2.2/ext/-test-/class'
374
make[2]: Entering directory `/export/home/dolly/ruby-2.2.2/ext/-test-/debug'
375
compiling inspector.c
376
compiling profile_frames.c
377
compiling init.c
378
linking shared-object -test-/debug.so
379
make[2]: Leaving directory `/export/home/dolly/ruby-2.2.2/ext/-test-/debug'
380
make[2]: Entering directory `/export/home/dolly/ruby-2.2.2/ext/-test-/exception'
381
compiling ensured.c
382
compiling dataerror.c
383
compiling enc_raise.c
384
compiling init.c
385
linking shared-object -test-/exception.so
386
make[2]: Leaving directory `/export/home/dolly/ruby-2.2.2/ext/-test-/exception'
387
make[2]: Entering directory `/export/home/dolly/ruby-2.2.2/ext/-test-/fatal'
388
compiling rb_fatal.c
389
linking shared-object -test-/fatal/rb_fatal.so
390
make[2]: Leaving directory `/export/home/dolly/ruby-2.2.2/ext/-test-/fatal'
391
make[2]: Entering directory `/export/home/dolly/ruby-2.2.2/ext/-test-/file'
392
compiling fs.c
393
compiling init.c
394
compiling stat.c
395
linking shared-object -test-/file.so
396
make[2]: Leaving directory `/export/home/dolly/ruby-2.2.2/ext/-test-/file'
397
make[2]: Entering directory `/export/home/dolly/ruby-2.2.2/ext/-test-/float'
398
compiling init.c
399
compiling nextafter.c
400
linking shared-object -test-/float.so
401
make[2]: Leaving directory `/export/home/dolly/ruby-2.2.2/ext/-test-/float'
402
make[2]: Entering directory `/export/home/dolly/ruby-2.2.2/ext/-test-/funcall'
403
compiling passing_block.c
404
linking shared-object -test-/funcall/funcall.so
405
make[2]: Leaving directory `/export/home/dolly/ruby-2.2.2/ext/-test-/funcall'
406
make[2]: Entering directory `/export/home/dolly/ruby-2.2.2/ext/-test-/hash'
407
compiling delete.c
408
compiling init.c
409
linking shared-object -test-/hash.so
410
make[2]: Leaving directory `/export/home/dolly/ruby-2.2.2/ext/-test-/hash'
411
make[2]: Entering directory `/export/home/dolly/ruby-2.2.2/ext/-test-/iseq_load'
412
compiling iseq_load.c
413
linking shared-object -test-/iseq_load/iseq_load.so
414
make[2]: Leaving directory `/export/home/dolly/ruby-2.2.2/ext/-test-/iseq_load'
415
make[2]: Entering directory `/export/home/dolly/ruby-2.2.2/ext/-test-/iter'
416
compiling init.c
417
compiling yield.c
418
compiling break.c
419
linking shared-object -test-/iter.so
420
make[2]: Leaving directory `/export/home/dolly/ruby-2.2.2/ext/-test-/iter'
421
make[2]: Entering directory `/export/home/dolly/ruby-2.2.2/ext/-test-/load/dot.dot'
422
compiling dot.dot.c
423
linking shared-object -test-/load/dot.dot/dot.dot.so
424
make[2]: Leaving directory `/export/home/dolly/ruby-2.2.2/ext/-test-/load/dot.dot'
425
make[2]: Entering directory `/export/home/dolly/ruby-2.2.2/ext/-test-/marshal/compat'
426
compiling usrcompat.c
427
linking shared-object -test-/marshal/compat.so
428
make[2]: Leaving directory `/export/home/dolly/ruby-2.2.2/ext/-test-/marshal/compat'
429
make[2]: Entering directory `/export/home/dolly/ruby-2.2.2/ext/-test-/marshal/usr'
430
compiling usrmarshal.c
431
linking shared-object -test-/marshal/usr.so
432
make[2]: Leaving directory `/export/home/dolly/ruby-2.2.2/ext/-test-/marshal/usr'
433
make[2]: Entering directory `/export/home/dolly/ruby-2.2.2/ext/-test-/method'
434
compiling arity.c
435
compiling init.c
436
linking shared-object -test-/method.so
437
make[2]: Leaving directory `/export/home/dolly/ruby-2.2.2/ext/-test-/method'
438
make[2]: Entering directory `/export/home/dolly/ruby-2.2.2/ext/-test-/num2int'
439
compiling num2int.c
440
linking shared-object -test-/num2int/num2int.so
441
make[2]: Leaving directory `/export/home/dolly/ruby-2.2.2/ext/-test-/num2int'
442
make[2]: Entering directory `/export/home/dolly/ruby-2.2.2/ext/-test-/path_to_class'
443
compiling path_to_class.c
444
linking shared-object -test-/path_to_class/path_to_class.so
445
make[2]: Leaving directory `/export/home/dolly/ruby-2.2.2/ext/-test-/path_to_class'
446
make[2]: Entering directory `/export/home/dolly/ruby-2.2.2/ext/-test-/postponed_job'
447
compiling postponed_job.c
448
linking shared-object -test-/postponed_job.so
449
make[2]: Leaving directory `/export/home/dolly/ruby-2.2.2/ext/-test-/postponed_job'
450
make[2]: Entering directory `/export/home/dolly/ruby-2.2.2/ext/-test-/printf'
451
compiling printf.c
452
linking shared-object -test-/printf.so
453
make[2]: Leaving directory `/export/home/dolly/ruby-2.2.2/ext/-test-/printf'
454
make[2]: Entering directory `/export/home/dolly/ruby-2.2.2/ext/-test-/proc'
455
compiling super.c
456
compiling receiver.c
457
compiling init.c
458
linking shared-object -test-/proc.so
459
make[2]: Leaving directory `/export/home/dolly/ruby-2.2.2/ext/-test-/proc'
460
make[2]: Entering directory `/export/home/dolly/ruby-2.2.2/ext/-test-/rational'
461
compiling rat.c
462
linking shared-object -test-/rational.so
463
make[2]: Leaving directory `/export/home/dolly/ruby-2.2.2/ext/-test-/rational'
464
make[2]: Entering directory `/export/home/dolly/ruby-2.2.2/ext/-test-/recursion'
465
compiling recursion.c
466
linking shared-object -test-/recursion.so
467
make[2]: Leaving directory `/export/home/dolly/ruby-2.2.2/ext/-test-/recursion'
468
make[2]: Entering directory `/export/home/dolly/ruby-2.2.2/ext/-test-/st/foreach'
469
compiling foreach.c
470
linking shared-object -test-/st/foreach.so
471
make[2]: Leaving directory `/export/home/dolly/ruby-2.2.2/ext/-test-/st/foreach'
472
make[2]: Entering directory `/export/home/dolly/ruby-2.2.2/ext/-test-/st/numhash'
473
compiling numhash.c
474
linking shared-object -test-/st/numhash.so
475
make[2]: Leaving directory `/export/home/dolly/ruby-2.2.2/ext/-test-/st/numhash'
476
make[2]: Entering directory `/export/home/dolly/ruby-2.2.2/ext/-test-/st/update'
477
compiling update.c
478
linking shared-object -test-/st/update.so
479
make[2]: Leaving directory `/export/home/dolly/ruby-2.2.2/ext/-test-/st/update'
480
make[2]: Entering directory `/export/home/dolly/ruby-2.2.2/ext/-test-/string'
481
compiling init.c
482
compiling set_len.c
483
compiling modify.c
484
compiling enc_str_buf_cat.c
485
compiling ellipsize.c
486
compiling coderange.c
487
compiling enc_associate.c
488
compiling qsort.c
489
compiling normalize.c
490
compiling cstr.c
491
linking shared-object -test-/string/string.so
492
make[2]: Leaving directory `/export/home/dolly/ruby-2.2.2/ext/-test-/string'
493
make[2]: Entering directory `/export/home/dolly/ruby-2.2.2/ext/-test-/struct'
494
compiling member.c
495
compiling init.c
496
linking shared-object -test-/struct.so
497
make[2]: Leaving directory `/export/home/dolly/ruby-2.2.2/ext/-test-/struct'
498
make[2]: Entering directory `/export/home/dolly/ruby-2.2.2/ext/-test-/symbol'
499
compiling type.c
500
compiling init.c
501
linking shared-object -test-/symbol.so
502
make[2]: Leaving directory `/export/home/dolly/ruby-2.2.2/ext/-test-/symbol'
503
make[2]: Entering directory `/export/home/dolly/ruby-2.2.2/ext/-test-/tracepoint'
504
compiling gc_hook.c
505
compiling tracepoint.c
506
linking shared-object -test-/tracepoint.so
507
make[2]: Leaving directory `/export/home/dolly/ruby-2.2.2/ext/-test-/tracepoint'
508
make[2]: Entering directory `/export/home/dolly/ruby-2.2.2/ext/-test-/typeddata'
509
compiling typeddata.c
510
linking shared-object -test-/typeddata/typeddata.so
511
make[2]: Leaving directory `/export/home/dolly/ruby-2.2.2/ext/-test-/typeddata'
512
make[2]: Entering directory `/export/home/dolly/ruby-2.2.2/ext/-test-/wait_for_single_fd'
513
compiling wait_for_single_fd.c
514
linking shared-object -test-/wait_for_single_fd/wait_for_single_fd.so
515
make[2]: Leaving directory `/export/home/dolly/ruby-2.2.2/ext/-test-/wait_for_single_fd'
516
make[2]: Entering directory `/export/home/dolly/ruby-2.2.2/ext/-test-/win32/console'
517
make[2]: Nothing to be done for `all'.
518
make[2]: Leaving directory `/export/home/dolly/ruby-2.2.2/ext/-test-/win32/console'
519
make[2]: Entering directory `/export/home/dolly/ruby-2.2.2/ext/-test-/win32/dln'
520
make[2]: Nothing to be done for `all'.
521
make[2]: Leaving directory `/export/home/dolly/ruby-2.2.2/ext/-test-/win32/dln'
522
make[2]: Entering directory `/export/home/dolly/ruby-2.2.2/ext/-test-/win32/dln/empty'
523
make[2]: Nothing to be done for `all'.
524
make[2]: Leaving directory `/export/home/dolly/ruby-2.2.2/ext/-test-/win32/dln/empty'
525
make[2]: Entering directory `/export/home/dolly/ruby-2.2.2/ext/-test-/win32/fd_setsize'
526
make[2]: Nothing to be done for `all'.
527
make[2]: Leaving directory `/export/home/dolly/ruby-2.2.2/ext/-test-/win32/fd_setsize'
528
make[2]: Entering directory `/export/home/dolly/ruby-2.2.2/ext/bigdecimal'
529
compiling bigdecimal.c
530
linking shared-object bigdecimal.so
531
installing default bigdecimal libraries
532
make[2]: Leaving directory `/export/home/dolly/ruby-2.2.2/ext/bigdecimal'
533
make[2]: Entering directory `/export/home/dolly/ruby-2.2.2/ext/continuation'
534
compiling continuation.c
535
linking shared-object continuation.so
536
make[2]: Leaving directory `/export/home/dolly/ruby-2.2.2/ext/continuation'
537
make[2]: Entering directory `/export/home/dolly/ruby-2.2.2/ext/coverage'
538
compiling coverage.c
539
linking shared-object coverage.so
540
make[2]: Leaving directory `/export/home/dolly/ruby-2.2.2/ext/coverage'
541
make[2]: Entering directory `/export/home/dolly/ruby-2.2.2/ext/date'
542
compiling date_strptime.c
543
compiling date_core.c
544
compiling date_strftime.c
545
compiling date_parse.c
546
linking shared-object date_core.so
547
installing default date_core libraries
548
make[2]: Leaving directory `/export/home/dolly/ruby-2.2.2/ext/date'
549
make[2]: Entering directory `/export/home/dolly/ruby-2.2.2/ext/dbm'
550
compiling dbm.c
551
linking shared-object dbm.so
552
make[2]: Leaving directory `/export/home/dolly/ruby-2.2.2/ext/dbm'
553
make[2]: Entering directory `/export/home/dolly/ruby-2.2.2/ext/digest'
554
compiling digest.c
555
linking shared-object digest.so
556
installing digest libraries
557
installing default digest libraries
558
make[2]: Leaving directory `/export/home/dolly/ruby-2.2.2/ext/digest'
559
make[2]: Entering directory `/export/home/dolly/ruby-2.2.2/ext/digest/bubblebabble'
560
compiling bubblebabble.c
561
linking shared-object digest/bubblebabble.so
562
make[2]: Leaving directory `/export/home/dolly/ruby-2.2.2/ext/digest/bubblebabble'
563
make[2]: Entering directory `/export/home/dolly/ruby-2.2.2/ext/digest/md5'
564
compiling md5init.c
565
compiling md5ossl.c
566
linking shared-object digest/md5.so
567
make[2]: Leaving directory `/export/home/dolly/ruby-2.2.2/ext/digest/md5'
568
make[2]: Entering directory `/export/home/dolly/ruby-2.2.2/ext/digest/rmd160'
569
compiling rmd160init.c
570
compiling rmd160ossl.c
571
linking shared-object digest/rmd160.so
572
make[2]: Leaving directory `/export/home/dolly/ruby-2.2.2/ext/digest/rmd160'
573
make[2]: Entering directory `/export/home/dolly/ruby-2.2.2/ext/digest/sha1'
574
compiling sha1init.c
575
compiling sha1ossl.c
576
linking shared-object digest/sha1.so
577
make[2]: Leaving directory `/export/home/dolly/ruby-2.2.2/ext/digest/sha1'
578
make[2]: Entering directory `/export/home/dolly/ruby-2.2.2/ext/digest/sha2'
579
compiling sha2init.c
580
compiling sha2ossl.c
581
linking shared-object digest/sha2.so
582
installing default sha2 libraries
583
make[2]: Leaving directory `/export/home/dolly/ruby-2.2.2/ext/digest/sha2'
584
make[2]: Entering directory `/export/home/dolly/ruby-2.2.2/ext/etc'
585
compiling etc.c
586
linking shared-object etc.so
587
make[2]: Leaving directory `/export/home/dolly/ruby-2.2.2/ext/etc'
588
make[2]: Entering directory `/export/home/dolly/ruby-2.2.2/ext/fcntl'
589
compiling fcntl.c
590
linking shared-object fcntl.so
591
make[2]: Leaving directory `/export/home/dolly/ruby-2.2.2/ext/fcntl'
592
make[2]: Entering directory `/export/home/dolly/ruby-2.2.2/ext/fiber'
593
compiling fiber.c
594
linking shared-object fiber.so
595
make[2]: Leaving directory `/export/home/dolly/ruby-2.2.2/ext/fiber'
596
make[2]: Entering directory `/export/home/dolly/ruby-2.2.2/ext/fiddle'
597
compiling handle.c
598
compiling conversions.c
599
compiling closure.c
600
compiling fiddle.c
601
compiling function.c
602
compiling pointer.c
603
linking shared-object fiddle.so
604
installing default fiddle libraries
605
make[2]: Leaving directory `/export/home/dolly/ruby-2.2.2/ext/fiddle'
606
make[2]: Entering directory `/export/home/dolly/ruby-2.2.2/ext/gdbm'
607
compiling gdbm.c
608
linking shared-object gdbm.so
609
make[2]: Leaving directory `/export/home/dolly/ruby-2.2.2/ext/gdbm'
610
make[2]: Entering directory `/export/home/dolly/ruby-2.2.2/ext/io/console'
611
compiling console.c
612
linking shared-object io/console.so
613
installing default console libraries
614
make[2]: Leaving directory `/export/home/dolly/ruby-2.2.2/ext/io/console'
615
make[2]: Entering directory `/export/home/dolly/ruby-2.2.2/ext/io/nonblock'
616
compiling nonblock.c
617
linking shared-object io/nonblock.so
618
make[2]: Leaving directory `/export/home/dolly/ruby-2.2.2/ext/io/nonblock'
619
make[2]: Entering directory `/export/home/dolly/ruby-2.2.2/ext/io/wait'
620
compiling wait.c
621
linking shared-object io/wait.so
622
make[2]: Leaving directory `/export/home/dolly/ruby-2.2.2/ext/io/wait'
623
make[2]: Entering directory `/export/home/dolly/ruby-2.2.2/ext/json'
624
installing default libraries
625
make[2]: Leaving directory `/export/home/dolly/ruby-2.2.2/ext/json'
626
make[2]: Entering directory `/export/home/dolly/ruby-2.2.2/ext/json/generator'
627
compiling generator.c
628
linking shared-object json/ext/generator.so
629
make[2]: Leaving directory `/export/home/dolly/ruby-2.2.2/ext/json/generator'
630
make[2]: Entering directory `/export/home/dolly/ruby-2.2.2/ext/json/parser'
631
compiling parser.c
632
linking shared-object json/ext/parser.so
633
make[2]: Leaving directory `/export/home/dolly/ruby-2.2.2/ext/json/parser'
634
make[2]: Entering directory `/export/home/dolly/ruby-2.2.2/ext/mathn/complex'
635
compiling complex.c
636
linking shared-object mathn/complex.so
637
make[2]: Leaving directory `/export/home/dolly/ruby-2.2.2/ext/mathn/complex'
638
make[2]: Entering directory `/export/home/dolly/ruby-2.2.2/ext/mathn/rational'
639
compiling rational.c
640
linking shared-object mathn/rational.so
641
make[2]: Leaving directory `/export/home/dolly/ruby-2.2.2/ext/mathn/rational'
642
make[2]: Entering directory `/export/home/dolly/ruby-2.2.2/ext/nkf'
643
compiling nkf.c
644
linking shared-object nkf.so
645
installing default nkf libraries
646
make[2]: Leaving directory `/export/home/dolly/ruby-2.2.2/ext/nkf'
647
make[2]: Entering directory `/export/home/dolly/ruby-2.2.2/ext/objspace'
648
compiling object_tracing.c
649
compiling objspace_dump.c
650
compiling objspace.c
651
linking shared-object objspace.so
652
make[2]: Leaving directory `/export/home/dolly/ruby-2.2.2/ext/objspace'
653
make[2]: Entering directory `/export/home/dolly/ruby-2.2.2/ext/openssl'
654
compiling openssl_missing.c
655
compiling ossl_x509crl.c
656
compiling ossl_pkey_rsa.c
657
compiling ossl_x509store.c
658
compiling ossl_config.c
659
compiling ossl_x509name.c
660
compiling ossl_x509ext.c
661
compiling ossl_pkey.c
662
compiling ossl_pkey_dh.c
663
compiling ossl_x509.c
664
compiling ossl_engine.c
665
compiling ossl_bio.c
666
compiling ossl_asn1.c
667
compiling ossl_x509attr.c
668
compiling ossl_ssl.c
669
compiling ossl_pkcs12.c
670
compiling ossl_pkey_ec.c
671
compiling ossl.c
672
compiling ossl_ocsp.c
673
compiling ossl_pkcs7.c
674
compiling ossl_x509cert.c
675
compiling ossl_x509req.c
676
compiling ossl_bn.c
677
compiling ossl_ssl_session.c
678
compiling ossl_cipher.c
679
compiling ossl_hmac.c
680
compiling ossl_rand.c
681
compiling ossl_ns_spki.c
682
compiling ossl_pkey_dsa.c
683
compiling ossl_x509revoked.c
684
compiling ossl_pkcs5.c
685
compiling ossl_digest.c
686
linking shared-object openssl.so
687
installing default openssl libraries
688
make[2]: Leaving directory `/export/home/dolly/ruby-2.2.2/ext/openssl'
689
make[2]: Entering directory `/export/home/dolly/ruby-2.2.2/ext/pathname'
690
compiling pathname.c
691
linking shared-object pathname.so
692
installing default pathname libraries
693
make[2]: Leaving directory `/export/home/dolly/ruby-2.2.2/ext/pathname'
694
make[2]: Entering directory `/export/home/dolly/ruby-2.2.2/ext/psych'
695
compiling psych_yaml_tree.c
696
compiling psych_emitter.c
697
compiling psych_to_ruby.c
698
compiling psych.c
699
compiling psych_parser.c
700
compiling ../.././ext/psych/yaml/loader.c
701
compiling ../.././ext/psych/yaml/emitter.c
702
compiling ../.././ext/psych/yaml/scanner.c
703
compiling ../.././ext/psych/yaml/parser.c
704
compiling ../.././ext/psych/yaml/reader.c
705
compiling ../.././ext/psych/yaml/dumper.c
706
compiling ../.././ext/psych/yaml/api.c
707
compiling ../.././ext/psych/yaml/writer.c
708
linking shared-object psych.so
709
installing default psych libraries
710
make[2]: Leaving directory `/export/home/dolly/ruby-2.2.2/ext/psych'
711
make[2]: Entering directory `/export/home/dolly/ruby-2.2.2/ext/pty'
712
compiling pty.c
713
linking shared-object pty.so
714
installing default pty libraries
715
make[2]: Leaving directory `/export/home/dolly/ruby-2.2.2/ext/pty'
716
make[2]: Entering directory `/export/home/dolly/ruby-2.2.2/ext/racc/cparse'
717
compiling cparse.c
718
linking shared-object racc/cparse.so
719
make[2]: Leaving directory `/export/home/dolly/ruby-2.2.2/ext/racc/cparse'
720
make[2]: Entering directory `/export/home/dolly/ruby-2.2.2/ext/rbconfig/sizeof'
721
compiling sizes.c
722
linking shared-object rbconfig/sizeof.so
723
make[2]: Leaving directory `/export/home/dolly/ruby-2.2.2/ext/rbconfig/sizeof'
724
make[2]: Entering directory `/export/home/dolly/ruby-2.2.2/ext/readline'
725
compiling readline.c
726
linking shared-object readline.so
727
make[2]: Leaving directory `/export/home/dolly/ruby-2.2.2/ext/readline'
728
make[2]: Entering directory `/export/home/dolly/ruby-2.2.2/ext/ripper'
729
make[2]: Nothing to be done for `all'.
730
make[2]: Leaving directory `/export/home/dolly/ruby-2.2.2/ext/ripper'
731
make[2]: Entering directory `/export/home/dolly/ruby-2.2.2/ext/sdbm'
732
compiling _sdbm.c
733
compiling init.c
734
linking shared-object sdbm.so
735
make[2]: Leaving directory `/export/home/dolly/ruby-2.2.2/ext/sdbm'
736
make[2]: Entering directory `/export/home/dolly/ruby-2.2.2/ext/socket'
737
compiling init.c
738
compiling constants.c
739
compiling basicsocket.c
740
compiling socket.c
741
compiling ipsocket.c
742
compiling tcpsocket.c
743
compiling tcpserver.c
744
compiling sockssocket.c
745
compiling udpsocket.c
746
compiling unixsocket.c
747
compiling unixserver.c
748
compiling option.c
749
option.c:886:33: error: expected declaration specifiers or ‘...’ before ‘u_int8_t’
750
option.c: In function ‘inspect_tcpi_options’:
751
option.c:898:5: error: ‘options’ undeclared (first use in this function)
752
option.c:898:5: note: each undeclared identifier is reported only once for each function it appears in
753
option.c:898:5: error: ‘u_int8_t’ undeclared (first use in this function)
754
option.c: At top level:
755
option.c:926:50: error: expected declaration specifiers or ‘...’ before ‘u_int32_t’
756
option.c: In function ‘inspect_tcpi_usec’:
757
option.c:928:44: error: ‘t’ undeclared (first use in this function)
758
option.c: In function ‘inspect_tcp_info’:
759
option.c:1003:16: error: ‘TCP_CA_Open’ undeclared (first use in this function)
760
option.c:1004:16: error: ‘TCP_CA_Disorder’ undeclared (first use in this function)
761
option.c:1005:16: error: ‘TCP_CA_CWR’ undeclared (first use in this function)
762
option.c:1006:16: error: ‘TCP_CA_Recovery’ undeclared (first use in this function)
763
option.c:1007:16: error: ‘TCP_CA_Loss’ undeclared (first use in this function)
764
option.c:1021:9: error: too many arguments to function ‘inspect_tcpi_options’
765
option.c:886:1: note: declared here
766
option.c:1030:9: error: too many arguments to function ‘inspect_tcpi_usec’
767
option.c:926:1: note: declared here
768
option.c:1033:9: error: too many arguments to function ‘inspect_tcpi_usec’
769
option.c:926:1: note: declared here
770
option.c:1075:2: error: too many arguments to function ‘inspect_tcpi_usec’
771
option.c:926:1: note: declared here
772
option.c:1078:2: error: too many arguments to function ‘inspect_tcpi_usec’
773
option.c:926:1: note: declared here
774
option.c:1093:9: error: too many arguments to function ‘inspect_tcpi_usec’
775
option.c:926:1: note: declared here
776
make[2]: *** [option.o] Error 1
777
make[2]: Leaving directory `/export/home/dolly/ruby-2.2.2/ext/socket'
778
make[1]: *** [ext/socket/all] Error 2
779
make[1]: Leaving directory `/export/home/dolly/ruby-2.2.2'
780
make: *** [build-ext] Error 2