Project

General

Profile

Bug #14867 » 14867_91_mingw_build_log_.txt

MSP-Greg (Greg L), 10/29/2018 04:51 PM

 
1
[00:00:00] Build started
2
[00:00:05] Remove-Item env:SSL_CERT_DIR  -ErrorAction SilentlyContinue
3
[00:00:05] Remove-Item env:SSL_CERT_FILE -ErrorAction SilentlyContinue
4
[00:00:05] Remove-Item env:OPENSSL_CONF  -ErrorAction SilentlyContinue
5
[00:00:05] Remove-Item env:OPENSSL_DIR   -ErrorAction SilentlyContinue
6
[00:00:05] ren C:\Windows\System32\libssl-1_1-x64.dll    libssl-1_1-x64.dll_
7
[00:00:05] ren C:\Windows\System32\libcrypto-1_1-x64.dll libcrypto-1_1-x64.dll_
8
[00:00:05] 
9
[00:00:05] git clone -q --depth=5 --branch=master https://github.com/MSP-Greg/ruby-loco.git C:\projects\ruby-loco
10
[00:00:10] git checkout -qf b608bfaf5d0c5be4a0adf8243a95604d2ef1d7b1
11
[00:00:10] Running Install scripts
12
[00:00:10] git clone -q --depth=5 --no-tags --branch=master https://github.com/oneclick/rubyinstaller2.git    ./rubyinstaller2
13
[00:00:10] git clone -q --depth=5 --no-tags --branch=master https://github.com/ConnorAtherton/rb-readline.git ./ruby_readline
14
[00:00:10] git clone -q --depth=5 --no-tags --branch=trunk  https://github.com/ruby/ruby.git                  ./ruby
15
[00:00:10] $env:path = "C:\Ruby25-x64\bin;$env:path"
16
[00:00:10] .\trunk_msys2.ps1
17
[00:00:10] 
18
[00:00:33] ――――――――――――――――――――――――――――――――――――――――――――――――――――――――――――――― Updating MSYS2 / MinGW toolchain
19
[00:00:40] :: Synchronizing package databases...
20
[00:00:41] downloading mingw32.db...
21
[00:00:41] downloading mingw32.db.sig...
22
[00:00:41] downloading mingw64.db...
23
[00:00:41] downloading mingw64.db.sig...
24
[00:00:41] downloading msys.db...
25
[00:00:41] downloading msys.db.sig...
26
[00:00:42] :: There are 17 members in group mingw-w64-x86_64-toolchain:
27
[00:00:42] :: Repository mingw64
28
[00:00:42]    1) mingw-w64-x86_64-binutils  2) mingw-w64-x86_64-crt-git  3) mingw-w64-x86_64-gcc  4) mingw-w64-x86_64-gcc-ada  5) mingw-w64-x86_64-gcc-fortran  6) mingw-w64-x86_64-gcc-libgfortran  7) mingw-w64-x86_64-gcc-libs  8) mingw-w64-x86_64-gcc-objc  9) mingw-w64-x86_64-gdb  10) mingw-w64-x86_64-headers-git  11) mingw-w64-x86_64-libmangle-git  12) mingw-w64-x86_64-libwinpthread-git  13) mingw-w64-x86_64-make  14) mingw-w64-x86_64-pkg-config  15) mingw-w64-x86_64-tools-git  16) mingw-w64-x86_64-winpthreads-git  17) mingw-w64-x86_64-winstorecompat-git
29
[00:00:42] 
30
[00:00:42] Enter a selection (default=all): 
31
[00:00:42] resolving dependencies...
32
[00:00:42] looking for conflicting packages...
33
[00:00:42] 
34
[00:00:42] Packages (15) mingw-w64-x86_64-binutils-2.30-5  mingw-w64-x86_64-crt-git-7.0.0.5255.83bdce54-1  mingw-w64-x86_64-gcc-8.2.0-3  mingw-w64-x86_64-gcc-ada-8.2.0-3  mingw-w64-x86_64-gcc-fortran-8.2.0-3  mingw-w64-x86_64-gcc-libgfortran-8.2.0-3  mingw-w64-x86_64-gcc-libs-8.2.0-3  mingw-w64-x86_64-gcc-objc-8.2.0-3  mingw-w64-x86_64-gdb-8.2-1  mingw-w64-x86_64-headers-git-7.0.0.5255.83bdce54-1  mingw-w64-x86_64-libmangle-git-7.0.0.5230.69c8fad6-1  mingw-w64-x86_64-libwinpthread-git-7.0.0.5253.37101e0b-1  mingw-w64-x86_64-tools-git-7.0.0.5242.1b29d1bc-1  mingw-w64-x86_64-winpthreads-git-7.0.0.5253.37101e0b-1  mingw-w64-x86_64-winstorecompat-git-7.0.0.5230.69c8fad6-1
35
[00:00:42] 
36
[00:00:42] Total Download Size:    97.29 MiB
37
[00:00:42] Total Installed Size:  561.79 MiB
38
[00:00:42] Net Upgrade Size:        2.65 MiB
39
[00:00:42] 
40
[00:00:42] :: Proceed with installation? [Y/n] 
41
[00:00:42] :: Retrieving packages...
42
[00:00:42] downloading mingw-w64-x86_64-libwinpthread-git-7.0.0.5253.37101e0b-1-any.pkg.tar.xz...
43
[00:00:42] downloading mingw-w64-x86_64-gcc-libs-8.2.0-3-any.pkg.tar.xz...
44
[00:00:42] downloading mingw-w64-x86_64-binutils-2.30-5-any.pkg.tar.xz...
45
[00:00:43] downloading mingw-w64-x86_64-headers-git-7.0.0.5255.83bdce54-1-any.pkg.tar.xz...
46
[00:00:44] downloading mingw-w64-x86_64-crt-git-7.0.0.5255.83bdce54-1-any.pkg.tar.xz...
47
[00:00:44] downloading mingw-w64-x86_64-winpthreads-git-7.0.0.5253.37101e0b-1-any.pkg.tar.xz...
48
[00:00:44] downloading mingw-w64-x86_64-gcc-8.2.0-3-any.pkg.tar.xz...
49
[00:00:47] downloading mingw-w64-x86_64-gcc-ada-8.2.0-3-any.pkg.tar.xz...
50
[00:00:49] downloading mingw-w64-x86_64-gcc-libgfortran-8.2.0-3-any.pkg.tar.xz...
51
[00:00:49] downloading mingw-w64-x86_64-gcc-fortran-8.2.0-3-any.pkg.tar.xz...
52
[00:00:49] downloading mingw-w64-x86_64-gcc-objc-8.2.0-3-any.pkg.tar.xz...
53
[00:00:50] downloading mingw-w64-x86_64-gdb-8.2-1-any.pkg.tar.xz...
54
[00:00:50] downloading mingw-w64-x86_64-libmangle-git-7.0.0.5230.69c8fad6-1-any.pkg.tar.xz...
55
[00:00:50] downloading mingw-w64-x86_64-tools-git-7.0.0.5242.1b29d1bc-1-any.pkg.tar.xz...
56
[00:00:50] downloading mingw-w64-x86_64-winstorecompat-git-7.0.0.5230.69c8fad6-1-any.pkg.tar.xz...
57
[00:00:50] checking keyring...
58
[00:00:51] checking package integrity...
59
[00:00:55] loading package files...
60
[00:00:55] checking for file conflicts...
61
[00:00:56] checking available disk space...
62
[00:01:29] :: Processing package changes...
63
[00:01:29] upgrading mingw-w64-x86_64-libwinpthread-git...
64
[00:01:29] upgrading mingw-w64-x86_64-gcc-libs...
65
[00:01:29] downgrading mingw-w64-x86_64-binutils...
66
[00:01:33] upgrading mingw-w64-x86_64-headers-git...
67
[00:01:37] upgrading mingw-w64-x86_64-crt-git...
68
[00:01:41] upgrading mingw-w64-x86_64-winpthreads-git...
69
[00:01:41] upgrading mingw-w64-x86_64-gcc...
70
[00:02:01] upgrading mingw-w64-x86_64-gcc-ada...
71
[00:02:23] upgrading mingw-w64-x86_64-gcc-libgfortran...
72
[00:02:23] upgrading mingw-w64-x86_64-gcc-fortran...
73
[00:02:25] upgrading mingw-w64-x86_64-gcc-objc...
74
[00:02:29] upgrading mingw-w64-x86_64-gdb...
75
[00:02:31] upgrading mingw-w64-x86_64-libmangle-git...
76
[00:02:31] upgrading mingw-w64-x86_64-tools-git...
77
[00:02:31] upgrading mingw-w64-x86_64-winstorecompat-git...
78
[00:02:31] ――――――――――――――――――――――――――――――――――――――――――――――――――――――――――――――― Updating MSYS2 / MinGW ruby depends
79
[00:02:33] resolving dependencies...
80
[00:02:34] looking for conflicting packages...
81
[00:02:35] 
82
[00:02:35] Packages (3) mingw-w64-x86_64-gdbm-1.18-1  mingw-w64-x86_64-ncurses-6.1.20180908-1  mingw-w64-x86_64-zlib-1.2.11-4
83
[00:02:35] 
84
[00:02:35] Total Download Size:    2.02 MiB
85
[00:02:35] Total Installed Size:  16.88 MiB
86
[00:02:35] Net Upgrade Size:       0.34 MiB
87
[00:02:35] 
88
[00:02:35] :: Proceed with installation? [Y/n] 
89
[00:02:35] :: Retrieving packages...
90
[00:02:35] downloading mingw-w64-x86_64-gdbm-1.18-1-any.pkg.tar.xz...
91
[00:02:35] downloading mingw-w64-x86_64-ncurses-6.1.20180908-1-any.pkg.tar.xz...
92
[00:02:35] downloading mingw-w64-x86_64-zlib-1.2.11-4-any.pkg.tar.xz...
93
[00:02:35] checking keyring...
94
[00:02:35] checking package integrity...
95
[00:02:36] loading package files...
96
[00:02:36] checking for file conflicts...
97
[00:02:36] checking available disk space...
98
[00:02:42] :: Processing package changes...
99
[00:02:42] installing mingw-w64-x86_64-gdbm...
100
[00:02:42] upgrading mingw-w64-x86_64-ncurses...
101
[00:02:52] upgrading mingw-w64-x86_64-zlib...
102
[00:02:53] ――――――――――――――――――――――――――――――――――――――――――――――――――――――――――――――― Install custom openssl
103
[00:02:53] Installing mingw-w64-x86_64-openssl-1.1.1-1-any.pkg.tar.xz
104
[00:02:58] Three SHA512 values match for file, Appveyor message, and local script
105
[00:02:58] pacman.exe -Rdd --noconfirm mingw-w64-x86_64-openssl
106
[00:02:58] 
107
[00:02:58] Packages (1) mingw-w64-x86_64-openssl-1.0.2.p-1
108
[00:02:58] 
109
[00:02:58] Total Removed Size:  18.09 MiB
110
[00:02:58] 
111
[00:02:58] :: Do you want to remove these packages? [Y/n] 
112
[00:02:58] :: Processing package changes...
113
[00:02:58] removing mingw-w64-x86_64-openssl...
114
[00:03:01] pacman.exe -Udd --noconfirm C:/pkgs/mingw-w64-x86_64-openssl-1.1.1-1-any.pkg.tar.xz
115
[00:03:02] loading packages...
116
[00:03:02] looking for conflicting packages...
117
[00:03:02] 
118
[00:03:02] Packages (1) mingw-w64-x86_64-openssl-1.1.1-1
119
[00:03:02] 
120
[00:03:02] Total Installed Size:  13.14 MiB
121
[00:03:02] 
122
[00:03:02] :: Proceed with installation? [Y/n] 
123
[00:03:02] checking keyring...
124
[00:03:02] checking package integrity...
125
[00:03:02] loading package files...
126
[00:03:02] checking for file conflicts...
127
[00:03:02] checking available disk space...
128
[00:03:02] :: Processing package changes...
129
[00:03:02] installing mingw-w64-x86_64-openssl...
130
[00:03:02] Finished
131
[00:03:02] ――――――――――――――――――――――――――――――――――――――――――――――――――――――――――――――― MinGW Package Check
132
[00:03:03] mingw-w64-x86_64-gcc 8.2.0-3
133
[00:03:03] mingw-w64-x86_64-gcc-ada 8.2.0-3
134
[00:03:03] mingw-w64-x86_64-gcc-fortran 8.2.0-3
135
[00:03:03] mingw-w64-x86_64-gcc-libgfortran 8.2.0-3
136
[00:03:03] mingw-w64-x86_64-gcc-libs 8.2.0-3
137
[00:03:03] mingw-w64-x86_64-gcc-objc 8.2.0-3
138
[00:03:03] mingw-w64-x86_64-gdbm 1.18-1
139
[00:03:03] mingw-w64-x86_64-openssl 1.1.1-1
140
[00:03:03] ―――――――――――――――――――――――――――――――――――――――――――――――――――――――――――――――――――――――――――――――――――
141
[00:03:04] ./1_0_build_install_64.ps1
142
[00:03:06] ――――――――――――――――――――――――――――――――――――――――――――――――――――――― 14867_2018-10-29_1.patch
143
[00:03:06] patching file internal.h
144
[00:03:06] patching file process.c
145
[00:03:06] ――――――――――――――――――――――――――――――――――――――――――――――――――――――― lib-mkmf.rb.patch
146
[00:03:06] patching file lib/mkmf.rb
147
[00:03:06] Hunk #1 succeeded at 246 (offset 6 lines).
148
[00:03:06] Hunk #2 succeeded at 461 (offset 6 lines).
149
[00:03:06] ――――――――――――――――――――――――――――――――――――――――――――――――――――――― lib-rubygems-installer.rb.patch
150
[00:03:06] patching file lib/rubygems/installer.rb
151
[00:03:06] ――――――――――――――――――――――――――――――――――――――――――――――――――――――― lib-rubygems.patch
152
[00:03:06] patching file lib/rubygems/installer.rb
153
[00:03:06] patching file lib/rubygems/test_case.rb
154
[00:03:06] ――――――――――――――――――――――――――――――――――――――――――――――――――――――― tool-transcode-tblgen.rb.patch
155
[00:03:07] patching file tool/transcode-tblgen.rb
156
[00:03:07] ――――――――――――――――――――――――――――――――――――――――――――――――――――――― unicode.org.patch
157
[00:03:07] patching file tool/downloader.rb
158
[00:03:07] 
159
[00:03:14] ruby 2.6.0dev (2018-10-29 trunk 65429) [x64-mingw32]
160
[00:03:14] ――――――――――――――――――――――――――――――――――――――――――――――――――――――――――――――――――――――――――――――――
161
[00:03:14] sh -c "autoreconf -fi"
162
[00:03:26] ――――――――――――――――――――――――――――――――――――――――――――――――――――――――――――――――――――――――――――――――
163
[00:03:26] sh -c "../ruby/configure --disable-install-doc --prefix=/install --build=x86_64-w64-mingw32 --host=x86_64-w64-mingw32 --target=x86_64-w64-mingw32 --with-out-ext=pty,syslog"
164
[00:03:27] checking for ruby... /c/Ruby25-x64/bin/ruby
165
[00:03:28] downloading config.guess ... done
166
[00:03:29] downloading config.sub ... done
167
[00:03:29] checking build system type... x86_64-w64-mingw32
168
[00:03:29] checking host system type... x86_64-w64-mingw32
169
[00:03:29] checking target system type... x86_64-w64-mingw32
170
[00:03:29] checking for x86_64-w64-mingw32-gcc... x86_64-w64-mingw32-gcc
171
[00:03:38] checking whether the C compiler works... yes
172
[00:03:38] checking for C compiler default output file name... a.exe
173
[00:03:39] checking for suffix of executables... .exe
174
[00:03:39] checking whether we are cross compiling... no
175
[00:03:39] checking for suffix of object files... o
176
[00:03:39] checking whether we are using the GNU C compiler... yes
177
[00:03:39] checking whether x86_64-w64-mingw32-gcc accepts -g... yes
178
[00:03:39] checking for x86_64-w64-mingw32-gcc option to accept ISO C89... none needed
179
[00:03:39] checking for x86_64-w64-mingw32-g++... x86_64-w64-mingw32-g++
180
[00:03:41] checking whether we are using the GNU C++ compiler... yes
181
[00:03:41] checking whether x86_64-w64-mingw32-g++ accepts -g... yes
182
[00:03:42] checking how to run the C preprocessor... x86_64-w64-mingw32-gcc -E
183
[00:03:42] checking for grep that handles long lines and -e... /usr/bin/grep
184
[00:03:42] checking for egrep... /usr/bin/grep -E
185
[00:03:42] checking whether x86_64-w64-mingw32-gcc needs -traditional... no
186
[00:03:42] checking for x86_64-w64-mingw32-ld... no
187
[00:03:42] checking for ld... ld
188
[00:03:42] checking whether the linker is GNU ld... yes
189
[00:03:42] checking whether x86_64-w64-mingw32-gcc -E accepts -o... yes
190
[00:03:43] checking for x86_64-w64-mingw32-ranlib... no
191
[00:03:43] checking for x86_64-w64-mingw32-ranlib... no
192
[00:03:43] checking for ranlib... ranlib
193
[00:03:43] checking for x86_64-w64-mingw32-ar... no
194
[00:03:43] checking for x86_64-w64-mingw32-ar... no
195
[00:03:43] checking for ar... ar
196
[00:03:43] checking for ar flags... rcD
197
[00:03:43] checking for x86_64-w64-mingw32-as... no
198
[00:03:43] checking for as... as
199
[00:03:43] checking for x86_64-w64-mingw32-objdump... no
200
[00:03:43] checking for x86_64-w64-mingw32-gobjdump... no
201
[00:03:43] checking for objdump... objdump
202
[00:03:43] checking for x86_64-w64-mingw32-objcopy... no
203
[00:03:43] checking for x86_64-w64-mingw32-gobjcopy... no
204
[00:03:43] checking for objcopy... (cached) :
205
[00:03:43] checking for x86_64-w64-mingw32-windres... no
206
[00:03:43] checking for windres... windres
207
[00:03:43] checking for x86_64-w64-mingw32-dllwrap... no
208
[00:03:43] checking for dllwrap... dllwrap
209
[00:03:43] checking for mingw32 runtime DLL... msvcrt
210
[00:03:43] checking for x86_64-w64-mingw32-nm... no
211
[00:03:43] checking for x86_64-w64-mingw32-nm... no
212
[00:03:43] checking for nm... nm
213
[00:03:43] checking whether ln -s works... no, using cp -pR
214
[00:03:43] checking whether make sets $(MAKE)... yes
215
[00:03:44] checking for a BSD-compatible install... /usr/bin/install -c
216
[00:03:44] checking for a thread-safe mkdir -p... /usr/bin/mkdir -p
217
[00:03:44] checking for x86_64-w64-mingw32-dtrace... no
218
[00:03:44] checking for dtrace... no
219
[00:03:44] checking for dot... no
220
[00:03:44] checking for doxygen... no
221
[00:03:44] checking for pkg-config... pkg-config
222
[00:03:44] checking for ANSI C header files... yes
223
[00:03:44] checking for sys/types.h... yes
224
[00:03:45] checking for sys/stat.h... yes
225
[00:03:45] checking for stdlib.h... yes
226
[00:03:45] checking for string.h... yes
227
[00:03:45] checking for memory.h... yes
228
[00:03:45] checking for strings.h... yes
229
[00:03:46] checking for inttypes.h... yes
230
[00:03:46] checking for stdint.h... yes
231
[00:03:46] checking for unistd.h... yes
232
[00:03:47] checking minix/config.h usability... no
233
[00:03:47] checking minix/config.h presence... no
234
[00:03:47] checking for minix/config.h... no
235
[00:03:47] checking whether it is safe to define __EXTENSIONS__... yes
236
[00:03:47] checking for cd using physical directory... cd
237
[00:03:47] checking whether CFLAGS is valid... yes
238
[00:03:48] checking whether LDFLAGS is valid... yes
239
[00:03:48] checking whether -Wl,-R. is accepted as LDFLAGS... yes
240
[00:03:48] checking whether -Wl,-rpath,. is accepted as LDFLAGS... yes
241
[00:03:48] checking whether -Wno-unused-parameter is accepted as CFLAGS... yes
242
[00:03:48] checking whether -Wno-long-long is accepted as CFLAGS... yes
243
[00:03:49] checking whether -diag-disable=175,188,2259 is accepted as CFLAGS... no
244
[00:03:49] checking whether -Wno-missing-field-initializers is accepted as CFLAGS... yes
245
[00:03:49] checking whether -Wno-tautological-compare is accepted as CFLAGS... yes
246
[00:03:49] checking whether -Wno-parentheses-equality is accepted as CFLAGS... yes
247
[00:03:49] checking whether -Wno-constant-logical-operand is accepted as CFLAGS... yes
248
[00:03:49] checking whether -Wno-self-assign is accepted as CFLAGS... yes
249
[00:03:49] checking whether -Wno-cast-function-type is accepted as CFLAGS... yes
250
[00:03:49] checking whether -Wunused-variable is accepted as CFLAGS... yes
251
[00:03:49] checking whether -Werror=implicit-int is accepted as CFLAGS... yes
252
[00:03:50] checking whether -Werror=pointer-arith is accepted as CFLAGS... yes
253
[00:03:50] checking whether -Werror=write-strings is accepted as CFLAGS... yes
254
[00:03:50] checking whether -Werror=declaration-after-statement is accepted as CFLAGS... yes
255
[00:03:50] checking whether -Werror=shorten-64-to-32 is accepted as CFLAGS... no
256
[00:03:50] checking whether -Wshorten-64-to-32 is accepted as CFLAGS... no
257
[00:03:50] checking whether -Werror=implicit-function-declaration is accepted as CFLAGS... yes
258
[00:03:50] checking whether -Werror=division-by-zero is accepted as CFLAGS... no
259
[00:03:51] checking whether -Wdivision-by-zero is accepted as CFLAGS... no
260
[00:03:51] checking whether -Werror=deprecated-declarations is accepted as CFLAGS... yes
261
[00:03:51] checking whether -Werror=misleading-indentation is accepted as CFLAGS... yes
262
[00:03:51] checking whether -Wno-overlength-strings is accepted as CFLAGS... yes
263
[00:03:51] checking whether -Wno-packed-bitfield-compat is accepted as CFLAGS... yes
264
[00:03:51] checking whether -Wsuggest-attribute=noreturn is accepted as CFLAGS... yes
265
[00:03:51] checking whether -Wsuggest-attribute=format is accepted as CFLAGS... yes
266
[00:03:51] checking whether -Wmissing-noreturn is accepted as CFLAGS... yes
267
[00:03:51] checking whether -Wimplicit-fallthrough=0 is accepted as CFLAGS... yes
268
[00:03:52] checking whether -Werror=duplicated-cond is accepted as CFLAGS... yes
269
[00:03:52] checking whether -Werror=restrict is accepted as CFLAGS... yes
270
[00:03:52] checking whether -Werror=extra-tokens is accepted as CFLAGS... no
271
[00:03:52] checking whether -Wextra-tokens is accepted as CFLAGS... no
272
[00:03:52] checking whether -Wall -Wextra is accepted as CFLAGS... yes
273
[00:03:52] checking whether -Qunused-arguments is accepted as CFLAGS... no
274
[00:03:52] checking whether -D_FORTIFY_SOURCE=2 is accepted as CFLAGS... yes
275
[00:03:53] checking whether -Wl,--compress-debug-sections=zlib is accepted as LDFLAGS... no
276
[00:03:53] checking whether frexp and modf are broken... no
277
[00:03:53] checking whether -fno-strict-overflow is accepted as CFLAGS... yes
278
[00:03:53] checking whether -ggdb3 is accepted as CFLAGS... yes
279
[00:03:53] checking whether -fvisibility=hidden is accepted as CFLAGS... yes
280
[00:03:53] checking whether -fno-omit-frame-pointer is accepted as CFLAGS... yes
281
[00:03:53] checking whether -static-libgcc is accepted as CFLAGS... yes
282
[00:03:53] checking whether -fno-fast-math is accepted as CFLAGS... yes
283
[00:03:54] checking whether -fexcess-precision=standard is accepted as CFLAGS... yes
284
[00:03:54] checking whether -fp-model precise is accepted as CFLAGS... no
285
[00:04:17] checking for NET_LUID... yes
286
[00:04:19] checking for _gmtime64_s... yes
287
[00:04:19] checking for _wfreopen_s... yes
288
[00:04:19] checking for crypt in -lcrypt... (cached) no
289
[00:04:19] checking for dlopen in -ldl... (cached) no
290
[00:04:19] checking for shl_load in -ldld... no
291
[00:04:19] checking for shutdown in -lsocket... no
292
[00:04:19] checking for dirent.h that defines DIR... yes
293
[00:04:20] checking for library containing opendir... none required
294
[00:04:20] checking for stdbool.h that conforms to C99... yes
295
[00:04:20] checking for _Bool... yes
296
[00:04:21] checking for sys/wait.h that is POSIX.1 compatible... no
297
[00:04:21] checking for a.out.h... (cached) no
298
[00:04:21] checking atomic.h usability... no
299
[00:04:21] checking atomic.h presence... no
300
[00:04:21] checking for atomic.h... no
301
[00:04:21] checking direct.h usability... yes
302
[00:04:21] checking direct.h presence... yes
303
[00:04:21] checking for direct.h... yes
304
[00:04:21] checking grp.h usability... no
305
[00:04:22] checking grp.h presence... no
306
[00:04:22] checking for grp.h... no
307
[00:04:22] checking fcntl.h usability... yes
308
[00:04:22] checking fcntl.h presence... yes
309
[00:04:22] checking for fcntl.h... yes
310
[00:04:22] checking float.h usability... yes
311
[00:04:22] checking float.h presence... yes
312
[00:04:22] checking for float.h... yes
313
[00:04:22] checking ieeefp.h usability... yes
314
[00:04:22] checking ieeefp.h presence... yes
315
[00:04:22] checking for ieeefp.h... yes
316
[00:04:23] checking intrinsics.h usability... no
317
[00:04:23] checking intrinsics.h presence... no
318
[00:04:23] checking for intrinsics.h... no
319
[00:04:23] checking langinfo.h usability... no
320
[00:04:23] checking langinfo.h presence... no
321
[00:04:23] checking for langinfo.h... no
322
[00:04:23] checking limits.h usability... yes
323
[00:04:23] checking limits.h presence... yes
324
[00:04:23] checking for limits.h... yes
325
[00:04:23] checking locale.h usability... yes
326
[00:04:23] checking locale.h presence... yes
327
[00:04:23] checking for locale.h... yes
328
[00:04:24] checking malloc.h usability... yes
329
[00:04:24] checking malloc.h presence... yes
330
[00:04:24] checking for malloc.h... yes
331
[00:04:24] checking malloc/malloc.h usability... no
332
[00:04:24] checking malloc/malloc.h presence... no
333
[00:04:24] checking for malloc/malloc.h... no
334
[00:04:24] checking malloc_np.h usability... no
335
[00:04:24] checking malloc_np.h presence... no
336
[00:04:24] checking for malloc_np.h... no
337
[00:04:25] checking net/socket.h usability... no
338
[00:04:25] checking net/socket.h presence... no
339
[00:04:25] checking for net/socket.h... no
340
[00:04:25] checking process.h usability... yes
341
[00:04:25] checking process.h presence... yes
342
[00:04:25] checking for process.h... yes
343
[00:04:25] checking for pwd.h... (cached) no
344
[00:04:25] checking setjmpex.h usability... yes
345
[00:04:25] checking setjmpex.h presence... yes
346
[00:04:25] checking for setjmpex.h... yes
347
[00:04:25] checking stdalign.h usability... yes
348
[00:04:25] checking stdalign.h presence... yes
349
[00:04:25] checking for stdalign.h... yes
350
[00:04:26] checking sys/attr.h usability... no
351
[00:04:26] checking sys/attr.h presence... no
352
[00:04:26] checking for sys/attr.h... no
353
[00:04:26] checking sys/eventfd.h usability... no
354
[00:04:26] checking sys/eventfd.h presence... no
355
[00:04:26] checking for sys/eventfd.h... no
356
[00:04:26] checking sys/fcntl.h usability... yes
357
[00:04:26] checking sys/fcntl.h presence... yes
358
[00:04:26] checking for sys/fcntl.h... yes
359
[00:04:26] checking sys/file.h usability... yes
360
[00:04:27] checking sys/file.h presence... yes
361
[00:04:27] checking for sys/file.h... yes
362
[00:04:27] checking sys/id.h usability... no
363
[00:04:27] checking sys/id.h presence... no
364
[00:04:27] checking for sys/id.h... no
365
[00:04:27] checking for sys/ioctl.h... (cached) no
366
[00:04:27] checking sys/mkdev.h usability... no
367
[00:04:27] checking sys/mkdev.h presence... no
368
[00:04:27] checking for sys/mkdev.h... no
369
[00:04:27] checking for sys/param.h... (cached) no
370
[00:04:27] checking sys/prctl.h usability... no
371
[00:04:28] checking sys/prctl.h presence... no
372
[00:04:28] checking for sys/prctl.h... no
373
[00:04:28] checking for sys/resource.h... (cached) no
374
[00:04:28] checking for sys/select.h... (cached) no
375
[00:04:28] checking sys/sendfile.h usability... no
376
[00:04:28] checking sys/sendfile.h presence... no
377
[00:04:28] checking for sys/sendfile.h... no
378
[00:04:28] checking for sys/socket.h... (cached) no
379
[00:04:28] checking sys/syscall.h usability... no
380
[00:04:28] checking sys/syscall.h presence... no
381
[00:04:28] checking for sys/syscall.h... no
382
[00:04:28] checking sys/sysmacros.h usability... no
383
[00:04:29] checking sys/sysmacros.h presence... no
384
[00:04:29] checking for sys/sysmacros.h... no
385
[00:04:29] checking for sys/time.h... (cached) no
386
[00:04:29] checking for sys/times.h... (cached) no
387
[00:04:29] checking sys/uio.h usability... no
388
[00:04:29] checking sys/uio.h presence... no
389
[00:04:29] checking for sys/uio.h... no
390
[00:04:29] checking sys/utime.h usability... yes
391
[00:04:29] checking sys/utime.h presence... yes
392
[00:04:29] checking for sys/utime.h... yes
393
[00:04:29] checking syscall.h usability... no
394
[00:04:30] checking syscall.h presence... no
395
[00:04:30] checking for syscall.h... no
396
[00:04:30] checking time.h usability... yes
397
[00:04:30] checking time.h presence... yes
398
[00:04:30] checking for time.h... yes
399
[00:04:30] checking ucontext.h usability... no
400
[00:04:30] checking ucontext.h presence... no
401
[00:04:30] checking for ucontext.h... no
402
[00:04:30] checking for utime.h... (cached) no
403
[00:04:30] checking gmp.h usability... yes
404
[00:04:31] checking gmp.h presence... yes
405
[00:04:31] checking for gmp.h... yes
406
[00:04:31] checking for library containing __gmpz_init... -lgmp
407
[00:04:31] checking for special C compiler options needed for large files... no
408
[00:04:32] checking for _FILE_OFFSET_BITS value needed for large files... 64
409
[00:04:32] checking whether byte ordering is bigendian... no
410
[00:04:32] checking for an ANSI C-conforming const... yes
411
[00:04:32] checking whether char is unsigned... no
412
[00:04:32] checking for inline... inline
413
[00:04:33] checking for working volatile... yes
414
[00:04:33] checking for typeof syntax and keyword spelling... typeof
415
[00:04:33] checking for long long... yes
416
[00:04:33] checking for off_t... (cached) yes
417
[00:04:34] checking char bit... 8
418
[00:04:35] checking size of int... 4
419
[00:04:35] checking size of short... 2
420
[00:04:35] checking size of long... 4
421
[00:04:36] checking size of long long... 8
422
[00:04:36] checking size of __int64... 8
423
[00:04:36] checking size of __int128... 16
424
[00:04:36] checking size of off_t... (cached) 8
425
[00:04:37] checking size of void*... 8
426
[00:04:37] checking size of float... 4
427
[00:04:37] checking size of double... 8
428
[00:04:38] checking size of time_t... 8
429
[00:04:38] checking size of clock_t... 4
430
[00:04:38] checking packed struct attribute... x __attribute__((packed))
431
[00:04:38] checking whether -Wno-address-of-packed-member is accepted as CFLAGS... yes
432
[00:04:38] checking for printf prefix for long long... ll
433
[00:04:39] checking for pid_t... yes
434
[00:04:39] checking for convertible type of pid_t... LL
435
[00:04:39] checking for uid_t... no
436
[00:04:40] checking for convertible type of uid_t... INT
437
[00:04:40] checking for gid_t... no
438
[00:04:41] checking for convertible type of gid_t... INT
439
[00:04:42] checking for time_t... yes
440
[00:04:42] checking for convertible type of time_t... LL
441
[00:04:42] checking for dev_t... yes
442
[00:04:43] checking for convertible type of dev_t... UINT
443
[00:04:44] checking for mode_t... yes
444
[00:04:44] checking for convertible type of mode_t... USHORT
445
[00:04:45] checking for rlim_t... no
446
[00:04:46] checking for convertible type of rlim_t... LONG
447
[00:04:46] checking for off_t... (cached) yes
448
[00:04:46] checking for convertible type of off_t... LL
449
[00:04:47] checking for clockid_t... yes
450
[00:04:47] checking for convertible type of clockid_t... INT
451
[00:04:47] checking for prototypes... yes
452
[00:04:48] checking token paste string... ansi
453
[00:04:48] checking stringization... #expr
454
[00:04:48] checking string literal concatenation... yes
455
[00:04:48] checking for variable length prototypes and stdarg.h... yes
456
[00:04:48] checking for variable length macro... yes
457
[00:04:49] checking for alignas() syntax... __declspec(aligned(x))
458
[00:04:49] checking for alignof() syntax... alignof
459
[00:04:49] checking for CONSTFUNC function attribute... __attribute__ ((__const__)) x
460
[00:04:49] checking for PUREFUNC function attribute... __attribute__ ((__pure__)) x
461
[00:04:49] checking for NORETURN function attribute... __attribute__ ((__noreturn__)) x
462
[00:04:49] checking for DEPRECATED function attribute... __attribute__ ((__deprecated__)) x
463
[00:04:49] checking for DEPRECATED_BY function attribute... __attribute__ ((__deprecated__("by "#n))) x
464
[00:04:49] checking for DEPRECATED_TYPE type attribute... __attribute__ ((__deprecated__ mesg)) x
465
[00:04:50] checking for NOINLINE function attribute... __attribute__ ((__noinline__)) x
466
[00:04:50] checking for ALWAYS_INLINE function attribute... __attribute__ ((__always_inline__)) x
467
[00:04:50] checking for WARN_UNUSED_RESULT function attribute... __attribute__ ((__warn_unused_result__)) x
468
[00:04:50] checking for MAYBE_UNUSED function attribute... __attribute__ ((__unused__)) x
469
[00:04:50] checking for ERRORFUNC function attribute... __attribute__ ((__error__ mesg)) x
470
[00:04:50] checking for WARNINGFUNC function attribute... __attribute__ ((__warning__ mesg)) x
471
[00:04:50] checking for WEAK function attribute... __attribute__ ((__weak__)) x
472
[00:04:50] checking for FUNC_STDCALL function attribute... __attribute__ ((__stdcall__)) x
473
[00:04:50] checking for FUNC_CDECL function attribute... __attribute__ ((__cdecl__)) x
474
[00:04:51] checking for FUNC_FASTCALL function attribute... __attribute__ ((__fastcall__)) x
475
[00:04:51] checking for FUNC_UNOPTIMIZED function attribute... __attribute__ ((__optimize__("O0"))) x
476
[00:04:51] checking for FUNC_MINIMIZED function attribute... __attribute__ ((__optimize__("-Os","-fomit-frame-pointer"))) x
477
[00:04:51] checking for function alias... alias
478
[00:04:51] checking for __atomic builtins... yes
479
[00:04:51] checking for __sync builtins... yes
480
[00:04:51] checking for __builtin_unreachable... yes
481
[00:04:52] checking for exported function attribute... __attribute__ ((__visibility__("default")))
482
[00:04:52] checking for function name string predefined identifier... __func__
483
[00:04:52] checking if enum over int is allowed... yes
484
[00:04:52] checking whether sys_nerr is declared... yes
485
[00:04:52] checking whether getenv is declared... yes
486
[00:04:53] checking for size_t... yes
487
[00:04:53] checking size of size_t... 8
488
[00:04:53] checking size of ptrdiff_t... 8
489
[00:04:54] checking for printf prefix for size_t... z
490
[00:04:54] checking for printf prefix for ptrdiff_t... t
491
[00:04:54] checking for struct stat.st_blksize... no
492
[00:04:54] checking for struct stat.st_blocks... no
493
[00:04:55] checking for struct stat.st_rdev... yes
494
[00:04:55] checking size of struct stat.st_size... SIZEOF_OFF_T
495
[00:04:55] checking size of struct stat.st_ino... 2
496
[00:04:56] checking for struct stat.st_atim... no
497
[00:04:56] checking for struct stat.st_atimespec... no
498
[00:04:57] checking for struct stat.st_atimensec... no
499
[00:04:57] checking for struct stat.st_mtim... no
500
[00:04:57] checking for struct stat.st_mtimespec... no
501
[00:04:58] checking for struct stat.st_mtimensec... no
502
[00:04:58] checking for struct stat.st_ctim... no
503
[00:04:59] checking for struct stat.st_ctimespec... no
504
[00:04:59] checking for struct stat.st_ctimensec... no
505
[00:04:59] checking for struct stat.st_birthtimespec... no
506
[00:04:59] checking for struct timeval... (cached) yes
507
[00:05:00] checking size of struct timeval.tv_sec... SIZEOF_LONG
508
[00:05:00] checking for struct timespec... yes
509
[00:05:00] checking for struct timezone... yes
510
[00:05:01] (cached) checking for int8_t... yes
511
[00:05:01] checking size of int8_t... 1
512
[00:05:01] checking for uint8_t... yes
513
[00:05:02] checking size of uint8_t... 1
514
[00:05:02] checking for int16_t... yes
515
[00:05:02] checking size of int16_t... 2
516
[00:05:02] checking for uint16_t... yes
517
[00:05:02] checking size of uint16_t... 2
518
[00:05:03] checking for int32_t... yes
519
[00:05:03] checking size of int32_t... 4
520
[00:05:03] checking for uint32_t... yes
521
[00:05:03] checking size of uint32_t... 4
522
[00:05:03] checking for int64_t... yes
523
[00:05:04] checking size of int64_t... 8
524
[00:05:04] checking for uint64_t... yes
525
[00:05:04] checking size of uint64_t... 8
526
[00:05:04] checking for int128_t... __int128
527
[00:05:05] checking for uint128_t... unsigned __int128
528
[00:05:05] checking for intptr_t... yes
529
[00:05:05] checking size of intptr_t... 8
530
[00:05:05] checking for uintptr_t... yes
531
[00:05:06] checking size of uintptr_t... 8
532
[00:05:06] checking for printf prefix for intptr_t... ll
533
[00:05:06] checking for ssize_t... yes
534
[00:05:06] checking size of ssize_t... 8
535
[00:05:07] checking for printf prefix for int64_t... NONE
536
[00:05:07] checking for stack end address... no
537
[00:05:07] checking for uid_t in sys/types.h... (cached) no
538
[00:05:07] checking type of array argument to getgroups... int
539
[00:05:08] checking return type of signal handlers... void
540
[00:05:08] checking for working alloca.h... no
541
[00:05:08] checking for alloca... yes
542
[00:05:08] checking for dynamic size alloca... ok
543
[00:05:08] checking for working memcmp... (cached) yes
544
[00:05:09] checking for broken erfc of glibc-2.3.6 on IA64... no
545
[00:05:09] checking for acosh... yes
546
[00:05:09] checking for cbrt... yes
547
[00:05:10] checking for crypt... no
548
[00:05:10] checking for dup2... yes
549
[00:05:10] checking for erf... yes
550
[00:05:10] checking for explicit_bzero... no
551
[00:05:11] checking for ffs... no
552
[00:05:11] checking for finite... (cached) yes
553
[00:05:11] checking for flock... (cached) yes
554
[00:05:11] checking for hypot... yes
555
[00:05:11] checking for isinf... (cached) yes
556
[00:05:11] checking for isnan... (cached) yes
557
[00:05:11] checking for lgamma_r... no
558
[00:05:11] checking for memmove... yes
559
[00:05:12] checking for nan... yes
560
[00:05:12] checking for nextafter... yes
561
[00:05:12] checking for setproctitle... no
562
[00:05:12] checking for strchr... yes
563
[00:05:12] checking for strerror... yes
564
[00:05:13] checking for strlcat... no
565
[00:05:13] checking for strlcpy... no
566
[00:05:13] checking for strstr... yes
567
[00:05:13] checking for tgamma... (cached) no
568
[00:05:13] checking sys/pstat.h usability... no
569
[00:05:13] checking sys/pstat.h presence... no
570
[00:05:13] checking for sys/pstat.h... no
571
[00:05:14] checking for signbit... yes
572
[00:05:14] checking for broken memmem... yes
573
[00:05:14] checking for pid_t... (cached) yes
574
[00:05:14] checking vfork.h usability... no
575
[00:05:14] checking vfork.h presence... no
576
[00:05:14] checking for vfork.h... no
577
[00:05:15] checking for fork... no
578
[00:05:15] checking for vfork... no
579
[00:05:15] checking for __syscall... no
580
[00:05:15] checking for _longjmp... no
581
[00:05:16] checking for arc4random_buf... no
582
[00:05:16] checking for atan2l... yes
583
[00:05:16] checking for atan2f... yes
584
[00:05:17] checking for chroot... no
585
[00:05:17] checking for chsize... yes
586
[00:05:17] checking for clock_gettime... (cached) yes
587
[00:05:17] checking for cosh... yes
588
[00:05:17] checking for crypt_r... no
589
[00:05:17] checking for daemon... (cached) no
590
[00:05:18] checking for dirfd... no
591
[00:05:18] checking for dl_iterate_phdr... no
592
[00:05:18] checking for dlopen... no
593
[00:05:18] checking for dladdr... no
594
[00:05:19] checking for dup... yes
595
[00:05:19] checking for dup3... no
596
[00:05:19] checking for eaccess... no
597
[00:05:19] checking for endgrent... no
598
[00:05:20] checking for eventfd... no
599
[00:05:20] checking for fchmod... no
600
[00:05:20] checking for fchown... no
601
[00:05:20] checking for fcntl... (cached) yes
602
[00:05:20] checking for fdatasync... no
603
[00:05:21] checking for fdopendir... no
604
[00:05:21] checking for fgetattrlist... no
605
[00:05:21] checking for fmod... yes
606
[00:05:21] checking for fstatat... no
607
[00:05:21] checking for fsync... (cached) yes
608
[00:05:21] checking for ftruncate... yes
609
[00:05:22] checking for ftruncate64... yes
610
[00:05:22] checking for getattrlist... no
611
[00:05:22] checking for getcwd... yes
612
[00:05:22] checking for getgidx... no
613
[00:05:23] checking for getgrnam... no
614
[00:05:23] checking for getgrnam_r... no
615
[00:05:23] checking for getgroups... no
616
[00:05:23] checking for getpgid... no
617
[00:05:24] checking for getpgrp... no
618
[00:05:24] checking for getpriority... no
619
[00:05:24] checking for getpwnam_r... no
620
[00:05:24] checking for getresgid... no
621
[00:05:25] checking for getresuid... no
622
[00:05:25] checking for getrlimit... no
623
[00:05:25] checking for getsid... no
624
[00:05:25] checking for gettimeofday... yes
625
[00:05:25] checking for getuidx... no
626
[00:05:25] checking for gmtime_r... (cached) yes
627
[00:05:26] checking for grantpt... no
628
[00:05:26] checking for initgroups... no
629
[00:05:26] checking for ioctl... no
630
[00:05:26] checking for isfinite... no
631
[00:05:27] checking for issetugid... no
632
[00:05:27] checking for killpg... no
633
[00:05:27] checking for lchmod... no
634
[00:05:27] checking for lchown... (cached) yes
635
[00:05:27] checking for link... (cached) yes
636
[00:05:27] checking for llabs... yes
637
[00:05:28] checking for lockf... no
638
[00:05:28] checking for log2... yes
639
[00:05:28] checking for lstat... (cached) yes
640
[00:05:28] checking for lutimes... no
641
[00:05:28] checking for malloc_usable_size... (cached) no
642
[00:05:28] checking for malloc_size... no
643
[00:05:28] checking for mblen... yes
644
[00:05:29] checking for memalign... no
645
[00:05:29] checking for memset_s... no
646
[00:05:29] checking for writev... no
647
[00:05:29] checking for memrchr... no
648
[00:05:29] checking for memmem... (cached) no
649
[00:05:30] checking for mkfifo... no
650
[00:05:30] checking for mknod... no
651
[00:05:30] checking for mktime... yes
652
[00:05:30] checking for openat... no
653
[00:05:30] checking for pipe2... no
654
[00:05:31] checking for poll... no
655
[00:05:31] checking for posix_fadvise... no
656
[00:05:31] checking for posix_memalign... no
657
[00:05:31] checking for ppoll... no
658
[00:05:31] checking for pread... no
659
[00:05:32] checking for pwrite... no
660
[00:05:32] checking for qsort_r... no
661
[00:05:32] checking for qsort_s... yes
662
[00:05:32] checking for readlink... (cached) yes
663
[00:05:32] checking for round... (cached) no
664
[00:05:32] checking for sched_getaffinity... no
665
[00:05:32] checking for seekdir... (cached) yes
666
[00:05:33] checking for select_large_fdset... no
667
[00:05:33] checking for sendfile... no
668
[00:05:33] checking for setegid... no
669
[00:05:33] checking for setenv... no
670
[00:05:34] checking for seteuid... no
671
[00:05:34] checking for setgid... no
672
[00:05:34] checking for setgroups... no
673
[00:05:34] checking for setpgid... no
674
[00:05:35] checking for setpgrp... no
675
[00:05:35] checking for setregid... no
676
[00:05:35] checking for setresgid... no
677
[00:05:35] checking for setresuid... no
678
[00:05:36] checking for setreuid... no
679
[00:05:36] checking for setrgid... no
680
[00:05:36] checking for setrlimit... no
681
[00:05:36] checking for setruid... no
682
[00:05:37] checking for setsid... no
683
[00:05:37] checking for setuid... no
684
[00:05:37] checking for shutdown... yes
685
[00:05:37] checking for sigaction... no
686
[00:05:37] checking for sigaltstack... no
687
[00:05:38] checking for sigprocmask... no
688
[00:05:38] checking for sinh... yes
689
[00:05:38] checking for spawnv... yes
690
[00:05:38] checking for symlink... (cached) yes
691
[00:05:38] checking for syscall... no
692
[00:05:39] checking for sysconf... no
693
[00:05:39] checking for tanh... yes
694
[00:05:39] checking for telldir... (cached) yes
695
[00:05:39] checking for timegm... no
696
[00:05:39] checking for times... (cached) yes
697
[00:05:39] checking for truncate... yes
698
[00:05:40] checking for truncate64... yes
699
[00:05:40] checking for unsetenv... no
700
[00:05:40] checking for utimensat... no
701
[00:05:40] checking for utimes... no
702
[00:05:41] checking for wait4... no
703
[00:05:41] checking for waitpid... (cached) yes
704
[00:05:41] checking if getcwd allocates buffer if NULL is given... yes
705
[00:05:41] checking for __builtin_alloca_with_align... yes
706
[00:05:41] checking for __builtin_assume_aligned... yes
707
[00:05:41] checking for __builtin_bswap16... yes
708
[00:05:41] checking for __builtin_bswap32... yes
709
[00:05:42] checking for __builtin_bswap64... yes
710
[00:05:42] checking for __builtin_popcount... yes
711
[00:05:42] checking for __builtin_popcountll... yes
712
[00:05:42] checking for __builtin_clz... yes
713
[00:05:42] checking for __builtin_clzl... yes
714
[00:05:43] checking for __builtin_clzll... yes
715
[00:05:43] checking for __builtin_ctz... yes
716
[00:05:43] checking for __builtin_ctzll... yes
717
[00:05:43] checking for __builtin_add_overflow... yes
718
[00:05:43] checking for __builtin_sub_overflow... yes
719
[00:05:44] checking for __builtin_mul_overflow... yes
720
[00:05:44] checking for __builtin_mul_overflow_p... yes
721
[00:05:44] checking for __builtin_constant_p... yes
722
[00:05:44] checking for __builtin_choose_expr... yes
723
[00:05:44] checking for __builtin_choose_expr_constant_p... yes
724
[00:05:45] checking for __builtin_types_compatible_p... yes
725
[00:05:45] checking whether atan2 handles Inf as C99... yes
726
[00:05:45] checking for clock_getres... (cached) yes
727
[00:05:45] checking for timer_create in -lrt... no
728
[00:05:45] checking for timer_settime in -lrt... no
729
[00:05:46] checking for unsetenv returns a value... yes
730
[00:05:46] checking whether struct tm is in sys/time.h or time.h... time.h
731
[00:05:46] checking for struct tm.tm_zone... no
732
[00:05:46] checking whether tzname is declared... yes
733
[00:05:46] checking for tzname... yes
734
[00:05:47] checking for struct tm.tm_gmtoff... no
735
[00:05:47] checking for external int daylight... yes
736
[00:05:47] checking for negative time_t for gmtime(3)... (cached) yes
737
[00:05:47] checking for localtime(3) overflow correctly... yes
738
[00:05:47] checking for sigsetmask... no
739
[00:05:47] checking for BSD signal semantics... no
740
[00:05:48] checking for sig_t... no
741
[00:05:48] checking whether getpgrp requires zero arguments... (cached) no
742
[00:05:48] checking whether right shift preserve sign bit... yes
743
[00:05:48] checking stack growing direction on x64... -1
744
[00:05:48] checking if signal.h defines ucontext_t... no
745
[00:05:48] checking whether ELF binaries are produced... (cached) no
746
[00:05:48] checking mach-o/loader.h usability... no
747
[00:05:48] checking mach-o/loader.h presence... no
748
[00:05:48] checking for mach-o/loader.h... no
749
[00:05:48] checking whether OS depend dynamic link works... yes
750
[00:05:49] checking for backtrace... no
751
[00:05:49] checking valgrind/memcheck.h usability... no
752
[00:05:49] checking valgrind/memcheck.h presence... no
753
[00:05:49] checking for valgrind/memcheck.h... no
754
[00:05:49] checking for x86_64-w64-mingw32-strip... no
755
[00:05:49] checking for strip... strip
756
[00:05:49] checking whether -Wl,--no-undefined is accepted as LDFLAGS... yes
757
[00:05:49] checking whether wrapper for PATH is needed... no
758
[00:05:49] checking whether dtrace USDT is available... no
759
[00:05:49] checking for __builtin_setjmp... (cached) no
760
[00:05:50] checking for _setjmpex as a macro or function... yes
761
[00:05:50] checking for _setjmp as a macro or function... (cached) no
762
[00:05:50] checking for sigsetjmp as a macro or function... no
763
[00:05:50] checking for setjmp type... setjmpex
764
[00:05:50] checking for prefix of external symbols... NONE
765
[00:05:53] .ext/include/x64-mingw32/ruby/config.h updated
766
[00:05:53] configure: ruby library version = 2.6.0
767
[00:05:55] configure: creating ./config.status
768
[00:05:56] config.status: creating GNUmakefile
769
[00:05:56] config.status: creating Makefile
770
[00:05:57] config.status: creating ruby-2.6.pc
771
[00:05:57] ---
772
[00:05:57] Configuration summary for ruby version 2.6.0
773
[00:05:57] 
774
[00:05:57]    * Installation prefix: /install
775
[00:05:57]    * exec prefix:         ${prefix}
776
[00:05:57]    * arch:                x64-mingw32
777
[00:05:57]    * site arch:           x64-msvcrt
778
[00:05:57]    * RUBY_BASE_NAME:      ruby
779
[00:05:57]    * enable shared:       yes
780
[00:05:57]    * ruby lib prefix:     ${libdir}/${RUBY_BASE_NAME}
781
[00:05:57]    * site libraries path: ${rubylibprefix}/${sitearch}
782
[00:05:57]    * vendor path:         ${rubylibprefix}/vendor_ruby
783
[00:05:58]    * target OS:           mingw32
784
[00:05:58]    * compiler:            x86_64-w64-mingw32-gcc
785
[00:05:58]    * with pthread:        no
786
[00:05:58]    * enable shared libs:  yes
787
[00:05:58]    * dynamic library ext: so
788
[00:05:58]    * CFLAGS:              ${optflags} ${debugflags} ${warnflags}
789
[00:05:58]    * LDFLAGS:             -L. -pipe
790
[00:05:58]    * DLDFLAGS:            -pipe \
791
[00:05:58]                           -Wl,--enable-auto-image-base,--enable-auto-import \
792
[00:05:58]                           $(DEFFILE)
793
[00:05:58]    * optflags:            -O3 -fno-omit-frame-pointer
794
[00:05:58]    * debugflags:          -ggdb3
795
[00:05:58]    * warnflags:           -Wall -Wextra -Wno-unused-parameter \
796
[00:05:58]                           -Wno-long-long -Wno-missing-field-initializers \
797
[00:05:58]                           -Wno-tautological-compare \
798
[00:05:58]                           -Wno-parentheses-equality \
799
[00:05:58]                           -Wno-constant-logical-operand -Wno-self-assign \
800
[00:05:58]                           -Wno-cast-function-type -Wunused-variable \
801
[00:05:58]                           -Werror=implicit-int -Werror=pointer-arith \
802
[00:05:58]                           -Werror=write-strings \
803
[00:05:58]                           -Werror=declaration-after-statement \
804
[00:05:58]                           -Werror=implicit-function-declaration \
805
[00:05:58]                           -Werror=deprecated-declarations \
806
[00:05:58]                           -Werror=misleading-indentation \
807
[00:05:58]                           -Wno-overlength-strings \
808
[00:05:58]                           -Wno-packed-bitfield-compat \
809
[00:05:58]                           -Wsuggest-attribute=noreturn \
810
[00:05:58]                           -Wsuggest-attribute=format -Wmissing-noreturn \
811
[00:05:58]                           -Wimplicit-fallthrough=0 -Werror=duplicated-cond \
812
[00:05:58]                           -Werror=restrict
813
[00:05:58]    * strip command:       strip
814
[00:05:58]    * install doc:         no
815
[00:05:58]    * MJIT support:        yes
816
[00:05:58]    * man page type:       doc
817
[00:05:58] 
818
[00:05:58] ---
819
[00:05:59] ――――――――――――――――――――――――――――――――――――――――――――――――――――――――――――――――――――――――――――――――
820
[00:05:59] make -j2 update-unicode
821
[00:05:59] Downloading Unicode 10.0.0 data files...
822
[00:06:00] downloading 10.0.0/ucd/UnicodeData.txt ... done
823
[00:06:00] downloading 10.0.0/ucd/CompositionExclusions.txt ... done
824
[00:06:01] downloading 10.0.0/ucd/NormalizationTest.txt ... done
825
[00:06:02] downloading 10.0.0/ucd/CaseFolding.txt ... done
826
[00:06:02] downloading 10.0.0/ucd/SpecialCasing.txt ... done
827
[00:06:02] ――――――――――――――――――――――――――――――――――――――――――――――――――――――――――――――――――――――――――――――――
828
[00:06:02] make -j2 update-gems
829
[00:06:02] Downloading bundled gem files...
830
[00:06:03] downloading did_you_mean-1.2.1.gem ... done
831
[00:06:03] downloading minitest-5.11.3.gem ... done
832
[00:06:03] downloading net-telnet-0.2.0.gem ... done
833
[00:06:03] downloading power_assert-1.1.3.gem ... done
834
[00:06:03] downloading rake-12.3.1.gem ... done
835
[00:06:03] downloading test-unit-3.2.8.gem ... done
836
[00:06:03] downloading xmlrpc-0.3.0.gem ... done
837
[00:06:08] ――――――――――――――――――――――――――――――――――――――――――――――――――――――――――――――――――――――――――――――――
838
[00:06:08] make -j2 2>&1
839
[00:06:08] 	BASERUBY = /c/Ruby25-x64/bin/ruby --disable=gems
840
[00:06:08] 	CC = x86_64-w64-mingw32-gcc
841
[00:06:08] 	LD = ld
842
[00:06:08] 	LDSHARED = x86_64-w64-mingw32-gcc -shared
843
[00:06:08] 	CFLAGS = -march=x86-64 -mtune=generic -O3 -pipe 
844
[00:06:08] 	XCFLAGS = -D_FORTIFY_SOURCE=2 -fno-strict-overflow -DRUBY_DEVEL=1 -fvisibility=hidden -fexcess-precision=standard -DRUBY_EXPORT -DCANONICALIZATION_FOR_MATHN
845
[00:06:08] 	CPPFLAGS = -D_FORTIFY_SOURCE=2 -D__USE_MINGW_ANSI_STDIO=1 -DFD_SETSIZE=2048 -D_WIN32_WINNT=0x0600 -D__MINGW_USE_VC2005_COMPAT   -I. -I.ext/include/x64-mingw32 -I../ruby/include -I../ruby -I../ruby/enc/unicode/10.0.0 
846
[00:06:08] 	DLDFLAGS = -pipe -Wl,--enable-auto-image-base,--enable-auto-import -Wl,--out-implib=libx64-msvcrt-ruby260.dll.a x64-msvcrt-ruby260.def -Wl,--stack,0x00200000,--enable-auto-import -static-libgcc 
847
[00:06:08] 	SOLIBS = x64-msvcrt-ruby260.res.o -lgmp -lshell32 -lws2_32 -liphlpapi -limagehlp -lshlwapi 
848
[00:06:08] 	LANG = 
849
[00:06:08] 	LC_ALL = 
850
[00:06:08] 	LC_CTYPE = 
851
[00:06:08] x86_64-w64-mingw32-gcc.exe (Rev3, Built by MSYS2 project) 8.2.0
852
[00:06:08] Copyright (C) 2018 Free Software Foundation, Inc.
853
[00:06:08] This is free software; see the source for copying conditions.  There is NO
854
[00:06:08] warranty; not even for MERCHANTABILITY or FITNESS FOR A PARTICULAR PURPOSE.
855
[00:06:08] 
856
[00:06:08] compiling ../ruby/main.c
857
[00:06:08] compiling ../ruby/dmydln.c
858
[00:06:10] compiling ../ruby/miniinit.c
859
[00:06:10] compiling ../ruby/dmyext.c
860
[00:06:10] generating miniprelude.c
861
[00:06:10] miniprelude.c updated
862
[00:06:10] generating id.h
863
[00:06:10] id.h updated
864
[00:06:10] /c/Ruby25-x64/bin/ruby --disable=gems ../ruby/tool/gen_dummy_probes.rb ../ruby/probes.d > probes.dmyh
865
[00:06:10] compiling ../ruby/ast.c
866
[00:06:11] compiling ../ruby/bignum.c
867
[00:06:12] compiling ../ruby/class.c
868
[00:06:16] compiling ../ruby/compar.c
869
[00:06:16] generating opt_sc.inc
870
[00:06:16] generating optunifs.inc
871
[00:06:16] generating insns.inc
872
[00:06:16] generating insns_info.inc
873
[00:06:17] generating optinsn.inc
874
[00:06:17] compiling ../ruby/complex.c
875
[00:06:17] compiling ../ruby/cont.c
876
[00:06:19] compiling ../ruby/debug.c
877
[00:06:20] compiling ../ruby/debug_counter.c
878
[00:06:20] compiling ../ruby/dir.c
879
[00:06:20] compiling ../ruby/dln_find.c
880
[00:06:22] compiling ../ruby/encoding.c
881
[00:06:23] compiling ../ruby/enum.c
882
[00:06:24] compiling ../ruby/enumerator.c
883
[00:06:26] generating known_errors.inc
884
[00:06:26] known_errors.inc updated
885
[00:06:26] compiling ../ruby/file.c
886
[00:06:27] compiling ../ruby/inits.c
887
[00:06:28] compiling ../ruby/io.c
888
[00:06:28] generating node_name.inc
889
[00:06:29] compiling ../ruby/marshal.c
890
[00:06:31] compiling ../ruby/math.c
891
[00:06:33] making mjit_config.h
892
[00:06:33] generating mjit_compile.inc
893
[00:06:33] compiling ../ruby/node.c
894
[00:06:33] compiling ../ruby/numeric.c
895
[00:06:37] compiling ../ruby/pack.c
896
[00:06:37] generating parse.c
897
[00:06:38] copying lex.c
898
[00:06:38] compiling ../ruby/proc.c
899
[00:06:39] compiling ../ruby/process.c
900
[00:06:40] compiling ../ruby/random.c
901
[00:06:42] compiling ../ruby/range.c
902
[00:06:42] compiling ../ruby/rational.c
903
[00:06:44] compiling ../ruby/re.c
904
[00:06:46] compiling ../ruby/regcomp.c
905
[00:06:46] compiling ../ruby/regenc.c
906
[00:06:48] compiling ../ruby/regerror.c
907
[00:06:49] compiling ../ruby/regexec.c
908
[00:06:50] compiling ../ruby/regparse.c
909
[00:06:53] compiling ../ruby/regsyntax.c
910
[00:06:54] compiling ../ruby/ruby.c
911
[00:06:54] compiling ../ruby/safe.c
912
[00:06:55] compiling ../ruby/signal.c
913
[00:06:56] compiling ../ruby/sprintf.c
914
[00:06:57] compiling ../ruby/st.c
915
[00:06:59] compiling ../ruby/strftime.c
916
[00:06:59] compiling ../ruby/struct.c
917
[00:07:01] generating id.c
918
[00:07:01] id.c updated
919
[00:07:01] compiling ../ruby/thread.c
920
[00:07:02] compiling ../ruby/time.c
921
[00:07:05] compiling ../ruby/transcode.c
922
[00:07:05] compiling ../ruby/util.c
923
[00:07:07] compiling ../ruby/variable.c
924
[00:07:08] compiling ../ruby/version.c
925
[00:07:09] generating vm.inc
926
[00:07:09] generating vm_call_iseq_optimized.inc
927
[00:07:10] generating vmtc.inc
928
[00:07:10] compiling ../ruby/vm_backtrace.c
929
[00:07:10] compiling ../ruby/vm_dump.c
930
[00:07:12] compiling ../ruby/vm_trace.c
931
[00:07:12] generating enc/trans/newline.c ...
932
[00:07:12] converter for universal_newline
933
[00:07:12] converter for crlf_newline
934
[00:07:12] converter for cr_newline
935
[00:07:12] done.  (0.02user 0.02system 0.00elapsed)
936
[00:07:12] compiling ../ruby/missing/langinfo.c
937
[00:07:13] compiling ../ruby/missing/fileblocks.c
938
[00:07:13] compiling ../ruby/missing/crypt.c
939
[00:07:14] compiling ../ruby/missing/explicit_bzero.c
940
[00:07:14] compiling ../ruby/missing/ffs.c
941
[00:07:15] compiling ../ruby/missing/lgamma_r.c
942
[00:07:15] compiling ../ruby/missing/setproctitle.c
943
[00:07:15] compiling ../ruby/missing/strlcat.c
944
[00:07:15] compiling ../ruby/missing/strlcpy.c
945
[00:07:16] compiling ../ruby/missing/tgamma.c
946
[00:07:16] compiling ../ruby/dmyenc.c
947
[00:07:16] ../ruby/revision.h updated
948
[00:07:16] /usr/bin/mkdir -p ../ruby/enc/jis
949
[00:07:16] make : + cp ../ruby/enc/jis/props.h.blt ../ruby/enc/jis/props.h
950
[00:07:16] At line:1 char:1
951
[00:07:16] + make -j2 2>&1
952
[00:07:16] + ~~~~~~~~~~~~~
953
[00:07:16]     + CategoryInfo          : NotSpecified: (+ cp ../ruby/en...enc/jis/props.h:String) [], RemoteException
954
[00:07:16]     + FullyQualifiedErrorId : NativeCommandError
955
[00:07:16]  
956
[00:07:16] compiling ../ruby/dln.c
957
[00:07:17] compiling ../ruby/localeinit.c
958
[00:07:18] generating prelude.c
959
[00:07:18] prelude.c updated
960
[00:07:18] compiling miniprelude.c
961
[00:07:18] making dummy probes.h
962
[00:07:18] compiling ../ruby/compile.c
963
[00:07:18] compiling ../ruby/error.c
964
[00:07:20] compiling ../ruby/eval.c
965
[00:07:23] compiling ../ruby/gc.c
966
[00:07:26] compiling ../ruby/hash.c
967
[00:07:27] compiling ../ruby/iseq.c
968
[00:07:29] compiling ../ruby/load.c
969
[00:07:29] compiling ../ruby/mjit.c
970
[00:07:30] compiling ../ruby/mjit_compile.c
971
[00:07:31] compiling ../ruby/object.c
972
[00:07:33] compiling parse.c
973
[00:07:33] compiling ../ruby/string.c
974
[00:07:40] compiling ../ruby/symbol.c
975
[00:07:42] compiling ../ruby/vm.c
976
[00:07:42] compiling ../ruby/enc/ascii.c
977
[00:07:43] compiling ../ruby/enc/us_ascii.c
978
[00:07:45] compiling ../ruby/enc/unicode.c
979
[00:07:47] compiling ../ruby/enc/utf_8.c
980
[00:07:48] compiling enc/trans/newline.c
981
[00:07:49] compiling ../ruby/win32/win32.c
982
[00:07:50] compiling ../ruby/win32/file.c
983
[00:07:51] compiling prelude.c
984
[00:07:52] building rb_mjit_header.h
985
[00:07:54] rb_mjit_header.h updated
986
[00:07:54] compiling ../ruby/array.c
987
[00:07:59] linking miniruby.exe
988
[00:08:00] generating encdb.h
989
[00:08:00] ../ruby/tool/ifchange "--timestamp=.rbconfig.time" rbconfig.rb rbconfig.tmp
990
[00:08:00] rbconfig.rb updated
991
[00:08:00] building .ext/include/x64-mingw32/rb_mjit_min_header-2.6.0.h
992
[00:08:00] ./miniruby.exe -I../ruby/lib -I. -I.ext/common  ../ruby/tool/transform_mjit_header.rb "x86_64-w64-mingw32-gcc " rb_mjit_header.h .ext/include/x64-mingw32/rb_mjit_min_header-2.6.0.h
993
[00:08:01] encdb.h updated
994
[00:08:01] generating enc.mk
995
[00:08:01] creating verconf.h
996
[00:08:01] verconf.h updated
997
[00:08:01] generating x64-msvcrt-ruby260.rc
998
[00:08:01] making srcs under enc
999
[00:08:01] make[1]: Entering directory '/c/projects/ruby-loco/build'
1000
[00:08:01] generating table from enc/trans/big5.c
1001
[00:08:01] 
1002
[00:08:01] Skipped transforming external functions to static on Windows.
1003
[00:08:02] ln -sf ../../../.ext/include/x64-mingw32/rb_mjit_min_header-2.6.0.h include/ruby-2.6.0/x64-mingw32/rb_mjit_min_header-2.6.0.h
1004
[00:08:02] 
1005
[00:08:02] compiling ../ruby/loadpath.c
1006
[00:08:03] compiling x64-msvcrt-ruby260.res.o
1007
[00:08:05] linking static-library libx64-msvcrt-ruby260-static.a
1008
[00:08:06] generating enc/trans/big5.c ...
1009
[00:08:06] converter from Big5 to UTF-8
1010
[00:08:06] converter from UTF-8 to Big5
1011
[00:08:06] converter from CP950 to UTF-8
1012
[00:08:06] converter from UTF-8 to CP950
1013
[00:08:06] converter from Big5-HKSCS to UTF-8
1014
[00:08:06] converter from UTF-8 to Big5-HKSCS
1015
[00:08:06] converter from CP951 to UTF-8
1016
[00:08:06] converter from UTF-8 to CP951
1017
[00:08:06] converter from Big5-UAO to UTF-8
1018
[00:08:06] converter from UTF-8 to Big5-UAO
1019
[00:08:06] done.  (3.70user 0.06system 4.23elapsed)
1020
[00:08:06] generating table from enc/trans/chinese.c
1021
[00:08:07] generating enc/trans/chinese.c ...
1022
[00:08:07] load mapsrc ../ruby/enc/trans/GB/GB2312%UCS.src
1023
[00:08:07] converter from GB2312 to UTF-8
1024
[00:08:07] load mapsrc ../ruby/enc/trans/GB/GB12345%UCS.src
1025
[00:08:07] converter from GB12345 to UTF-8
1026
[00:08:07] load mapsrc ../ruby/enc/trans/GB/UCS%GB2312.src
1027
[00:08:07] converter from UTF-8 to GB2312
1028
[00:08:07] load mapsrc ../ruby/enc/trans/GB/UCS%GB12345.src
1029
[00:08:07] converter from UTF-8 to GB12345
1030
[00:08:07] done.  (0.86user 0.02system 1.40elapsed)
1031
[00:08:07] generating table from enc/trans/ebcdic.c
1032
[00:08:08] generating enc/trans/ebcdic.c ...
1033
[00:08:08] converter from IBM037 to ISO-8859-1
1034
[00:08:08] converter from ISO-8859-1 to IBM037
1035
[00:08:08] done.  (0.02user 0.05system 0.01elapsed)
1036
[00:08:08] generating table from enc/trans/emoji.c
1037
[00:08:08] generating enc/trans/emoji.c ...
1038
[00:08:08] converter from UTF8-DoCoMo to UTF8-KDDI
1039
[00:08:08] converter from UTF8-DoCoMo to UTF8-SoftBank
1040
[00:08:08] converter from UTF8-DoCoMo to UTF-8
1041
[00:08:08] converter from UTF8-KDDI to UTF8-DoCoMo
1042
[00:08:08] converter from UTF8-KDDI to UTF8-SoftBank
1043
[00:08:08] converter from UTF8-KDDI to UTF-8
1044
[00:08:08] converter from UTF8-SoftBank to UTF8-DoCoMo
1045
[00:08:08] converter from UTF8-SoftBank to UTF8-KDDI
1046
[00:08:08] converter from UTF8-SoftBank to UTF-8
1047
[00:08:08] converter from UTF-8 to UTF8-DoCoMo
1048
[00:08:08] converter from UTF-8 to UTF8-KDDI
1049
[00:08:08] converter from UTF-8 to UTF8-SoftBank
1050
[00:08:08] done.  (0.23user 0.03system 0.41elapsed)
1051
[00:08:08] generating table from enc/trans/emoji_iso2022_kddi.c
1052
[00:08:09] generating x64-msvcrt-ruby260.def
1053
[00:08:09] linking shared-library x64-msvcrt-ruby260.dll
1054
[00:08:09] generating enc/trans/emoji_iso2022_kddi.c ...
1055
[00:08:09] converter for iso2022jp_kddi_decoder
1056
[00:08:09] converter for iso2022jp_kddi_decoder_jisx0208_rest
1057
[00:08:09] converter for iso2022jp_kddi_encoder
1058
[00:08:09] load mapsrc ../ruby/enc/trans/EMOJI/EMOJI_ISO-2022-JP-KDDI%UCS.src
1059
[00:08:09] load mapsrc ../ruby/enc/trans/JIS/JISX0208VDC@NEC%UCS.src
1060
[00:08:09] load mapsrc ../ruby/enc/trans/CP/CP932VDC@NEC_IBM%UCS.src
1061
[00:08:09] load mapsrc ../ruby/enc/trans/CP/CP932VDC@IBM%UCS.src
1062
[00:08:09] load mapsrc ../ruby/enc/trans/JIS/JISX0208@MS%UCS.src
1063
[00:08:09] converter from stateless-ISO-2022-JP-KDDI to UTF8-KDDI
1064
[00:08:09] load mapsrc ../ruby/enc/trans/EMOJI/UCS%EMOJI_ISO-2022-JP-KDDI.src
1065
[00:08:09] load mapsrc ../ruby/enc/trans/EMOJI/UCS%EMOJI_ISO-2022-JP-KDDI-UNDOC.src
1066
[00:08:09] load mapsrc ../ruby/enc/trans/JIS/UCS%JISX0208VDC@NEC.src
1067
[00:08:09] load mapsrc ../ruby/enc/trans/CP/UCS%CP932VDC@NEC_IBM.src
1068
[00:08:09] load mapsrc ../ruby/enc/trans/CP/UCS%CP932VDC@IBM.src
1069
[00:08:09] load mapsrc ../ruby/enc/trans/JIS/UCS%JISX0208@MS.src
1070
[00:08:09] converter from UTF8-KDDI to stateless-ISO-2022-JP-KDDI
1071
[00:08:09] done.  (0.45user 0.06system 1.14elapsed)
1072
[00:08:09] generating table from enc/trans/emoji_sjis_docomo.c
1073
[00:08:10] generating table from enc/trans/emoji_sjis_kddi.c
1074
[00:08:10] generating enc/trans/emoji_sjis_docomo.c ...
1075
[00:08:10] load mapsrc ../ruby/enc/trans/JIS/JISX0201-KANA%UCS.src
1076
[00:08:10] load mapsrc ../ruby/enc/trans/EMOJI/EMOJI_SHIFT_JIS-DOCOMO%UCS.src
1077
[00:08:10] load mapsrc ../ruby/enc/trans/JIS/JISX0208VDC@NEC%UCS.src
1078
[00:08:10] load mapsrc ../ruby/enc/trans/CP/CP932VDC@NEC_IBM%UCS.src
1079
[00:08:10] load mapsrc ../ruby/enc/trans/CP/CP932VDC@IBM%UCS.src
1080
[00:08:10] load mapsrc ../ruby/enc/trans/CP/CP932UDA%UCS.src
1081
[00:08:10] load mapsrc ../ruby/enc/trans/JIS/JISX0208@MS%UCS.src
1082
[00:08:10] converter from SJIS-DOCOMO to UTF8-DOCOMO
1083
[00:08:10] load mapsrc ../ruby/enc/trans/JIS/UCS%JISX0201-KANA.src
1084
[00:08:10] load mapsrc ../ruby/enc/trans/EMOJI/UCS%EMOJI_SHIFT_JIS-DOCOMO.src
1085
[00:08:10] load mapsrc ../ruby/enc/trans/JIS/UCS%JISX0208VDC@NEC.src
1086
[00:08:10] load mapsrc ../ruby/enc/trans/CP/UCS%CP932VDC@NEC_IBM.src
1087
[00:08:10] load mapsrc ../ruby/enc/trans/CP/UCS%CP932VDC@IBM.src
1088
[00:08:10] load mapsrc ../ruby/enc/trans/CP/UCS%CP932UDA.src
1089
[00:08:10] load mapsrc ../ruby/enc/trans/JIS/UCS%JISX0208@MS.src
1090
[00:08:10] converter from UTF8-DOCOMO to SJIS-DOCOMO
1091
[00:08:10] done.  (0.48user 0.08system 0.86elapsed)
1092
[00:08:10] making enc
1093
[00:08:10] make[1]: Entering directory '/c/projects/ruby-loco/build'
1094
[00:08:10] compiling ../ruby/enc/encdb.c
1095
[00:08:11] generating enc/trans/emoji_sjis_kddi.c ...
1096
[00:08:11] load mapsrc ../ruby/enc/trans/JIS/JISX0201-KANA%UCS.src
1097
[00:08:11] load mapsrc ../ruby/enc/trans/EMOJI/EMOJI_SHIFT_JIS-KDDI%UCS.src
1098
[00:08:11] load mapsrc ../ruby/enc/trans/JIS/JISX0208VDC@NEC%UCS.src
1099
[00:08:11] load mapsrc ../ruby/enc/trans/CP/CP932VDC@NEC_IBM%UCS.src
1100
[00:08:11] load mapsrc ../ruby/enc/trans/CP/CP932VDC@IBM%UCS.src
1101
[00:08:11] load mapsrc ../ruby/enc/trans/CP/CP932UDA%UCS.src
1102
[00:08:11] load mapsrc ../ruby/enc/trans/JIS/JISX0208@MS%UCS.src
1103
[00:08:11] converter from SJIS-KDDI to UTF8-KDDI
1104
[00:08:11] load mapsrc ../ruby/enc/trans/JIS/UCS%JISX0201-KANA.src
1105
[00:08:11] load mapsrc ../ruby/enc/trans/EMOJI/UCS%EMOJI_SHIFT_JIS-KDDI.src
1106
[00:08:11] load mapsrc ../ruby/enc/trans/EMOJI/UCS%EMOJI_SHIFT_JIS-KDDI-UNDOC.src
1107
[00:08:11] load mapsrc ../ruby/enc/trans/JIS/UCS%JISX0208VDC@NEC.src
1108
[00:08:11] load mapsrc ../ruby/enc/trans/CP/UCS%CP932VDC@NEC_IBM.src
1109
[00:08:11] load mapsrc ../ruby/enc/trans/CP/UCS%CP932VDC@IBM.src
1110
[00:08:11] load mapsrc ../ruby/enc/trans/CP/UCS%CP932UDA.src
1111
[00:08:11] load mapsrc ../ruby/enc/trans/JIS/UCS%JISX0208@MS.src
1112
[00:08:11] converter from UTF8-KDDI to SJIS-KDDI
1113
[00:08:11] done.  (0.56user 0.03system 0.54elapsed)
1114
[00:08:11] generating table from enc/trans/emoji_sjis_softbank.c
1115
[00:08:11] generating enc/trans/emoji_sjis_softbank.c ...
1116
[00:08:11] load mapsrc ../ruby/enc/trans/JIS/JISX0201-KANA%UCS.src
1117
[00:08:11] load mapsrc ../ruby/enc/trans/EMOJI/EMOJI_SHIFT_JIS-SOFTBANK%UCS.src
1118
[00:08:11] load mapsrc ../ruby/enc/trans/JIS/JISX0208VDC@NEC%UCS.src
1119
[00:08:11] load mapsrc ../ruby/enc/trans/CP/CP932VDC@NEC_IBM%UCS.src
1120
[00:08:11] load mapsrc ../ruby/enc/trans/CP/CP932VDC@IBM%UCS.src
1121
[00:08:11] load mapsrc ../ruby/enc/trans/CP/CP932UDA%UCS.src
1122
[00:08:11] load mapsrc ../ruby/enc/trans/JIS/JISX0208@MS%UCS.src
1123
[00:08:11] converter from SJIS-SoftBank to UTF8-SoftBank
1124
[00:08:11] load mapsrc ../ruby/enc/trans/JIS/UCS%JISX0201-KANA.src
1125
[00:08:11] load mapsrc ../ruby/enc/trans/EMOJI/UCS%EMOJI_SHIFT_JIS-SOFTBANK.src
1126
[00:08:11] load mapsrc ../ruby/enc/trans/JIS/UCS%JISX0208VDC@NEC.src
1127
[00:08:11] load mapsrc ../ruby/enc/trans/CP/UCS%CP932VDC@NEC_IBM.src
1128
[00:08:11] load mapsrc ../ruby/enc/trans/CP/UCS%CP932VDC@IBM.src
1129
[00:08:11] load mapsrc ../ruby/enc/trans/CP/UCS%CP932UDA.src
1130
[00:08:11] load mapsrc ../ruby/enc/trans/JIS/UCS%JISX0208@MS.src
1131
[00:08:11] converter from UTF8-SoftBank to SJIS-SoftBank
1132
[00:08:11] done.  (0.47user 0.09system 0.54elapsed)
1133
[00:08:11] generating table from enc/trans/escape.c
1134
[00:08:11] generating enc/trans/escape.c ...
1135
[00:08:11] converter for amp_escape
1136
[00:08:11] converter for xml_text_escape
1137
[00:08:11] converter for xml_attr_content_escape
1138
[00:08:11] converter for escape_xml_attr_quote
1139
[00:08:11] done.  (0.03user 0.03system 0.01elapsed)
1140
[00:08:11] generating table from enc/trans/gb18030.c
1141
[00:08:12] compiling ../ruby/enc/big5.c
1142
[00:08:13] compiling ../ruby/enc/cp949.c
1143
[00:08:14] compiling ../ruby/enc/emacs_mule.c
1144
[00:08:14] generating enc/trans/gb18030.c ...
1145
[00:08:14] converter from GB18030 to UTF-8
1146
[00:08:14] converter from UTF-8 to GB18030
1147
[00:08:14] done.  (2.95user 0.08system 3.00elapsed)
1148
[00:08:14] generating table from enc/trans/gbk.c
1149
[00:08:15] compiling ../ruby/enc/euc_jp.c
1150
[00:08:15] generating enc/trans/gbk.c ...
1151
[00:08:15] converter from GBK to UTF-8
1152
[00:08:15] converter from UTF-8 to GBK
1153
[00:08:15] done.  (0.78user 0.08system 0.83elapsed)
1154
[00:08:15] generating table from enc/trans/iso2022.c
1155
[00:08:16] generating enc/trans/iso2022.c ...
1156
[00:08:16] converter for iso2022jp_decoder
1157
[00:08:16] converter for iso2022jp_decoder_jisx0208_rest
1158
[00:08:16] converter for iso2022jp_encoder
1159
[00:08:16] converter for stateless_iso2022jp_to_eucjp
1160
[00:08:16] converter for eucjp_to_stateless_iso2022jp
1161
[00:08:16] converter for cp50221_decoder
1162
[00:08:16] converter for cp50221_encoder
1163
[00:08:16] done.  (0.08user 0.02system 0.02elapsed)
1164
[00:08:16] generating table from enc/trans/japanese.c
1165
[00:08:16] generating enc/trans/japanese.c ...
1166
[00:08:16] converter for eucjp2sjis
1167
[00:08:16] converter for sjis2eucjp
1168
[00:08:16] done.  (0.08user 0.00system 0.01elapsed)
1169
[00:08:16] generating table from enc/trans/japanese_euc.c
1170
[00:08:17] compiling ../ruby/enc/euc_kr.c
1171
[00:08:18] compiling ../ruby/enc/euc_tw.c
1172
[00:08:19] generating enc/trans/japanese_euc.c ...
1173
[00:08:19] load mapsrc ../ruby/enc/trans/JIS/JISX0208@1990%UCS.src
1174
[00:08:19] load mapsrc ../ruby/enc/trans/JIS/JISX0201-KANA%UCS.src
1175
[00:08:19] load mapsrc ../ruby/enc/trans/JIS/JISX0212%UCS.src
1176
[00:08:19] converter from EUC-JP to UTF-8
1177
[00:08:19] load mapsrc ../ruby/enc/trans/JIS/JISX0208VDC@NEC%UCS.src
1178
[00:08:19] load mapsrc ../ruby/enc/trans/JIS/JISX0208UDC%UCS.src
1179
[00:08:19] load mapsrc ../ruby/enc/trans/JIS/JISX0208@MS%UCS.src
1180
[00:08:19] load mapsrc ../ruby/enc/trans/JIS/JISX0201-KANA%UCS.src
1181
[00:08:19] load mapsrc ../ruby/enc/trans/JIS/JISX0212VDC@IBM%UCS.src
1182
[00:08:19] load mapsrc ../ruby/enc/trans/JIS/JISX0212UDC%UCS.src
1183
[00:08:19] load mapsrc ../ruby/enc/trans/JIS/JISX0212@MS%UCS.src
1184
[00:08:19] converter from eucJP-ms to UTF-8
1185
[00:08:19] load mapsrc ../ruby/enc/trans/JIS/JISX0208VDC@NEC%UCS.src
1186
[00:08:19] load mapsrc ../ruby/enc/trans/CP/CP932VDC@NEC_IBM%UCS.src
1187
[00:08:19] load mapsrc ../ruby/enc/trans/JIS/JISX0208@MS%UCS.src
1188
[00:08:19] load mapsrc ../ruby/enc/trans/JIS/JISX0201-KANA%UCS.src
1189
[00:08:19] converter from CP51932 to UTF-8
1190
[00:08:19] load mapsrc ../ruby/enc/trans/JIS/JISX0208@1990%UCS.src
1191
[00:08:19] load mapsrc ../ruby/enc/trans/JIS/JISX0213-1%UCS@BMP.src
1192
[00:08:19] load mapsrc ../ruby/enc/trans/JIS/JISX0213-1%UCS@SIP.src
1193
[00:08:19] load mapsrc ../ruby/enc/trans/JIS/JISX0201-KANA%UCS.src
1194
[00:08:19] load mapsrc ../ruby/enc/trans/JIS/JISX0213-2%UCS@BMP.src
1195
[00:08:19] load mapsrc ../ruby/enc/trans/JIS/JISX0213-2%UCS@SIP.src
1196
[00:08:19] converter from EUC-JIS-2004 to UTF-8
1197
[00:08:19] load mapsrc ../ruby/enc/trans/JIS/UCS%JISX0208@1990.src
1198
[00:08:19] load mapsrc ../ruby/enc/trans/JIS/UCS%JISX0201-KANA.src
1199
[00:08:19] load mapsrc ../ruby/enc/trans/JIS/UCS%JISX0212.src
1200
[00:08:19] converter from UTF-8 to EUC-JP
1201
[00:08:19] load mapsrc ../ruby/enc/trans/JIS/UCS%JISX0208@MS.src
1202
[00:08:19] load mapsrc ../ruby/enc/trans/JIS/UCS%JISX0208VDC@NEC.src
1203
[00:08:19] load mapsrc ../ruby/enc/trans/JIS/UCS%JISX0208UDC.src
1204
[00:08:19] load mapsrc ../ruby/enc/trans/JIS/UCS%JISX0201-KANA.src
1205
[00:08:19] load mapsrc ../ruby/enc/trans/JIS/UCS%JISX0212VDC@IBM.src
1206
[00:08:19] load mapsrc ../ruby/enc/trans/JIS/UCS%JISX0212UDC.src
1207
[00:08:19] load mapsrc ../ruby/enc/trans/JIS/UCS%JISX0212@MS.src
1208
[00:08:19] converter from UTF-8 to eucJP-ms
1209
[00:08:19] load mapsrc ../ruby/enc/trans/JIS/UCS%JISX0208@MS.src
1210
[00:08:19] load mapsrc ../ruby/enc/trans/JIS/UCS%JISX0208VDC@NEC.src
1211
[00:08:19] load mapsrc ../ruby/enc/trans/CP/UCS%CP932VDC@NEC_IBM.src
1212
[00:08:19] load mapsrc ../ruby/enc/trans/JIS/UCS%JISX0201-KANA.src
1213
[00:08:19] converter from UTF-8 to CP51932
1214
[00:08:19] load mapsrc ../ruby/enc/trans/JIS/UCS%JISX0208@1990.src
1215
[00:08:19] load mapsrc ../ruby/enc/trans/JIS/UCS@BMP%JISX0213-1.src
1216
[00:08:19] load mapsrc ../ruby/enc/trans/JIS/UCS@SIP%JISX0213-1.src
1217
[00:08:19] load mapsrc ../ruby/enc/trans/JIS/UCS%JISX0201-KANA.src
1218
[00:08:19] load mapsrc ../ruby/enc/trans/JIS/UCS@BMP%JISX0213-2.src
1219
[00:08:19] load mapsrc ../ruby/enc/trans/JIS/UCS@SIP%JISX0213-2.src
1220
[00:08:19] converter from UTF-8 to EUC-JIS-2004
1221
[00:08:19] done.  (2.67user 0.08system 2.91elapsed)
1222
[00:08:19] generating table from enc/trans/japanese_sjis.c
1223
[00:08:19] compiling ../ruby/enc/gb2312.c
1224
[00:08:20] generating enc/trans/japanese_sjis.c ...
1225
[00:08:20] load mapsrc ../ruby/enc/trans/JIS/JISX0201-KANA%UCS.src
1226
[00:08:20] load mapsrc ../ruby/enc/trans/JIS/JISX0208@1990%UCS.src
1227
[00:08:20] converter from Shift_JIS to UTF-8
1228
[00:08:20] load mapsrc ../ruby/enc/trans/JIS/JISX0201-KANA%UCS.src
1229
[00:08:20] load mapsrc ../ruby/enc/trans/JIS/JISX0208VDC@NEC%UCS.src
1230
[00:08:20] load mapsrc ../ruby/enc/trans/CP/CP932VDC@NEC_IBM%UCS.src
1231
[00:08:20] load mapsrc ../ruby/enc/trans/CP/CP932VDC@IBM%UCS.src
1232
[00:08:20] load mapsrc ../ruby/enc/trans/CP/CP932UDA%UCS.src
1233
[00:08:20] load mapsrc ../ruby/enc/trans/JIS/JISX0208@MS%UCS.src
1234
[00:08:20] converter from Windows-31J to UTF-8
1235
[00:08:20] load mapsrc ../ruby/enc/trans/JIS/UCS%JISX0201-KANA.src
1236
[00:08:20] load mapsrc ../ruby/enc/trans/JIS/UCS%JISX0208@1990.src
1237
[00:08:20] converter from UTF-8 to Shift_JIS
1238
[00:08:20] load mapsrc ../ruby/enc/trans/JIS/UCS%JISX0201-KANA.src
1239
[00:08:20] load mapsrc ../ruby/enc/trans/JIS/UCS%JISX0208@MS.src
1240
[00:08:20] load mapsrc ../ruby/enc/trans/JIS/UCS%JISX0208VDC@NEC.src
1241
[00:08:20] load mapsrc ../ruby/enc/trans/CP/UCS%CP932VDC@IBM.src
1242
[00:08:20] load mapsrc ../ruby/enc/trans/CP/UCS%CP932VDC@NEC_IBM.src
1243
[00:08:20] load mapsrc ../ruby/enc/trans/CP/UCS%CP932UDA.src
1244
[00:08:20] converter from UTF-8 to Windows-31J
1245
[00:08:20] done.  (1.06user 0.05system 1.06elapsed)
1246
[00:08:20] generating table from enc/trans/korean.c
1247
[00:08:21] compiling ../ruby/enc/gb18030.c
1248
[00:08:22] compiling ../ruby/enc/gbk.c
1249
[00:08:22] generating enc/trans/korean.c ...
1250
[00:08:22] converter from UTF-8 to EUC-KR
1251
[00:08:22] converter from EUC-KR to UTF-8
1252
[00:08:22] converter from UTF-8 to CP949
1253
[00:08:22] converter from CP949 to UTF-8
1254
[00:08:22] done.  (1.02user 0.06system 1.09elapsed)
1255
[00:08:22] generating table from enc/trans/single_byte.c
1256
[00:08:22] generating enc/trans/single_byte.c ...
1257
[00:08:22] converter from US-ASCII to UTF-8
1258
[00:08:22] converter from UTF-8 to US-ASCII
1259
[00:08:22] converter from ASCII-8BIT to UTF-8
1260
[00:08:22] converter from UTF-8 to ASCII-8BIT
1261
[00:08:22] converter from ISO-8859-1 to UTF-8
1262
[00:08:22] converter from UTF-8 to ISO-8859-1
1263
[00:08:22] converter from ISO-8859-2 to UTF-8
1264
[00:08:22] converter from UTF-8 to ISO-8859-2
1265
[00:08:22] converter from ISO-8859-3 to UTF-8
1266
[00:08:22] converter from UTF-8 to ISO-8859-3
1267
[00:08:22] converter from ISO-8859-4 to UTF-8
1268
[00:08:22] converter from UTF-8 to ISO-8859-4
1269
[00:08:22] converter from ISO-8859-5 to UTF-8
1270
[00:08:22] converter from UTF-8 to ISO-8859-5
1271
[00:08:22] converter from ISO-8859-6 to UTF-8
1272
[00:08:22] converter from UTF-8 to ISO-8859-6
1273
[00:08:22] converter from ISO-8859-7 to UTF-8
1274
[00:08:22] converter from UTF-8 to ISO-8859-7
1275
[00:08:22] converter from ISO-8859-8 to UTF-8
1276
[00:08:22] converter from UTF-8 to ISO-8859-8
1277
[00:08:22] converter from ISO-8859-9 to UTF-8
1278
[00:08:22] converter from UTF-8 to ISO-8859-9
1279
[00:08:22] converter from ISO-8859-10 to UTF-8
1280
[00:08:22] converter from UTF-8 to ISO-8859-10
1281
[00:08:22] converter from ISO-8859-11 to UTF-8
1282
[00:08:22] converter from UTF-8 to ISO-8859-11
1283
[00:08:22] converter from ISO-8859-13 to UTF-8
1284
[00:08:22] converter from UTF-8 to ISO-8859-13
1285
[00:08:22] converter from ISO-8859-14 to UTF-8
1286
[00:08:22] converter from UTF-8 to ISO-8859-14
1287
[00:08:22] converter from ISO-8859-15 to UTF-8
1288
[00:08:22] converter from UTF-8 to ISO-8859-15
1289
[00:08:22] converter from ISO-8859-16 to UTF-8
1290
[00:08:22] converter from UTF-8 to ISO-8859-16
1291
[00:08:22] converter from WINDOWS-874 to UTF-8
1292
[00:08:22] converter from UTF-8 to WINDOWS-874
1293
[00:08:22] converter from WINDOWS-1250 to UTF-8
1294
[00:08:22] converter from UTF-8 to WINDOWS-1250
1295
[00:08:22] converter from WINDOWS-1251 to UTF-8
1296
[00:08:22] converter from UTF-8 to WINDOWS-1251
1297
[00:08:22] converter from WINDOWS-1252 to UTF-8
1298
[00:08:22] converter from UTF-8 to WINDOWS-1252
1299
[00:08:22] converter from WINDOWS-1253 to UTF-8
1300
[00:08:22] converter from UTF-8 to WINDOWS-1253
1301
[00:08:22] converter from WINDOWS-1254 to UTF-8
1302
[00:08:22] converter from UTF-8 to WINDOWS-1254
1303
[00:08:22] converter from WINDOWS-1255 to UTF-8
1304
[00:08:22] converter from UTF-8 to WINDOWS-1255
1305
[00:08:22] converter from WINDOWS-1256 to UTF-8
1306
[00:08:22] converter from UTF-8 to WINDOWS-1256
1307
[00:08:22] converter from WINDOWS-1257 to UTF-8
1308
[00:08:22] converter from UTF-8 to WINDOWS-1257
1309
[00:08:22] converter from IBM437 to UTF-8
1310
[00:08:22] converter from UTF-8 to IBM437
1311
[00:08:22] converter from IBM775 to UTF-8
1312
[00:08:22] converter from UTF-8 to IBM775
1313
[00:08:22] converter from IBM737 to UTF-8
1314
[00:08:22] converter from UTF-8 to IBM737
1315
[00:08:22] converter from IBM852 to UTF-8
1316
[00:08:22] converter from UTF-8 to IBM852
1317
[00:08:22] converter from IBM855 to UTF-8
1318
[00:08:22] converter from UTF-8 to IBM855
1319
[00:08:22] converter from IBM857 to UTF-8
1320
[00:08:22] converter from UTF-8 to IBM857
1321
[00:08:22] converter from IBM860 to UTF-8
1322
[00:08:22] converter from UTF-8 to IBM860
1323
[00:08:22] converter from IBM861 to UTF-8
1324
[00:08:22] converter from UTF-8 to IBM861
1325
[00:08:22] converter from IBM862 to UTF-8
1326
[00:08:22] converter from UTF-8 to IBM862
1327
[00:08:22] converter from IBM863 to UTF-8
1328
[00:08:22] converter from UTF-8 to IBM863
1329
[00:08:22] converter from IBM865 to UTF-8
1330
[00:08:22] converter from UTF-8 to IBM865
1331
[00:08:22] converter from IBM866 to UTF-8
1332
[00:08:22] converter from UTF-8 to IBM866
1333
[00:08:22] converter from IBM869 to UTF-8
1334
[00:08:22] converter from UTF-8 to IBM869
1335
[00:08:22] converter from MACCROATIAN to UTF-8
1336
[00:08:22] converter from UTF-8 to MACCROATIAN
1337
[00:08:22] converter from MACCYRILLIC to UTF-8
1338
[00:08:22] converter from UTF-8 to MACCYRILLIC
1339
[00:08:22] converter from MACGREEK to UTF-8
1340
[00:08:22] converter from UTF-8 to MACGREEK
1341
[00:08:22] converter from MACICELAND to UTF-8
1342
[00:08:22] converter from UTF-8 to MACICELAND
1343
[00:08:22] converter from MACROMAN to UTF-8
1344
[00:08:22] converter from UTF-8 to MACROMAN
1345
[00:08:22] converter from MACROMANIA to UTF-8
1346
[00:08:22] converter from UTF-8 to MACROMANIA
1347
[00:08:22] converter from MACTURKISH to UTF-8
1348
[00:08:22] converter from UTF-8 to MACTURKISH
1349
[00:08:22] converter from MACUKRAINE to UTF-8
1350
[00:08:22] converter from UTF-8 to MACUKRAINE
1351
[00:08:22] converter from KOI8-U to UTF-8
1352
[00:08:22] converter from UTF-8 to KOI8-U
1353
[00:08:22] converter from KOI8-R to UTF-8
1354
[00:08:22] converter from UTF-8 to KOI8-R
1355
[00:08:22] converter from TIS-620 to UTF-8
1356
[00:08:22] converter from UTF-8 to TIS-620
1357
[00:08:22] converter from CP850 to UTF-8
1358
[00:08:22] converter from UTF-8 to CP850
1359
[00:08:22] converter from CP852 to UTF-8
1360
[00:08:22] converter from UTF-8 to CP852
1361
[00:08:22] converter from CP855 to UTF-8
1362
[00:08:22] converter from UTF-8 to CP855
1363
[00:08:22] done.  (0.42user 0.06system 0.43elapsed)
1364
[00:08:22] generating table from enc/trans/utf8_mac.c
1365
[00:08:23] compiling ../ruby/enc/iso_8859_1.c
1366
[00:08:24] generating enc/trans/utf8_mac.c ...
1367
[00:08:24] converter from UTF-8 to UTF8-MAC
1368
[00:08:24] converter for from_UTF8_MAC
1369
[00:08:24] converter for from_utf8_mac_nfc2
1370
[00:08:24] done.  (1.17user 0.06system 1.52elapsed)
1371
[00:08:24] generating table from enc/trans/utf_16_32.c
1372
[00:08:24] generating enc/trans/utf_16_32.c ...
1373
[00:08:24] converter for from_UTF_16LE
1374
[00:08:24] converter for from_UTF_32LE
1375
[00:08:24] converter for from_UTF_16BE
1376
[00:08:24] converter for from_UTF_32BE
1377
[00:08:24] converter for from_UTF_16
1378
[00:08:24] converter for from_UTF_32
1379
[00:08:24] converter for from_UTF_8
1380
[00:08:24] done.  (0.06user 0.02system 0.02elapsed)
1381
[00:08:24] make[1]: Leaving directory '/c/projects/ruby-loco/build'
1382
[00:08:24] generating transdb.h
1383
[00:08:24] compiling ../ruby/enc/iso_8859_2.c
1384
[00:08:24] transdb.h updated
1385
[00:08:24] generating makefiles ext/configure-ext.mk
1386
[00:08:25] ext/configure-ext.mk updated
1387
[00:08:25] making trans
1388
[00:08:25] make[1]: Entering directory '/c/projects/ruby-loco/build'
1389
[00:08:25] compiling ../ruby/enc/trans/transdb.c
1390
[00:08:25] generating table from ../ruby/enc/trans/big5.c
1391
[00:08:26] compiling ../ruby/enc/iso_8859_3.c
1392
[00:08:27] compiling ../ruby/enc/iso_8859_4.c
1393
[00:08:28] compiling ../ruby/enc/iso_8859_5.c
1394
[00:08:29] generating ../ruby/enc/trans/big5.c ...
1395
[00:08:29] converter from Big5 to UTF-8
1396
[00:08:29] converter from UTF-8 to Big5
1397
[00:08:29] converter from CP950 to UTF-8
1398
[00:08:29] converter from UTF-8 to CP950
1399
[00:08:29] converter from Big5-HKSCS to UTF-8
1400
[00:08:29] converter from UTF-8 to Big5-HKSCS
1401
[00:08:29] converter from CP951 to UTF-8
1402
[00:08:29] converter from UTF-8 to CP951
1403
[00:08:29] converter from Big5-UAO to UTF-8
1404
[00:08:29] converter from UTF-8 to Big5-UAO
1405
[00:08:29] done.  (3.75user 0.11system 3.81elapsed)
1406
[00:08:29] generating table from ../ruby/enc/trans/chinese.c
1407
[00:08:30] compiling ../ruby/enc/iso_8859_6.c
1408
[00:08:30] generating ../ruby/enc/trans/chinese.c ...
1409
[00:08:30] load mapsrc ../ruby/enc/trans/GB/GB2312%UCS.src
1410
[00:08:30] converter from GB2312 to UTF-8
1411
[00:08:30] load mapsrc ../ruby/enc/trans/GB/GB12345%UCS.src
1412
[00:08:30] converter from GB12345 to UTF-8
1413
[00:08:30] load mapsrc ../ruby/enc/trans/GB/UCS%GB2312.src
1414
[00:08:30] converter from UTF-8 to GB2312
1415
[00:08:30] load mapsrc ../ruby/enc/trans/GB/UCS%GB12345.src
1416
[00:08:30] converter from UTF-8 to GB12345
1417
[00:08:30] done.  (0.78user 0.03system 0.75elapsed)
1418
[00:08:30] generating table from ../ruby/enc/trans/ebcdic.c
1419
[00:08:30] generating ../ruby/enc/trans/ebcdic.c ...
1420
[00:08:30] converter from IBM037 to ISO-8859-1
1421
[00:08:30] converter from ISO-8859-1 to IBM037
1422
[00:08:30] done.  (0.06user 0.02system 0.01elapsed)
1423
[00:08:30] generating table from ../ruby/enc/trans/emoji.c
1424
[00:08:30] generating ../ruby/enc/trans/emoji.c ...
1425
[00:08:30] converter from UTF8-DoCoMo to UTF8-KDDI
1426
[00:08:30] converter from UTF8-DoCoMo to UTF8-SoftBank
1427
[00:08:30] converter from UTF8-DoCoMo to UTF-8
1428
[00:08:30] converter from UTF8-KDDI to UTF8-DoCoMo
1429
[00:08:30] converter from UTF8-KDDI to UTF8-SoftBank
1430
[00:08:30] converter from UTF8-KDDI to UTF-8
1431
[00:08:30] converter from UTF8-SoftBank to UTF8-DoCoMo
1432
[00:08:30] converter from UTF8-SoftBank to UTF8-KDDI
1433
[00:08:30] converter from UTF8-SoftBank to UTF-8
1434
[00:08:30] converter from UTF-8 to UTF8-DoCoMo
1435
[00:08:30] converter from UTF-8 to UTF8-KDDI
1436
[00:08:30] converter from UTF-8 to UTF8-SoftBank
1437
[00:08:30] done.  (0.20user 0.06system 0.20elapsed)
1438
[00:08:30] generating table from ../ruby/enc/trans/emoji_iso2022_kddi.c
1439
[00:08:31] compiling ../ruby/enc/iso_8859_7.c
1440
[00:08:31] generating ../ruby/enc/trans/emoji_iso2022_kddi.c ...
1441
[00:08:31] converter for iso2022jp_kddi_decoder
1442
[00:08:31] converter for iso2022jp_kddi_decoder_jisx0208_rest
1443
[00:08:31] converter for iso2022jp_kddi_encoder
1444
[00:08:31] load mapsrc ../ruby/enc/trans/EMOJI/EMOJI_ISO-2022-JP-KDDI%UCS.src
1445
[00:08:31] load mapsrc ../ruby/enc/trans/JIS/JISX0208VDC@NEC%UCS.src
1446
[00:08:31] load mapsrc ../ruby/enc/trans/CP/CP932VDC@NEC_IBM%UCS.src
1447
[00:08:31] load mapsrc ../ruby/enc/trans/CP/CP932VDC@IBM%UCS.src
1448
[00:08:31] load mapsrc ../ruby/enc/trans/JIS/JISX0208@MS%UCS.src
1449
[00:08:31] converter from stateless-ISO-2022-JP-KDDI to UTF8-KDDI
1450
[00:08:31] load mapsrc ../ruby/enc/trans/EMOJI/UCS%EMOJI_ISO-2022-JP-KDDI.src
1451
[00:08:31] load mapsrc ../ruby/enc/trans/EMOJI/UCS%EMOJI_ISO-2022-JP-KDDI-UNDOC.src
1452
[00:08:31] load mapsrc ../ruby/enc/trans/JIS/UCS%JISX0208VDC@NEC.src
1453
[00:08:31] load mapsrc ../ruby/enc/trans/CP/UCS%CP932VDC@NEC_IBM.src
1454
[00:08:31] load mapsrc ../ruby/enc/trans/CP/UCS%CP932VDC@IBM.src
1455
[00:08:31] load mapsrc ../ruby/enc/trans/JIS/UCS%JISX0208@MS.src
1456
[00:08:31] converter from UTF8-KDDI to stateless-ISO-2022-JP-KDDI
1457
[00:08:31] done.  (0.48user 0.03system 0.45elapsed)
1458
[00:08:31] generating table from ../ruby/enc/trans/emoji_sjis_docomo.c
1459
[00:08:31] generating ../ruby/enc/trans/emoji_sjis_docomo.c ...
1460
[00:08:31] load mapsrc ../ruby/enc/trans/JIS/JISX0201-KANA%UCS.src
1461
[00:08:31] load mapsrc ../ruby/enc/trans/EMOJI/EMOJI_SHIFT_JIS-DOCOMO%UCS.src
1462
[00:08:31] load mapsrc ../ruby/enc/trans/JIS/JISX0208VDC@NEC%UCS.src
1463
[00:08:31] load mapsrc ../ruby/enc/trans/CP/CP932VDC@NEC_IBM%UCS.src
1464
[00:08:31] load mapsrc ../ruby/enc/trans/CP/CP932VDC@IBM%UCS.src
1465
[00:08:31] load mapsrc ../ruby/enc/trans/CP/CP932UDA%UCS.src
1466
[00:08:31] load mapsrc ../ruby/enc/trans/JIS/JISX0208@MS%UCS.src
1467
[00:08:31] converter from SJIS-DOCOMO to UTF8-DOCOMO
1468
[00:08:31] load mapsrc ../ruby/enc/trans/JIS/UCS%JISX0201-KANA.src
1469
[00:08:31] load mapsrc ../ruby/enc/trans/EMOJI/UCS%EMOJI_SHIFT_JIS-DOCOMO.src
1470
[00:08:31] load mapsrc ../ruby/enc/trans/JIS/UCS%JISX0208VDC@NEC.src
1471
[00:08:31] load mapsrc ../ruby/enc/trans/CP/UCS%CP932VDC@NEC_IBM.src
1472
[00:08:31] load mapsrc ../ruby/enc/trans/CP/UCS%CP932VDC@IBM.src
1473
[00:08:31] load mapsrc ../ruby/enc/trans/CP/UCS%CP932UDA.src
1474
[00:08:31] load mapsrc ../ruby/enc/trans/JIS/UCS%JISX0208@MS.src
1475
[00:08:31] converter from UTF8-DOCOMO to SJIS-DOCOMO
1476
[00:08:31] done.  (0.55user 0.02system 0.50elapsed)
1477
[00:08:31] generating table from ../ruby/enc/trans/emoji_sjis_kddi.c
1478
[00:08:32] compiling ../ruby/enc/iso_8859_8.c
1479
[00:08:32] generating ../ruby/enc/trans/emoji_sjis_kddi.c ...
1480
[00:08:32] load mapsrc ../ruby/enc/trans/JIS/JISX0201-KANA%UCS.src
1481
[00:08:32] load mapsrc ../ruby/enc/trans/EMOJI/EMOJI_SHIFT_JIS-KDDI%UCS.src
1482
[00:08:32] load mapsrc ../ruby/enc/trans/JIS/JISX0208VDC@NEC%UCS.src
1483
[00:08:32] load mapsrc ../ruby/enc/trans/CP/CP932VDC@NEC_IBM%UCS.src
1484
[00:08:32] load mapsrc ../ruby/enc/trans/CP/CP932VDC@IBM%UCS.src
1485
[00:08:32] load mapsrc ../ruby/enc/trans/CP/CP932UDA%UCS.src
1486
[00:08:32] load mapsrc ../ruby/enc/trans/JIS/JISX0208@MS%UCS.src
1487
[00:08:32] converter from SJIS-KDDI to UTF8-KDDI
1488
[00:08:32] load mapsrc ../ruby/enc/trans/JIS/UCS%JISX0201-KANA.src
1489
[00:08:32] load mapsrc ../ruby/enc/trans/EMOJI/UCS%EMOJI_SHIFT_JIS-KDDI.src
1490
[00:08:32] load mapsrc ../ruby/enc/trans/EMOJI/UCS%EMOJI_SHIFT_JIS-KDDI-UNDOC.src
1491
[00:08:32] load mapsrc ../ruby/enc/trans/JIS/UCS%JISX0208VDC@NEC.src
1492
[00:08:32] load mapsrc ../ruby/enc/trans/CP/UCS%CP932VDC@NEC_IBM.src
1493
[00:08:32] load mapsrc ../ruby/enc/trans/CP/UCS%CP932VDC@IBM.src
1494
[00:08:32] load mapsrc ../ruby/enc/trans/CP/UCS%CP932UDA.src
1495
[00:08:32] load mapsrc ../ruby/enc/trans/JIS/UCS%JISX0208@MS.src
1496
[00:08:32] converter from UTF8-KDDI to SJIS-KDDI
1497
[00:08:32] done.  (0.58user 0.02system 0.53elapsed)
1498
[00:08:32] generating table from ../ruby/enc/trans/emoji_sjis_softbank.c
1499
[00:08:33] generating ../ruby/enc/trans/emoji_sjis_softbank.c ...
1500
[00:08:33] load mapsrc ../ruby/enc/trans/JIS/JISX0201-KANA%UCS.src
1501
[00:08:33] load mapsrc ../ruby/enc/trans/EMOJI/EMOJI_SHIFT_JIS-SOFTBANK%UCS.src
1502
[00:08:33] load mapsrc ../ruby/enc/trans/JIS/JISX0208VDC@NEC%UCS.src
1503
[00:08:33] load mapsrc ../ruby/enc/trans/CP/CP932VDC@NEC_IBM%UCS.src
1504
[00:08:33] load mapsrc ../ruby/enc/trans/CP/CP932VDC@IBM%UCS.src
1505
[00:08:33] load mapsrc ../ruby/enc/trans/CP/CP932UDA%UCS.src
1506
[00:08:33] load mapsrc ../ruby/enc/trans/JIS/JISX0208@MS%UCS.src
1507
[00:08:33] converter from SJIS-SoftBank to UTF8-SoftBank
1508
[00:08:33] load mapsrc ../ruby/enc/trans/JIS/UCS%JISX0201-KANA.src
1509
[00:08:33] load mapsrc ../ruby/enc/trans/EMOJI/UCS%EMOJI_SHIFT_JIS-SOFTBANK.src
1510
[00:08:33] load mapsrc ../ruby/enc/trans/JIS/UCS%JISX0208VDC@NEC.src
1511
[00:08:33] load mapsrc ../ruby/enc/trans/CP/UCS%CP932VDC@NEC_IBM.src
1512
[00:08:33] load mapsrc ../ruby/enc/trans/CP/UCS%CP932VDC@IBM.src
1513
[00:08:33] load mapsrc ../ruby/enc/trans/CP/UCS%CP932UDA.src
1514
[00:08:33] load mapsrc ../ruby/enc/trans/JIS/UCS%JISX0208@MS.src
1515
[00:08:33] converter from UTF8-SoftBank to SJIS-SoftBank
1516
[00:08:33] done.  (0.53user 0.06system 0.51elapsed)
1517
[00:08:33] generating table from ../ruby/enc/trans/escape.c
1518
[00:08:33] generating ../ruby/enc/trans/escape.c ...
1519
[00:08:33] converter for amp_escape
1520
[00:08:33] converter for xml_text_escape
1521
[00:08:33] converter for xml_attr_content_escape
1522
[00:08:33] converter for escape_xml_attr_quote
1523
[00:08:33] done.  (0.05user 0.05system 0.01elapsed)
1524
[00:08:33] generating table from ../ruby/enc/trans/gb18030.c
1525
[00:08:33] compiling ../ruby/enc/iso_8859_9.c
1526
[00:08:35] compiling ../ruby/enc/iso_8859_10.c
1527
[00:08:35] generating ../ruby/enc/trans/gb18030.c ...
1528
[00:08:35] converter from GB18030 to UTF-8
1529
[00:08:35] converter from UTF-8 to GB18030
1530
[00:08:35] done.  (2.39user 0.12system 2.47elapsed)
1531
[00:08:35] generating table from ../ruby/enc/trans/gbk.c
1532
[00:08:36] compiling ../ruby/enc/iso_8859_11.c
1533
[00:08:36] generating ../ruby/enc/trans/gbk.c ...
1534
[00:08:36] converter from GBK to UTF-8
1535
[00:08:36] converter from UTF-8 to GBK
1536
[00:08:36] done.  (0.84user 0.06system 0.86elapsed)
1537
[00:08:36] generating table from ../ruby/enc/trans/iso2022.c
1538
[00:08:36] generating ../ruby/enc/trans/iso2022.c ...
1539
[00:08:36] converter for iso2022jp_decoder
1540
[00:08:36] converter for iso2022jp_decoder_jisx0208_rest
1541
[00:08:36] converter for iso2022jp_encoder
1542
[00:08:36] converter for stateless_iso2022jp_to_eucjp
1543
[00:08:36] converter for eucjp_to_stateless_iso2022jp
1544
[00:08:36] converter for cp50221_decoder
1545
[00:08:36] converter for cp50221_encoder
1546
[00:08:36] done.  (0.05user 0.02system 0.02elapsed)
1547
[00:08:36] generating table from ../ruby/enc/trans/japanese.c
1548
[00:08:37] generating ../ruby/enc/trans/japanese.c ...
1549
[00:08:37] converter for eucjp2sjis
1550
[00:08:37] converter for sjis2eucjp
1551
[00:08:37] done.  (0.00user 0.06system 0.01elapsed)
1552
[00:08:37] generating table from ../ruby/enc/trans/japanese_euc.c
1553
[00:08:37] compiling ../ruby/enc/iso_8859_13.c
1554
[00:08:38] compiling ../ruby/enc/iso_8859_14.c
1555
[00:08:39] generating ../ruby/enc/trans/japanese_euc.c ...
1556
[00:08:39] load mapsrc ../ruby/enc/trans/JIS/JISX0208@1990%UCS.src
1557
[00:08:39] load mapsrc ../ruby/enc/trans/JIS/JISX0201-KANA%UCS.src
1558
[00:08:39] load mapsrc ../ruby/enc/trans/JIS/JISX0212%UCS.src
1559
[00:08:39] converter from EUC-JP to UTF-8
1560
[00:08:39] load mapsrc ../ruby/enc/trans/JIS/JISX0208VDC@NEC%UCS.src
1561
[00:08:39] load mapsrc ../ruby/enc/trans/JIS/JISX0208UDC%UCS.src
1562
[00:08:39] load mapsrc ../ruby/enc/trans/JIS/JISX0208@MS%UCS.src
1563
[00:08:39] load mapsrc ../ruby/enc/trans/JIS/JISX0201-KANA%UCS.src
1564
[00:08:39] load mapsrc ../ruby/enc/trans/JIS/JISX0212VDC@IBM%UCS.src
1565
[00:08:39] load mapsrc ../ruby/enc/trans/JIS/JISX0212UDC%UCS.src
1566
[00:08:39] load mapsrc ../ruby/enc/trans/JIS/JISX0212@MS%UCS.src
1567
[00:08:39] converter from eucJP-ms to UTF-8
1568
[00:08:39] load mapsrc ../ruby/enc/trans/JIS/JISX0208VDC@NEC%UCS.src
1569
[00:08:39] load mapsrc ../ruby/enc/trans/CP/CP932VDC@NEC_IBM%UCS.src
1570
[00:08:39] load mapsrc ../ruby/enc/trans/JIS/JISX0208@MS%UCS.src
1571
[00:08:39] load mapsrc ../ruby/enc/trans/JIS/JISX0201-KANA%UCS.src
1572
[00:08:39] converter from CP51932 to UTF-8
1573
[00:08:39] load mapsrc ../ruby/enc/trans/JIS/JISX0208@1990%UCS.src
1574
[00:08:39] load mapsrc ../ruby/enc/trans/JIS/JISX0213-1%UCS@BMP.src
1575
[00:08:39] load mapsrc ../ruby/enc/trans/JIS/JISX0213-1%UCS@SIP.src
1576
[00:08:39] load mapsrc ../ruby/enc/trans/JIS/JISX0201-KANA%UCS.src
1577
[00:08:39] load mapsrc ../ruby/enc/trans/JIS/JISX0213-2%UCS@BMP.src
1578
[00:08:39] load mapsrc ../ruby/enc/trans/JIS/JISX0213-2%UCS@SIP.src
1579
[00:08:39] converter from EUC-JIS-2004 to UTF-8
1580
[00:08:39] load mapsrc ../ruby/enc/trans/JIS/UCS%JISX0208@1990.src
1581
[00:08:39] load mapsrc ../ruby/enc/trans/JIS/UCS%JISX0201-KANA.src
1582
[00:08:39] load mapsrc ../ruby/enc/trans/JIS/UCS%JISX0212.src
1583
[00:08:39] converter from UTF-8 to EUC-JP
1584
[00:08:39] load mapsrc ../ruby/enc/trans/JIS/UCS%JISX0208@MS.src
1585
[00:08:39] load mapsrc ../ruby/enc/trans/JIS/UCS%JISX0208VDC@NEC.src
1586
[00:08:39] load mapsrc ../ruby/enc/trans/JIS/UCS%JISX0208UDC.src
1587
[00:08:39] load mapsrc ../ruby/enc/trans/JIS/UCS%JISX0201-KANA.src
1588
[00:08:39] load mapsrc ../ruby/enc/trans/JIS/UCS%JISX0212VDC@IBM.src
1589
[00:08:39] load mapsrc ../ruby/enc/trans/JIS/UCS%JISX0212UDC.src
1590
[00:08:39] load mapsrc ../ruby/enc/trans/JIS/UCS%JISX0212@MS.src
1591
[00:08:39] converter from UTF-8 to eucJP-ms
1592
[00:08:39] load mapsrc ../ruby/enc/trans/JIS/UCS%JISX0208@MS.src
1593
[00:08:39] load mapsrc ../ruby/enc/trans/JIS/UCS%JISX0208VDC@NEC.src
1594
[00:08:39] load mapsrc ../ruby/enc/trans/CP/UCS%CP932VDC@NEC_IBM.src
1595
[00:08:39] load mapsrc ../ruby/enc/trans/JIS/UCS%JISX0201-KANA.src
1596
[00:08:39] converter from UTF-8 to CP51932
1597
[00:08:39] load mapsrc ../ruby/enc/trans/JIS/UCS%JISX0208@1990.src
1598
[00:08:39] load mapsrc ../ruby/enc/trans/JIS/UCS@BMP%JISX0213-1.src
1599
[00:08:39] load mapsrc ../ruby/enc/trans/JIS/UCS@SIP%JISX0213-1.src
1600
[00:08:39] load mapsrc ../ruby/enc/trans/JIS/UCS%JISX0201-KANA.src
1601
[00:08:39] load mapsrc ../ruby/enc/trans/JIS/UCS@BMP%JISX0213-2.src
1602
[00:08:39] load mapsrc ../ruby/enc/trans/JIS/UCS@SIP%JISX0213-2.src
1603
[00:08:39] converter from UTF-8 to EUC-JIS-2004
1604
[00:08:39] done.  (2.33user 0.12system 2.39elapsed)
1605
[00:08:39] generating table from ../ruby/enc/trans/japanese_sjis.c
1606
[00:08:40] compiling ../ruby/enc/iso_8859_15.c
1607
[00:08:40] generating ../ruby/enc/trans/japanese_sjis.c ...
1608
[00:08:40] load mapsrc ../ruby/enc/trans/JIS/JISX0201-KANA%UCS.src
1609
[00:08:40] load mapsrc ../ruby/enc/trans/JIS/JISX0208@1990%UCS.src
1610
[00:08:40] converter from Shift_JIS to UTF-8
1611
[00:08:40] load mapsrc ../ruby/enc/trans/JIS/JISX0201-KANA%UCS.src
1612
[00:08:40] load mapsrc ../ruby/enc/trans/JIS/JISX0208VDC@NEC%UCS.src
1613
[00:08:40] load mapsrc ../ruby/enc/trans/CP/CP932VDC@NEC_IBM%UCS.src
1614
[00:08:40] load mapsrc ../ruby/enc/trans/CP/CP932VDC@IBM%UCS.src
1615
[00:08:40] load mapsrc ../ruby/enc/trans/CP/CP932UDA%UCS.src
1616
[00:08:40] load mapsrc ../ruby/enc/trans/JIS/JISX0208@MS%UCS.src
1617
[00:08:40] converter from Windows-31J to UTF-8
1618
[00:08:40] load mapsrc ../ruby/enc/trans/JIS/UCS%JISX0201-KANA.src
1619
[00:08:40] load mapsrc ../ruby/enc/trans/JIS/UCS%JISX0208@1990.src
1620
[00:08:40] converter from UTF-8 to Shift_JIS
1621
[00:08:40] load mapsrc ../ruby/enc/trans/JIS/UCS%JISX0201-KANA.src
1622
[00:08:40] load mapsrc ../ruby/enc/trans/JIS/UCS%JISX0208@MS.src
1623
[00:08:40] load mapsrc ../ruby/enc/trans/JIS/UCS%JISX0208VDC@NEC.src
1624
[00:08:40] load mapsrc ../ruby/enc/trans/CP/UCS%CP932VDC@IBM.src
1625
[00:08:40] load mapsrc ../ruby/enc/trans/CP/UCS%CP932VDC@NEC_IBM.src
1626
[00:08:40] load mapsrc ../ruby/enc/trans/CP/UCS%CP932UDA.src
1627
[00:08:40] converter from UTF-8 to Windows-31J
1628
[00:08:40] done.  (1.16user 0.02system 1.12elapsed)
1629
[00:08:40] generating table from ../ruby/enc/trans/korean.c
1630
[00:08:41] compiling ../ruby/enc/iso_8859_16.c
1631
[00:08:42] generating ../ruby/enc/trans/korean.c ...
1632
[00:08:42] converter from UTF-8 to EUC-KR
1633
[00:08:42] converter from EUC-KR to UTF-8
1634
[00:08:42] converter from UTF-8 to CP949
1635
[00:08:42] converter from CP949 to UTF-8
1636
[00:08:42] done.  (1.14user 0.03system 1.11elapsed)
1637
[00:08:42] generating table from ../ruby/enc/trans/single_byte.c
1638
[00:08:42] compiling ../ruby/enc/koi8_r.c
1639
[00:08:42] generating ../ruby/enc/trans/single_byte.c ...
1640
[00:08:42] converter from US-ASCII to UTF-8
1641
[00:08:42] converter from UTF-8 to US-ASCII
1642
[00:08:42] converter from ASCII-8BIT to UTF-8
1643
[00:08:42] converter from UTF-8 to ASCII-8BIT
1644
[00:08:42] converter from ISO-8859-1 to UTF-8
1645
[00:08:42] converter from UTF-8 to ISO-8859-1
1646
[00:08:42] converter from ISO-8859-2 to UTF-8
1647
[00:08:42] converter from UTF-8 to ISO-8859-2
1648
[00:08:42] converter from ISO-8859-3 to UTF-8
1649
[00:08:42] converter from UTF-8 to ISO-8859-3
1650
[00:08:42] converter from ISO-8859-4 to UTF-8
1651
[00:08:42] converter from UTF-8 to ISO-8859-4
1652
[00:08:42] converter from ISO-8859-5 to UTF-8
1653
[00:08:42] converter from UTF-8 to ISO-8859-5
1654
[00:08:42] converter from ISO-8859-6 to UTF-8
1655
[00:08:42] converter from UTF-8 to ISO-8859-6
1656
[00:08:42] converter from ISO-8859-7 to UTF-8
1657
[00:08:42] converter from UTF-8 to ISO-8859-7
1658
[00:08:42] converter from ISO-8859-8 to UTF-8
1659
[00:08:42] converter from UTF-8 to ISO-8859-8
1660
[00:08:42] converter from ISO-8859-9 to UTF-8
1661
[00:08:42] converter from UTF-8 to ISO-8859-9
1662
[00:08:42] converter from ISO-8859-10 to UTF-8
1663
[00:08:42] converter from UTF-8 to ISO-8859-10
1664
[00:08:42] converter from ISO-8859-11 to UTF-8
1665
[00:08:42] converter from UTF-8 to ISO-8859-11
1666
[00:08:42] converter from ISO-8859-13 to UTF-8
1667
[00:08:42] converter from UTF-8 to ISO-8859-13
1668
[00:08:42] converter from ISO-8859-14 to UTF-8
1669
[00:08:42] converter from UTF-8 to ISO-8859-14
1670
[00:08:42] converter from ISO-8859-15 to UTF-8
1671
[00:08:42] converter from UTF-8 to ISO-8859-15
1672
[00:08:42] converter from ISO-8859-16 to UTF-8
1673
[00:08:42] converter from UTF-8 to ISO-8859-16
1674
[00:08:42] converter from WINDOWS-874 to UTF-8
1675
[00:08:42] converter from UTF-8 to WINDOWS-874
1676
[00:08:42] converter from WINDOWS-1250 to UTF-8
1677
[00:08:42] converter from UTF-8 to WINDOWS-1250
1678
[00:08:42] converter from WINDOWS-1251 to UTF-8
1679
[00:08:42] converter from UTF-8 to WINDOWS-1251
1680
[00:08:42] converter from WINDOWS-1252 to UTF-8
1681
[00:08:42] converter from UTF-8 to WINDOWS-1252
1682
[00:08:42] converter from WINDOWS-1253 to UTF-8
1683
[00:08:42] converter from UTF-8 to WINDOWS-1253
1684
[00:08:42] converter from WINDOWS-1254 to UTF-8
1685
[00:08:42] converter from UTF-8 to WINDOWS-1254
1686
[00:08:42] converter from WINDOWS-1255 to UTF-8
1687
[00:08:42] converter from UTF-8 to WINDOWS-1255
1688
[00:08:42] converter from WINDOWS-1256 to UTF-8
1689
[00:08:42] converter from UTF-8 to WINDOWS-1256
1690
[00:08:42] converter from WINDOWS-1257 to UTF-8
1691
[00:08:42] converter from UTF-8 to WINDOWS-1257
1692
[00:08:42] converter from IBM437 to UTF-8
1693
[00:08:42] converter from UTF-8 to IBM437
1694
[00:08:42] converter from IBM775 to UTF-8
1695
[00:08:42] converter from UTF-8 to IBM775
1696
[00:08:42] converter from IBM737 to UTF-8
1697
[00:08:42] converter from UTF-8 to IBM737
1698
[00:08:42] converter from IBM852 to UTF-8
1699
[00:08:42] converter from UTF-8 to IBM852
1700
[00:08:42] converter from IBM855 to UTF-8
1701
[00:08:42] converter from UTF-8 to IBM855
1702
[00:08:42] converter from IBM857 to UTF-8
1703
[00:08:42] converter from UTF-8 to IBM857
1704
[00:08:42] converter from IBM860 to UTF-8
1705
[00:08:42] converter from UTF-8 to IBM860
1706
[00:08:42] converter from IBM861 to UTF-8
1707
[00:08:42] converter from UTF-8 to IBM861
1708
[00:08:42] converter from IBM862 to UTF-8
1709
[00:08:42] converter from UTF-8 to IBM862
1710
[00:08:42] converter from IBM863 to UTF-8
1711
[00:08:42] converter from UTF-8 to IBM863
1712
[00:08:42] converter from IBM865 to UTF-8
1713
[00:08:42] converter from UTF-8 to IBM865
1714
[00:08:42] converter from IBM866 to UTF-8
1715
[00:08:42] converter from UTF-8 to IBM866
1716
[00:08:42] converter from IBM869 to UTF-8
1717
[00:08:42] converter from UTF-8 to IBM869
1718
[00:08:42] converter from MACCROATIAN to UTF-8
1719
[00:08:42] converter from UTF-8 to MACCROATIAN
1720
[00:08:42] converter from MACCYRILLIC to UTF-8
1721
[00:08:42] converter from UTF-8 to MACCYRILLIC
1722
[00:08:42] converter from MACGREEK to UTF-8
1723
[00:08:42] converter from UTF-8 to MACGREEK
1724
[00:08:42] converter from MACICELAND to UTF-8
1725
[00:08:42] converter from UTF-8 to MACICELAND
1726
[00:08:42] converter from MACROMAN to UTF-8
1727
[00:08:42] converter from UTF-8 to MACROMAN
1728
[00:08:42] converter from MACROMANIA to UTF-8
1729
[00:08:42] converter from UTF-8 to MACROMANIA
1730
[00:08:42] converter from MACTURKISH to UTF-8
1731
[00:08:42] converter from UTF-8 to MACTURKISH
1732
[00:08:42] converter from MACUKRAINE to UTF-8
1733
[00:08:42] converter from UTF-8 to MACUKRAINE
1734
[00:08:42] converter from KOI8-U to UTF-8
1735
[00:08:42] converter from UTF-8 to KOI8-U
1736
[00:08:42] converter from KOI8-R to UTF-8
1737
[00:08:42] converter from UTF-8 to KOI8-R
1738
[00:08:42] converter from TIS-620 to UTF-8
1739
[00:08:42] converter from UTF-8 to TIS-620
1740
[00:08:42] converter from CP850 to UTF-8
1741
[00:08:42] converter from UTF-8 to CP850
1742
[00:08:42] converter from CP852 to UTF-8
1743
[00:08:42] converter from UTF-8 to CP852
1744
[00:08:42] converter from CP855 to UTF-8
1745
[00:08:42] converter from UTF-8 to CP855
1746
[00:08:42] done.  (0.45user 0.03system 0.41elapsed)
1747
[00:08:42] generating table from ../ruby/enc/trans/utf8_mac.c
1748
[00:08:43] compiling ../ruby/enc/koi8_u.c
1749
[00:08:43] generating ../ruby/enc/trans/utf8_mac.c ...
1750
[00:08:43] converter from UTF-8 to UTF8-MAC
1751
[00:08:43] converter for from_UTF8_MAC
1752
[00:08:43] converter for from_utf8_mac_nfc2
1753
[00:08:43] done.  (1.05user 0.12system 1.11elapsed)
1754
[00:08:43] generating table from ../ruby/enc/trans/utf_16_32.c
1755
[00:08:44] generating ../ruby/enc/trans/utf_16_32.c ...
1756
[00:08:44] converter for from_UTF_16LE
1757
[00:08:44] converter for from_UTF_32LE
1758
[00:08:44] converter for from_UTF_16BE
1759
[00:08:44] converter for from_UTF_32BE
1760
[00:08:44] converter for from_UTF_16
1761
[00:08:44] converter for from_UTF_32
1762
[00:08:44] converter for from_UTF_8
1763
[00:08:44] done.  (0.05user 0.03system 0.02elapsed)
1764
[00:08:44] linking transcoder transdb.so
1765
[00:08:44] compiling ../ruby/enc/trans/big5.c
1766
[00:08:45] compiling ../ruby/enc/shift_jis.c
1767
[00:08:46] compiling ../ruby/enc/utf_16be.c
1768
[00:08:47] compiling ../ruby/enc/utf_16le.c
1769
[00:08:47] compiling ../ruby/enc/trans/chinese.c
1770
[00:08:48] compiling ../ruby/enc/utf_32be.c
1771
[00:08:49] compiling ../ruby/enc/trans/ebcdic.c
1772
[00:08:49] compiling ../ruby/enc/utf_32le.c
1773
[00:08:50] compiling ../ruby/enc/trans/emoji.c
1774
[00:08:50] compiling ../ruby/enc/windows_31j.c
1775
[00:08:52] compiling ../ruby/enc/trans/emoji_iso2022_kddi.c
1776
[00:08:52] compiling ../ruby/enc/windows_1250.c
1777
[00:08:53] compiling ../ruby/enc/windows_1251.c
1778
[00:08:53] compiling ../ruby/enc/trans/emoji_sjis_docomo.c
1779
[00:08:54] compiling ../ruby/enc/windows_1252.c
1780
[00:08:55] compiling ../ruby/enc/trans/emoji_sjis_kddi.c
1781
[00:08:55] compiling ../ruby/enc/windows_1253.c
1782
[00:08:56] compiling ../ruby/enc/trans/emoji_sjis_softbank.c
1783
[00:08:57] compiling ../ruby/enc/windows_1254.c
1784
[00:08:58] compiling ../ruby/enc/windows_1257.c
1785
[00:08:58] compiling ../ruby/enc/trans/escape.c
1786
[00:08:59] linking encoding encdb.so
1787
[00:08:59] compiling ../ruby/enc/trans/gb18030.c
1788
[00:08:59] linking encoding big5.so
1789
[00:08:59] linking encoding cp949.so
1790
[00:08:59] linking encoding emacs_mule.so
1791
[00:08:59] linking encoding euc_jp.so
1792
[00:09:00] linking encoding euc_kr.so
1793
[00:09:00] linking encoding euc_tw.so
1794
[00:09:00] linking encoding gb2312.so
1795
[00:09:00] linking encoding gb18030.so
1796
[00:09:00] linking encoding gbk.so
1797
[00:09:00] linking encoding iso_8859_1.so
1798
[00:09:00] linking encoding iso_8859_2.so
1799
[00:09:00] linking encoding iso_8859_3.so
1800
[00:09:00] linking encoding iso_8859_4.so
1801
[00:09:00] linking encoding iso_8859_5.so
1802
[00:09:00] linking encoding iso_8859_6.so
1803
[00:09:00] linking encoding iso_8859_7.so
1804
[00:09:01] linking encoding iso_8859_8.so
1805
[00:09:01] linking encoding iso_8859_9.so
1806
[00:09:01] linking encoding iso_8859_10.so
1807
[00:09:01] linking encoding iso_8859_11.so
1808
[00:09:01] compiling ../ruby/enc/trans/gbk.c
1809
[00:09:01] linking encoding iso_8859_13.so
1810
[00:09:01] linking encoding iso_8859_14.so
1811
[00:09:01] linking encoding iso_8859_15.so
1812
[00:09:01] linking encoding iso_8859_16.so
1813
[00:09:01] linking encoding koi8_r.so
1814
[00:09:01] linking encoding koi8_u.so
1815
[00:09:01] linking encoding shift_jis.so
1816
[00:09:01] linking encoding utf_16be.so
1817
[00:09:02] linking encoding utf_16le.so
1818
[00:09:02] linking encoding utf_32be.so
1819
[00:09:02] linking encoding utf_32le.so
1820
[00:09:02] linking encoding windows_31j.so
1821
[00:09:02] linking encoding windows_1250.so
1822
[00:09:02] linking encoding windows_1251.so
1823
[00:09:02] linking encoding windows_1252.so
1824
[00:09:02] linking encoding windows_1253.so
1825
[00:09:02] linking encoding windows_1254.so
1826
[00:09:02] linking encoding windows_1257.so
1827
[00:09:02] make[1]: Leaving directory '/c/projects/ruby-loco/build'
1828
[00:09:02] make[1]: Entering directory '/c/projects/ruby-loco/build'
1829
[00:09:03] configuring -test-/array/resize
1830
[00:09:03] configuring -test-/bignum
1831
[00:09:03] configuring -test-/bug-3571
1832
[00:09:03] configuring -test-/bug-5832
1833
[00:09:03] configuring -test-/bug_reporter
1834
[00:09:03] configuring -test-/class
1835
[00:09:03] configuring -test-/debug
1836
[00:09:03] configuring -test-/dln/empty
1837
[00:09:03] configuring -test-/exception
1838
[00:09:03] configuring -test-/fatal
1839
[00:09:03] configuring -test-/file
1840
[00:09:03] compiling ../ruby/enc/trans/iso2022.c
1841
[00:09:03] configuring -test-/float
1842
[00:09:03] configuring -test-/funcall
1843
[00:09:03] configuring -test-/gvl/call_without_gvl
1844
[00:09:03] configuring -test-/hash
1845
[00:09:03] configuring -test-/integer
1846
[00:09:03] configuring -test-/iseq_load
1847
[00:09:03] configuring -test-/iter
1848
[00:09:03] configuring -test-/load/dot.dot
1849
[00:09:03] configuring -test-/load/protect
1850
[00:09:03] configuring -test-/marshal/compat
1851
[00:09:03] configuring -test-/marshal/internal_ivar
1852
[00:09:03] configuring -test-/marshal/usr
1853
[00:09:03] configuring -test-/memory_status
1854
[00:09:03] configuring -test-/method
1855
[00:09:03] configuring -test-/notimplement
1856
[00:09:03] configuring -test-/num2int
1857
[00:09:03] configuring -test-/path_to_class
1858
[00:09:03] configuring -test-/popen_deadlock
1859
[00:09:03] configuring -test-/postponed_job
1860
[00:09:03] configuring -test-/printf
1861
[00:09:03] configuring -test-/proc
1862
[00:09:03] configuring -test-/rational
1863
[00:09:03] configuring -test-/recursion
1864
[00:09:03] configuring -test-/regexp
1865
[00:09:03] configuring -test-/scan_args
1866
[00:09:03] configuring -test-/st/foreach
1867
[00:09:03] configuring -test-/st/numhash
1868
[00:09:03] configuring -test-/st/update
1869
[00:09:03] configuring -test-/string
1870
[00:09:03] configuring -test-/struct
1871
[00:09:03] configuring -test-/symbol
1872
[00:09:03] configuring -test-/thread_fd_close
1873
[00:09:03] configuring -test-/time
1874
[00:09:03] configuring -test-/tracepoint
1875
[00:09:03] configuring -test-/typeddata
1876
[00:09:03] configuring -test-/vm
1877
[00:09:03] configuring -test-/wait_for_single_fd
1878
[00:09:03] configuring -test-/win32/console
1879
[00:09:03] configuring -test-/win32/dln
1880
[00:09:03] configuring -test-/win32/fd_setsize
1881
[00:09:04] configuring bigdecimal
1882
[00:09:04] configuring cgi/escape
1883
[00:09:04] configuring continuation
1884
[00:09:04] configuring coverage
1885
[00:09:04] configuring date
1886
[00:09:04] configuring dbm
1887
[00:09:05] compiling ../ruby/enc/trans/japanese.c
1888
[00:09:05] configuring digest
1889
[00:09:05] configuring digest/bubblebabble
1890
[00:09:05] configuring digest/md5
1891
[00:09:05] configuring digest/rmd160
1892
[00:09:05] configuring digest/sha1
1893
[00:09:05] configuring digest/sha2
1894
[00:09:05] configuring etc
1895
[00:09:06] configuring fcntl
1896
[00:09:06] configuring fiber
1897
[00:09:06] configuring fiddle
1898
[00:09:06] compiling ../ruby/enc/trans/japanese_euc.c
1899
[00:09:07] configuring gdbm
1900
[00:09:07] configuring io/console
1901
[00:09:07] configuring io/nonblock
1902
[00:09:07] configuring io/wait
1903
[00:09:07] configuring json
1904
[00:09:07] configuring json/generator
1905
[00:09:07] configuring json/parser
1906
[00:09:07] configuring nkf
1907
[00:09:07] configuring objspace
1908
[00:09:07] configuring openssl
1909
[00:09:07] configuring pathname
1910
[00:09:08] configuring psych
1911
[00:09:08] configuring racc/cparse
1912
[00:09:08] configuring rbconfig/sizeof
1913
[00:09:08] configuring readline
1914
[00:09:09] configuring ripper
1915
[00:09:09] configuring rubyvm
1916
[00:09:09] configuring sdbm
1917
[00:09:09] compiling ../ruby/enc/trans/japanese_sjis.c
1918
[00:09:09] configuring socket
1919
[00:09:09] configuring stringio
1920
[00:09:10] configuring strscan
1921
[00:09:10] configuring win32
1922
[00:09:10] configuring win32/resolv
1923
[00:09:10] configuring win32ole
1924
[00:09:10] configuring zlib
1925
[00:09:10] make[1]: Leaving directory '/c/projects/ruby-loco/build'
1926
[00:09:10] generating makefile exts.mk
1927
[00:09:10] exts.mk updated
1928
[00:09:10] make[1]: Entering directory '/c/projects/ruby-loco/build'
1929
[00:09:11] make[2]: Entering directory '/c/projects/ruby-loco/build/ext/-test-/array/resize'
1930
[00:09:11] generating resize-x64-mingw32.def
1931
[00:09:11] compiling ../ruby/enc/trans/korean.c
1932
[00:09:11] compiling ../../../../../ruby/ext/-test-/array/resize/resize.c
1933
[00:09:12] linking shared-object -test-/array/resize.so
1934
[00:09:12] make[2]: Leaving directory '/c/projects/ruby-loco/build/ext/-test-/array/resize'
1935
[00:09:12] make[2]: Entering directory '/c/projects/ruby-loco/build/ext/-test-/bignum'
1936
[00:09:12] generating bignum-x64-mingw32.def
1937
[00:09:12] compiling ../../../../ruby/ext/-test-/bignum/big2str.c
1938
[00:09:13] compiling ../ruby/enc/trans/single_byte.c
1939
[00:09:13] compiling ../../../../ruby/ext/-test-/bignum/bigzero.c
1940
[00:09:14] compiling ../ruby/enc/trans/utf8_mac.c
1941
[00:09:15] compiling ../../../../ruby/ext/-test-/bignum/div.c
1942
[00:09:16] compiling ../../../../ruby/ext/-test-/bignum/init.c
1943
[00:09:16] compiling ../ruby/enc/trans/utf_16_32.c
1944
[00:09:17] compiling ../../../../ruby/ext/-test-/bignum/intpack.c
1945
[00:09:18] linking transcoder big5.so
1946
[00:09:18] linking transcoder chinese.so
1947
[00:09:18] linking transcoder ebcdic.so
1948
[00:09:18] linking transcoder emoji.so
1949
[00:09:18] linking transcoder emoji_iso2022_kddi.so
1950
[00:09:18] linking transcoder emoji_sjis_docomo.so
1951
[00:09:18] linking transcoder emoji_sjis_kddi.so
1952
[00:09:18] linking transcoder emoji_sjis_softbank.so
1953
[00:09:18] linking transcoder escape.so
1954
[00:09:18] compiling ../../../../ruby/ext/-test-/bignum/mul.c
1955
[00:09:19] linking transcoder gb18030.so
1956
[00:09:19] linking transcoder gbk.so
1957
[00:09:19] linking transcoder iso2022.so
1958
[00:09:19] linking transcoder japanese.so
1959
[00:09:19] linking transcoder japanese_euc.so
1960
[00:09:19] linking transcoder japanese_sjis.so
1961
[00:09:19] linking transcoder korean.so
1962
[00:09:19] linking transcoder single_byte.so
1963
[00:09:19] linking transcoder utf8_mac.so
1964
[00:09:19] linking transcoder utf_16_32.so
1965
[00:09:20] make[1]: Leaving directory '/c/projects/ruby-loco/build'
1966
[00:09:20] making encs
1967
[00:09:20] compiling ../../../../ruby/ext/-test-/bignum/str2big.c
1968
[00:09:20] make[1]: Entering directory '/c/projects/ruby-loco/build'
1969
[00:09:20] make[1]: Nothing to be done for 'encs'.
1970
[00:09:20] make[1]: Leaving directory '/c/projects/ruby-loco/build'
1971
[00:09:20] make[2]: Entering directory '/c/projects/ruby-loco/build/ext/-test-/bug-3571'
1972
[00:09:20] generating bug_3571-x64-mingw32.def
1973
[00:09:20] compiling ../../../../ruby/ext/-test-/bug-3571/bug.c
1974
[00:09:21] linking shared-object -test-/bignum.so
1975
[00:09:21] make[2]: Leaving directory '/c/projects/ruby-loco/build/ext/-test-/bignum'
1976
[00:09:21] make[2]: Entering directory '/c/projects/ruby-loco/build/ext/-test-/bug-5832'
1977
[00:09:21] generating bug_5832-x64-mingw32.def
1978
[00:09:21] compiling ../../../../ruby/ext/-test-/bug-5832/bug.c
1979
[00:09:22] linking shared-object -test-/bug_3571.so
1980
[00:09:22] make[2]: Leaving directory '/c/projects/ruby-loco/build/ext/-test-/bug-3571'
1981
[00:09:22] make[2]: Entering directory '/c/projects/ruby-loco/build/ext/-test-/bug_reporter'
1982
[00:09:22] generating bug_reporter-x64-mingw32.def
1983
[00:09:22] compiling ../../../../ruby/ext/-test-/bug_reporter/bug_reporter.c
1984
[00:09:23] linking shared-object -test-/bug_5832.so
1985
[00:09:23] make[2]: Leaving directory '/c/projects/ruby-loco/build/ext/-test-/bug-5832'
1986
[00:09:23] make[2]: Entering directory '/c/projects/ruby-loco/build/ext/-test-/class'
1987
[00:09:23] generating class-x64-mingw32.def
1988
[00:09:23] compiling ../../../../ruby/ext/-test-/class/class2name.c
1989
[00:09:23] linking shared-object -test-/bug_reporter.so
1990
[00:09:24] make[2]: Leaving directory '/c/projects/ruby-loco/build/ext/-test-/bug_reporter'
1991
[00:09:24] make[2]: Entering directory '/c/projects/ruby-loco/build/ext/-test-/debug'
1992
[00:09:24] generating debug-x64-mingw32.def
1993
[00:09:24] compiling ../../../../ruby/ext/-test-/debug/init.c
1994
[00:09:25] compiling ../../../../ruby/ext/-test-/class/init.c
1995
[00:09:25] compiling ../../../../ruby/ext/-test-/debug/inspector.c
1996
[00:09:26] linking shared-object -test-/class.so
1997
[00:09:26] make[2]: Leaving directory '/c/projects/ruby-loco/build/ext/-test-/class'
1998
[00:09:26] make[2]: Entering directory '/c/projects/ruby-loco/build/ext/-test-/dln/empty'
1999
[00:09:26] generating empty-x64-mingw32.def
2000
[00:09:26] compiling ../../../../../ruby/ext/-test-/dln/empty/empty.c
2001
[00:09:26] linking shared-object -test-/dln/empty.so
2002
[00:09:27] make[2]: Leaving directory '/c/projects/ruby-loco/build/ext/-test-/dln/empty'
2003
[00:09:27] make[2]: Entering directory '/c/projects/ruby-loco/build/ext/-test-/exception'
2004
[00:09:27] generating exception-x64-mingw32.def
2005
[00:09:27] compiling ../../../../ruby/ext/-test-/debug/profile_frames.c
2006
[00:09:27] compiling ../../../../ruby/ext/-test-/exception/dataerror.c
2007
[00:09:28] compiling ../../../../ruby/ext/-test-/exception/enc_raise.c
2008
[00:09:28] linking shared-object -test-/debug.so
2009
[00:09:28] make[2]: Leaving directory '/c/projects/ruby-loco/build/ext/-test-/debug'
2010
[00:09:28] make[2]: Entering directory '/c/projects/ruby-loco/build/ext/-test-/fatal'
2011
[00:09:29] generating rb_fatal-x64-mingw32.def
2012
[00:09:29] compiling ../../../../ruby/ext/-test-/fatal/rb_fatal.c
2013
[00:09:30] linking shared-object -test-/fatal/rb_fatal.so
2014
[00:09:30] make[2]: Leaving directory '/c/projects/ruby-loco/build/ext/-test-/fatal'
2015
[00:09:30] compiling ../../../../ruby/ext/-test-/exception/ensured.c
2016
[00:09:30] compiling ../../../../ruby/ext/-test-/exception/init.c
2017
[00:09:32] linking shared-object -test-/exception.so
2018
[00:09:32] make[2]: Entering directory '/c/projects/ruby-loco/build/ext/-test-/file'
2019
[00:09:32] generating file-x64-mingw32.def
2020
[00:09:32] make[2]: Leaving directory '/c/projects/ruby-loco/build/ext/-test-/exception'
2021
[00:09:32] compiling ../../../../ruby/ext/-test-/file/fs.c
2022
[00:09:32] make[2]: Entering directory '/c/projects/ruby-loco/build/ext/-test-/float'
2023
[00:09:32] generating float-x64-mingw32.def
2024
[00:09:32] compiling ../../../../ruby/ext/-test-/float/init.c
2025
[00:09:33] compiling ../../../../ruby/ext/-test-/file/init.c
2026
[00:09:33] compiling ../../../../ruby/ext/-test-/float/nextafter.c
2027
[00:09:34] compiling ../../../../ruby/ext/-test-/file/stat.c
2028
[00:09:35] linking shared-object -test-/float.so
2029
[00:09:35] make[2]: Leaving directory '/c/projects/ruby-loco/build/ext/-test-/float'
2030
[00:09:35] make[2]: Entering directory '/c/projects/ruby-loco/build/ext/-test-/funcall'
2031
[00:09:35] generating funcall-x64-mingw32.def
2032
[00:09:35] compiling ../../../../ruby/ext/-test-/funcall/funcall.c
2033
[00:09:36] linking shared-object -test-/file.so
2034
[00:09:36] make[2]: Leaving directory '/c/projects/ruby-loco/build/ext/-test-/file'
2035
[00:09:36] make[2]: Entering directory '/c/projects/ruby-loco/build/ext/-test-/gvl/call_without_gvl'
2036
[00:09:36] generating call_without_gvl-x64-mingw32.def
2037
[00:09:36] linking shared-object -test-/funcall.so
2038
[00:09:36] compiling ../../../../../ruby/ext/-test-/gvl/call_without_gvl/call_without_gvl.c
2039
[00:09:36] make[2]: Leaving directory '/c/projects/ruby-loco/build/ext/-test-/funcall'
2040
[00:09:36] make[2]: Entering directory '/c/projects/ruby-loco/build/ext/-test-/hash'
2041
[00:09:36] generating hash-x64-mingw32.def
2042
[00:09:36] compiling ../../../../ruby/ext/-test-/hash/delete.c
2043
[00:09:38] linking shared-object -test-/gvl/call_without_gvl.so
2044
[00:09:38] make[2]: Leaving directory '/c/projects/ruby-loco/build/ext/-test-/gvl/call_without_gvl'
2045
[00:09:38] compiling ../../../../ruby/ext/-test-/hash/init.c
2046
[00:09:38] make[2]: Entering directory '/c/projects/ruby-loco/build/ext/-test-/integer'
2047
[00:09:38] generating integer-x64-mingw32.def
2048
[00:09:38] compiling ../../../../ruby/ext/-test-/integer/core_ext.c
2049
[00:09:39] linking shared-object -test-/hash.so
2050
[00:09:39] compiling ../../../../ruby/ext/-test-/integer/init.c
2051
[00:09:39] make[2]: Leaving directory '/c/projects/ruby-loco/build/ext/-test-/hash'
2052
[00:09:39] make[2]: Entering directory '/c/projects/ruby-loco/build/ext/-test-/iseq_load'
2053
[00:09:39] generating iseq_load-x64-mingw32.def
2054
[00:09:39] compiling ../../../../ruby/ext/-test-/iseq_load/iseq_load.c
2055
[00:09:40] compiling ../../../../ruby/ext/-test-/integer/my_integer.c
2056
[00:09:41] linking shared-object -test-/iseq_load.so
2057
[00:09:41] make[2]: Leaving directory '/c/projects/ruby-loco/build/ext/-test-/iseq_load'
2058
[00:09:41] make[2]: Entering directory '/c/projects/ruby-loco/build/ext/-test-/iter'
2059
[00:09:41] generating iter-x64-mingw32.def
2060
[00:09:41] compiling ../../../../ruby/ext/-test-/iter/break.c
2061
[00:09:41] linking shared-object -test-/integer.so
2062
[00:09:41] make[2]: Leaving directory '/c/projects/ruby-loco/build/ext/-test-/integer'
2063
[00:09:41] make[2]: Entering directory '/c/projects/ruby-loco/build/ext/-test-/load/dot.dot'
2064
[00:09:42] generating dot.dot-x64-mingw32.def
2065
[00:09:42] compiling ../../../../../ruby/ext/-test-/load/dot.dot/dot.dot.c
2066
[00:09:42] linking shared-object -test-/load/dot.dot.so
2067
[00:09:42] make[2]: Leaving directory '/c/projects/ruby-loco/build/ext/-test-/load/dot.dot'
2068
[00:09:42] make[2]: Entering directory '/c/projects/ruby-loco/build/ext/-test-/load/protect'
2069
[00:09:42] generating protect-x64-mingw32.def
2070
[00:09:42] compiling ../../../../ruby/ext/-test-/iter/init.c
2071
[00:09:42] compiling ../../../../../ruby/ext/-test-/load/protect/protect.c
2072
[00:09:44] compiling ../../../../ruby/ext/-test-/iter/yield.c
2073
[00:09:44] linking shared-object -test-/load/protect.so
2074
[00:09:44] make[2]: Leaving directory '/c/projects/ruby-loco/build/ext/-test-/load/protect'
2075
[00:09:44] make[2]: Entering directory '/c/projects/ruby-loco/build/ext/-test-/marshal/compat'
2076
[00:09:44] generating compat-x64-mingw32.def
2077
[00:09:44] compiling ../../../../../ruby/ext/-test-/marshal/compat/usrcompat.c
2078
[00:09:45] linking shared-object -test-/iter.so
2079
[00:09:45] make[2]: Leaving directory '/c/projects/ruby-loco/build/ext/-test-/iter'
2080
[00:09:45] make[2]: Entering directory '/c/projects/ruby-loco/build/ext/-test-/marshal/internal_ivar'
2081
[00:09:45] generating internal_ivar-x64-mingw32.def
2082
[00:09:45] compiling ../../../../../ruby/ext/-test-/marshal/internal_ivar/internal_ivar.c
2083
[00:09:45] linking shared-object -test-/marshal/compat.so
2084
[00:09:46] make[2]: Leaving directory '/c/projects/ruby-loco/build/ext/-test-/marshal/compat'
2085
[00:09:46] make[2]: Entering directory '/c/projects/ruby-loco/build/ext/-test-/marshal/usr'
2086
[00:09:46] generating usr-x64-mingw32.def
2087
[00:09:46] compiling ../../../../../ruby/ext/-test-/marshal/usr/usrmarshal.c
2088
[00:09:47] linking shared-object -test-/marshal/internal_ivar.so
2089
[00:09:47] make[2]: Leaving directory '/c/projects/ruby-loco/build/ext/-test-/marshal/internal_ivar'
2090
[00:09:47] make[2]: Entering directory '/c/projects/ruby-loco/build/ext/-test-/method'
2091
[00:09:47] generating method-x64-mingw32.def
2092
[00:09:47] linking shared-object -test-/marshal/usr.so
2093
[00:09:47] compiling ../../../../ruby/ext/-test-/method/arity.c
2094
[00:09:47] make[2]: Leaving directory '/c/projects/ruby-loco/build/ext/-test-/marshal/usr'
2095
[00:09:47] make[2]: Entering directory '/c/projects/ruby-loco/build/ext/-test-/notimplement'
2096
[00:09:47] generating notimplement-x64-mingw32.def
2097
[00:09:47] compiling ../../../../ruby/ext/-test-/notimplement/bug.c
2098
[00:09:48] compiling ../../../../ruby/ext/-test-/method/init.c
2099
[00:09:49] linking shared-object -test-/notimplement.so
2100
[00:09:49] make[2]: Leaving directory '/c/projects/ruby-loco/build/ext/-test-/notimplement'
2101
[00:09:49] make[2]: Entering directory '/c/projects/ruby-loco/build/ext/-test-/num2int'
2102
[00:09:49] generating num2int-x64-mingw32.def
2103
[00:09:49] compiling ../../../../ruby/ext/-test-/num2int/num2int.c
2104
[00:09:50] linking shared-object -test-/method.so
2105
[00:09:50] make[2]: Leaving directory '/c/projects/ruby-loco/build/ext/-test-/method'
2106
[00:09:50] make[2]: Entering directory '/c/projects/ruby-loco/build/ext/-test-/path_to_class'
2107
[00:09:50] generating path_to_class-x64-mingw32.def
2108
[00:09:50] compiling ../../../../ruby/ext/-test-/path_to_class/path_to_class.c
2109
[00:09:50] linking shared-object -test-/num2int.so
2110
[00:09:50] make[2]: Leaving directory '/c/projects/ruby-loco/build/ext/-test-/num2int'
2111
[00:09:50] make[2]: Entering directory '/c/projects/ruby-loco/build/ext/-test-/postponed_job'
2112
[00:09:50] generating postponed_job-x64-mingw32.def
2113
[00:09:51] compiling ../../../../ruby/ext/-test-/postponed_job/postponed_job.c
2114
[00:09:51] linking shared-object -test-/path_to_class.so
2115
[00:09:51] make[2]: Leaving directory '/c/projects/ruby-loco/build/ext/-test-/path_to_class'
2116
[00:09:51] make[2]: Entering directory '/c/projects/ruby-loco/build/ext/-test-/printf'
2117
[00:09:51] generating printf-x64-mingw32.def
2118
[00:09:52] compiling ../../../../ruby/ext/-test-/printf/printf.c
2119
[00:09:52] linking shared-object -test-/postponed_job.so
2120
[00:09:52] make[2]: Leaving directory '/c/projects/ruby-loco/build/ext/-test-/postponed_job'
2121
[00:09:52] make[2]: Entering directory '/c/projects/ruby-loco/build/ext/-test-/proc'
2122
[00:09:53] generating proc-x64-mingw32.def
2123
[00:09:53] compiling ../../../../ruby/ext/-test-/proc/init.c
2124
[00:09:54] compiling ../../../../ruby/ext/-test-/proc/receiver.c
2125
[00:09:55] compiling ../../../../ruby/ext/-test-/proc/super.c
2126
[00:09:56] linking shared-object -test-/proc.so
2127
[00:09:56] make[2]: Leaving directory '/c/projects/ruby-loco/build/ext/-test-/proc'
2128
[00:09:56] linking shared-object -test-/printf.so
2129
[00:09:56] make[2]: Entering directory '/c/projects/ruby-loco/build/ext/-test-/rational'
2130
[00:09:56] generating rational-x64-mingw32.def
2131
[00:09:57] make[2]: Leaving directory '/c/projects/ruby-loco/build/ext/-test-/printf'
2132
[00:09:57] make[2]: Entering directory '/c/projects/ruby-loco/build/ext/-test-/recursion'
2133
[00:09:57] generating recursion-x64-mingw32.def
2134
[00:09:57] compiling ../../../../ruby/ext/-test-/rational/rat.c
2135
[00:09:57] compiling ../../../../ruby/ext/-test-/recursion/recursion.c
2136
[00:09:58] linking shared-object -test-/rational.so
2137
[00:09:58] make[2]: Leaving directory '/c/projects/ruby-loco/build/ext/-test-/rational'
2138
[00:09:58] make[2]: Entering directory '/c/projects/ruby-loco/build/ext/-test-/regexp'
2139
[00:09:58] generating regexp-x64-mingw32.def
2140
[00:09:58] compiling ../../../../ruby/ext/-test-/regexp/init.c
2141
[00:09:59] compiling ../../../../ruby/ext/-test-/regexp/parse_depth_limit.c
2142
[00:10:00] linking shared-object -test-/regexp.so
2143
[00:10:01] make[2]: Leaving directory '/c/projects/ruby-loco/build/ext/-test-/regexp'
2144
[00:10:01] linking shared-object -test-/recursion.so
2145
[00:10:01] make[2]: Entering directory '/c/projects/ruby-loco/build/ext/-test-/scan_args'
2146
[00:10:01] generating scan_args-x64-mingw32.def
2147
[00:10:01] make[2]: Leaving directory '/c/projects/ruby-loco/build/ext/-test-/recursion'
2148
[00:10:01] make[2]: Entering directory '/c/projects/ruby-loco/build/ext/-test-/st/foreach'
2149
[00:10:01] generating foreach-x64-mingw32.def
2150
[00:10:01] compiling ../../../../ruby/ext/-test-/scan_args/scan_args.c
2151
[00:10:01] compiling ../../../../../ruby/ext/-test-/st/foreach/foreach.c
2152
[00:10:02] linking shared-object -test-/st/foreach.so
2153
[00:10:02] make[2]: Leaving directory '/c/projects/ruby-loco/build/ext/-test-/st/foreach'
2154
[00:10:02] make[2]: Entering directory '/c/projects/ruby-loco/build/ext/-test-/st/numhash'
2155
[00:10:02] generating numhash-x64-mingw32.def
2156
[00:10:02] linking shared-object -test-/scan_args.so
2157
[00:10:02] compiling ../../../../../ruby/ext/-test-/st/numhash/numhash.c
2158
[00:10:03] make[2]: Leaving directory '/c/projects/ruby-loco/build/ext/-test-/scan_args'
2159
[00:10:03] make[2]: Entering directory '/c/projects/ruby-loco/build/ext/-test-/st/update'
2160
[00:10:03] generating update-x64-mingw32.def
2161
[00:10:03] compiling ../../../../../ruby/ext/-test-/st/update/update.c
2162
[00:10:04] linking shared-object -test-/st/numhash.so
2163
[00:10:04] make[2]: Leaving directory '/c/projects/ruby-loco/build/ext/-test-/st/numhash'
2164
[00:10:04] make[2]: Entering directory '/c/projects/ruby-loco/build/ext/-test-/string'
2165
[00:10:04] generating string-x64-mingw32.def
2166
[00:10:04] linking shared-object -test-/st/update.so
2167
[00:10:04] compiling ../../../../ruby/ext/-test-/string/capacity.c
2168
[00:10:04] make[2]: Leaving directory '/c/projects/ruby-loco/build/ext/-test-/st/update'
2169
[00:10:04] make[2]: Entering directory '/c/projects/ruby-loco/build/ext/-test-/struct'
2170
[00:10:04] generating struct-x64-mingw32.def
2171
[00:10:05] compiling ../../../../ruby/ext/-test-/struct/duplicate.c
2172
[00:10:05] compiling ../../../../ruby/ext/-test-/string/coderange.c
2173
[00:10:06] compiling ../../../../ruby/ext/-test-/struct/init.c
2174
[00:10:07] compiling ../../../../ruby/ext/-test-/string/cstr.c
2175
[00:10:07] compiling ../../../../ruby/ext/-test-/struct/len.c
2176
[00:10:08] compiling ../../../../ruby/ext/-test-/string/ellipsize.c
2177
[00:10:08] compiling ../../../../ruby/ext/-test-/struct/member.c
2178
[00:10:09] compiling ../../../../ruby/ext/-test-/string/enc_associate.c
2179
[00:10:10] linking shared-object -test-/struct.so
2180
[00:10:10] make[2]: Leaving directory '/c/projects/ruby-loco/build/ext/-test-/struct'
2181
[00:10:10] make[2]: Entering directory '/c/projects/ruby-loco/build/ext/-test-/symbol'
2182
[00:10:10] generating symbol-x64-mingw32.def
2183
[00:10:10] compiling ../../../../ruby/ext/-test-/symbol/init.c
2184
[00:10:10] compiling ../../../../ruby/ext/-test-/string/enc_str_buf_cat.c
2185
[00:10:11] compiling ../../../../ruby/ext/-test-/symbol/type.c
2186
[00:10:12] compiling ../../../../ruby/ext/-test-/string/fstring.c
2187
[00:10:13] linking shared-object -test-/symbol.so
2188
[00:10:13] make[2]: Leaving directory '/c/projects/ruby-loco/build/ext/-test-/symbol'
2189
[00:10:13] make[2]: Entering directory '/c/projects/ruby-loco/build/ext/-test-/thread_fd_close'
2190
[00:10:13] generating thread_fd_close-x64-mingw32.def
2191
[00:10:13] compiling ../../../../ruby/ext/-test-/string/init.c
2192
[00:10:13] compiling ../../../../ruby/ext/-test-/thread_fd_close/thread_fd_close.c
2193
[00:10:14] compiling ../../../../ruby/ext/-test-/string/modify.c
2194
[00:10:14] linking shared-object -test-/thread_fd_close.so
2195
[00:10:14] make[2]: Leaving directory '/c/projects/ruby-loco/build/ext/-test-/thread_fd_close'
2196
[00:10:14] make[2]: Entering directory '/c/projects/ruby-loco/build/ext/-test-/time'
2197
[00:10:15] generating time-x64-mingw32.def
2198
[00:10:15] compiling ../../../../ruby/ext/-test-/time/init.c
2199
[00:10:15] compiling ../../../../ruby/ext/-test-/string/new.c
2200
[00:10:16] compiling ../../../../ruby/ext/-test-/time/leap_second.c
2201
[00:10:16] compiling ../../../../ruby/ext/-test-/string/nofree.c
2202
[00:10:17] compiling ../../../../ruby/ext/-test-/time/new.c
2203
[00:10:18] compiling ../../../../ruby/ext/-test-/string/normalize.c
2204
[00:10:19] linking shared-object -test-/time.so
2205
[00:10:19] make[2]: Leaving directory '/c/projects/ruby-loco/build/ext/-test-/time'
2206
[00:10:19] make[2]: Entering directory '/c/projects/ruby-loco/build/ext/-test-/tracepoint'
2207
[00:10:19] generating tracepoint-x64-mingw32.def
2208
[00:10:19] compiling ../../../../ruby/ext/-test-/string/qsort.c
2209
[00:10:19] compiling ../../../../ruby/ext/-test-/tracepoint/gc_hook.c
2210
[00:10:20] compiling ../../../../ruby/ext/-test-/tracepoint/tracepoint.c
2211
[00:10:20] compiling ../../../../ruby/ext/-test-/string/set_len.c
2212
[00:10:21] linking shared-object -test-/string.so
2213
[00:10:21] linking shared-object -test-/tracepoint.so
2214
[00:10:21] make[2]: Leaving directory '/c/projects/ruby-loco/build/ext/-test-/string'
2215
[00:10:21] make[2]: Leaving directory '/c/projects/ruby-loco/build/ext/-test-/tracepoint'
2216
[00:10:21] make[2]: Entering directory '/c/projects/ruby-loco/build/ext/-test-/typeddata'
2217
[00:10:21] generating typeddata-x64-mingw32.def
2218
[00:10:21] make[2]: Entering directory '/c/projects/ruby-loco/build/ext/-test-/vm'
2219
[00:10:21] generating at_exit-x64-mingw32.def
2220
[00:10:22] compiling ../../../../ruby/ext/-test-/typeddata/typeddata.c
2221
[00:10:22] compiling ../../../../ruby/ext/-test-/vm/at_exit.c
2222
[00:10:23] linking shared-object -test-/vm/at_exit.so
2223
[00:10:23] linking shared-object -test-/typeddata.so
2224
[00:10:23] make[2]: Leaving directory '/c/projects/ruby-loco/build/ext/-test-/vm'
2225
[00:10:23] make[2]: Entering directory '/c/projects/ruby-loco/build/ext/-test-/wait_for_single_fd'
2226
[00:10:23] generating wait_for_single_fd-x64-mingw32.def
2227
[00:10:23] make[2]: Leaving directory '/c/projects/ruby-loco/build/ext/-test-/typeddata'
2228
[00:10:23] make[2]: Entering directory '/c/projects/ruby-loco/build/ext/-test-/win32/console'
2229
[00:10:23] generating console-x64-mingw32.def
2230
[00:10:23] compiling ../../../../ruby/ext/-test-/wait_for_single_fd/wait_for_single_fd.c
2231
[00:10:23] compiling ../../../../../ruby/ext/-test-/win32/console/attribute.c
2232
[00:10:24] linking shared-object -test-/wait_for_single_fd.so
2233
[00:10:24] compiling ../../../../../ruby/ext/-test-/win32/console/init.c
2234
[00:10:24] make[2]: Leaving directory '/c/projects/ruby-loco/build/ext/-test-/wait_for_single_fd'
2235
[00:10:24] make[2]: Entering directory '/c/projects/ruby-loco/build/ext/-test-/win32/dln'
2236
[00:10:25] generating dln-x64-mingw32.def
2237
[00:10:25] compiling ../../../../../ruby/ext/-test-/win32/dln/dlntest.c
2238
[00:10:26] compiling ../../../../../ruby/ext/-test-/win32/dln/libdlntest.c
2239
[00:10:26] linking shared-object dlntest.dll
2240
[00:10:26] linking shared-object -test-/win32/dln.so
2241
[00:10:26] make[2]: Leaving directory '/c/projects/ruby-loco/build/ext/-test-/win32/dln'
2242
[00:10:26] make[2]: Entering directory '/c/projects/ruby-loco/build/ext/-test-/win32/fd_setsize'
2243
[00:10:26] linking shared-object -test-/win32/console.so
2244
[00:10:26] generating fd_setsize-x64-mingw32.def
2245
[00:10:26] make[2]: Leaving directory '/c/projects/ruby-loco/build/ext/-test-/win32/console'
2246
[00:10:26] make[2]: Entering directory '/c/projects/ruby-loco/build/ext/bigdecimal'
2247
[00:10:26] generating bigdecimal-x64-mingw32.def
2248
[00:10:26] compiling ../../../../../ruby/ext/-test-/win32/fd_setsize/fd_setsize.c
2249
[00:10:27] compiling ../../../ruby/ext/bigdecimal/bigdecimal.c
2250
[00:10:27] linking shared-object -test-/win32/fd_setsize.so
2251
[00:10:28] make[2]: Leaving directory '/c/projects/ruby-loco/build/ext/-test-/win32/fd_setsize'
2252
[00:10:28] make[2]: Entering directory '/c/projects/ruby-loco/build/ext/cgi/escape'
2253
[00:10:28] generating escape-x64-mingw32.def
2254
[00:10:28] In file included from ../../../ruby/ext/bigdecimal/bigdecimal.c:13:
2255
[00:10:28] ../../../ruby/ext/bigdecimal/bigdecimal.h:79:1: error: static declaration of 'labs' follows non-static declaration
2256
[00:10:28]  labs(long const x)
2257
[00:10:28]  ^~~~
2258
[00:10:28] 
2259
[00:10:28] In file included from ../../../ruby/include/ruby/defines.h:121,
2260
[00:10:28]                  from ../../../ruby/include/ruby/ruby.h:29,
2261
[00:10:28]                  from ../../../ruby/ext/bigdecimal/bigdecimal.h:14,
2262
[00:10:28]                  from ../../../ruby/ext/bigdecimal/bigdecimal.c:13:
2263
[00:10:28] C:/msys64/mingw64/x86_64-w64-mingw32/include/stdlib.h:384:16: note: previous declaration of 'labs' was here
2264
[00:10:28]    long __cdecl labs(long _X);
2265
[00:10:28]                 ^~~~
2266
[00:10:28] 
2267
[00:10:28] In file included from ../../../ruby/ext/bigdecimal/bigdecimal.c:13:
2268
[00:10:28] ../../../ruby/ext/bigdecimal/bigdecimal.h:122:1: error: redefinition of 'rb_array_const_ptr'
2269
[00:10:28]  rb_array_const_ptr(VALUE a)
2270
[00:10:28]  ^~~~~~~~~~~~~~~~~~
2271
[00:10:28] 
2272
[00:10:28] In file included from ../../../ruby/ext/bigdecimal/bigdecimal.h:14,
2273
[00:10:28]                  from ../../../ruby/ext/bigdecimal/bigdecimal.c:13:
2274
[00:10:28] ../../../ruby/include/ruby/ruby.h:2113:1: note: previous definition of 'rb_array_const_ptr' was here
2275
[00:10:28]  rb_array_const_ptr(VALUE a)
2276
[00:10:28]  ^~~~~~~~~~~~~~~~~~
2277
[00:10:28] 
2278
[00:10:28] In file included from ../../../ruby/ext/bigdecimal/bigdecimal.c:13:
2279
[00:10:28] ../../../ruby/ext/bigdecimal/bigdecimal.h:139:1: error: static declaration of 'rb_sym2str' follows non-static declaration
2280
[00:10:28]  rb_sym2str(VALUE sym)
2281
[00:10:28]  ^~~~~~~~~~
2282
[00:10:28] 
2283
[00:10:28] In file included from ../../../ruby/ext/bigdecimal/bigdecimal.h:14,
2284
[00:10:28]                  from ../../../ruby/ext/bigdecimal/bigdecimal.c:13:
2285
[00:10:28] ../../../ruby/include/ruby/ruby.h:1774:7: note: previous declaration of 'rb_sym2str' was here
2286
[00:10:28]  VALUE rb_sym2str(VALUE);
2287
[00:10:28]        ^~~~~~~~~~
2288
[00:10:28] 
2289
[00:10:28] ../../../ruby/ext/bigdecimal/bigdecimal.c:108:1: error: static declaration of 'rb_rational_num' follows non-static declaration
2290
[00:10:28]  rb_rational_num(VALUE rat)
2291
[00:10:28]  ^~~~~~~~~~~~~~~
2292
[00:10:28] 
2293
[00:10:28] In file included from ../../../ruby/include/ruby/ruby.h:2079,
2294
[00:10:28]                  from ../../../ruby/ext/bigdecimal/bigdecimal.h:14,
2295
[00:10:28]                  from ../../../ruby/ext/bigdecimal/bigdecimal.c:13:
2296
[00:10:28] ../../../ruby/include/ruby/intern.h:180:7: note: previous declaration of 'rb_rational_num' was here
2297
[00:10:28]  VALUE rb_rational_num(VALUE rat);
2298
[00:10:28]        ^~~~~~~~~~~~~~~
2299
[00:10:28] 
2300
[00:10:28] ../../../ruby/ext/bigdecimal/bigdecimal.c:120:1: error: static declaration of 'rb_rational_den' follows non-static declaration
2301
[00:10:28]  rb_rational_den(VALUE rat)
2302
[00:10:28]  ^~~~~~~~~~~~~~~
2303
[00:10:28] 
2304
[00:10:28] In file included from ../../../ruby/include/ruby/ruby.h:2079,
2305
[00:10:28]                  from ../../../ruby/ext/bigdecimal/bigdecimal.h:14,
2306
[00:10:28]                  from ../../../ruby/ext/bigdecimal/bigdecimal.c:13:
2307
[00:10:28] ../../../ruby/include/ruby/intern.h:181:7: note: previous declaration of 'rb_rational_den' was here
2308
[00:10:28]  VALUE rb_rational_den(VALUE rat);
2309
[00:10:28]        ^~~~~~~~~~~~~~~
2310
[00:10:28] 
2311
[00:10:28] compiling ../../../../ruby/ext/cgi/escape/escape.c
2312
[00:10:28] make[2]: *** [Makefile:284: bigdecimal.o] Error 1
2313
[00:10:28] 
2314
[00:10:28] make[2]: Leaving directory '/c/projects/ruby-loco/build/ext/bigdecimal'
2315
[00:10:28] make[1]: *** [exts.mk:198: ext/bigdecimal/all] Error 2
2316
[00:10:28] 
2317
[00:10:28] make[1]: *** Waiting for unfinished jobs....
2318
[00:10:28] 
2319
[00:10:30] linking shared-object cgi/escape.so
2320
[00:10:30] make[2]: Leaving directory '/c/projects/ruby-loco/build/ext/cgi/escape'
2321
[00:10:30] make[1]: Leaving directory '/c/projects/ruby-loco/build'
2322
[00:10:30] make: *** [uncommon.mk:283: build-ext] Error 2
2323
[00:10:30] 
2324
[00:10:30] rm x64-msvcrt-ruby260.rc
2325
[00:10:30] ――――――――――――――――――――――――――――――――――――――――――――――――――――――――――――――――――――――――――――――――
2326
[00:10:30] Failed - make -j2 2>&1
2327
[00:10:30] Command executed with exception: make: *** [uncommon.mk:283: build-ext] Error 2
2328
[00:10:30] 
2329
[00:10:30] ren C:\Windows\System32\libssl-1_1-x64.dll_    libssl-1_1-x64.dll
2330
[00:10:30] ren C:\Windows\System32\libcrypto-1_1-x64.dll_ libcrypto-1_1-x64.dll
2331
[00:10:30]