output-r36887.txt

Vit Ondruch, 09/04/2012 04:29 PM

Download (48.6 KB)

 
1
./miniruby -I./lib -I. -I.ext/common  ./tool/runruby.rb --extout=.ext  -- --disable-gems "./test/runner.rb" --ruby="./miniruby -I./lib -I. -I.ext/common  ./tool/runruby.rb --extout=.ext  -- --disable-gems"  -v 'test/webrick/test_httpauth.rb'
2
Run options: "--ruby=./miniruby -I./lib -I. -I.ext/common  ./tool/runruby.rb --extout=.ext  -- --disable-gems" -v
3

    
4
# Running tests:
5

    
6
TestWEBrickHTTPAuth#test_basic_auth = 0.03 s = .
7
TestWEBrickHTTPAuth#test_basic_auth2 = 0.03 s = .
8
TestWEBrickHTTPAuth#test_basic_auth3 = 0.00 s = .
9
TestWEBrickHTTPAuth#test_digest_auth = md5_dgst.c(78): OpenSSL internal error, assertion failed: Digest MD5 forbidden in FIPS mode!
10
make: *** [yes-test-all] Aborted (core dumped)
11
./miniruby -I./lib -I. -I.ext/common  ./tool/runruby.rb --extout=.ext  -- --disable-gems "./test/runner.rb" --ruby="./miniruby -I./lib -I. -I.ext/common  ./tool/runruby.rb --extout=.ext  -- --disable-gems"  -v 'test/digest/test_digest.rb'
12
Run options: "--ruby=./miniruby -I./lib -I. -I.ext/common  ./tool/runruby.rb --extout=.ext  -- --disable-gems" -v
13

    
14
# Running tests:
15

    
16
TestDigest::TestBase#test_base = 0.00 s = .
17
TestDigest::TestMD5#test_alignment = md5_dgst.c(78): OpenSSL internal error, assertion failed: Digest MD5 forbidden in FIPS mode!
18
make: *** [yes-test-all] Aborted (core dumped)
19
./miniruby -I./lib -I. -I.ext/common  ./tool/runruby.rb --extout=.ext  -- --disable-gems "./test/runner.rb" --ruby="./miniruby -I./lib -I. -I.ext/common  ./tool/runruby.rb --extout=.ext  -- --disable-gems"  -v 'test/digest/test_digest_hmac.rb'
20
Run options: "--ruby=./miniruby -I./lib -I. -I.ext/common  ./tool/runruby.rb --extout=.ext  -- --disable-gems" -v
21

    
22
# Running tests:
23

    
24
TC_HMAC_MD5#test_hexdigest = md5_dgst.c(78): OpenSSL internal error, assertion failed: Digest MD5 forbidden in FIPS mode!
25
make: *** [yes-test-all] Aborted (core dumped)
26
./miniruby -I./lib -I. -I.ext/common  ./tool/runruby.rb --extout=.ext  -- --disable-gems "./test/runner.rb" --ruby="./miniruby -I./lib -I. -I.ext/common  ./tool/runruby.rb --extout=.ext  -- --disable-gems"  -v 'test/psych/test_yamlstore.rb'
27
md5_dgst.c(78): OpenSSL internal error, assertion failed: Digest MD5 forbidden in FIPS mode!
28
make: *** [yes-test-all] Aborted (core dumped)
29
./miniruby -I./lib -I. -I.ext/common  ./tool/runruby.rb --extout=.ext  -- --disable-gems "./test/runner.rb" --ruby="./miniruby -I./lib -I. -I.ext/common  ./tool/runruby.rb --extout=.ext  -- --disable-gems"  -v 'test/openssl/test_ssl.rb'
30
Run options: "--ruby=./miniruby -I./lib -I. -I.ext/common  ./tool/runruby.rb --extout=.ext  -- --disable-gems" -v
31

    
32
# Running tests:
33

    
34
OpenSSL::TestSSL#test_client_auth = 0.06 s = E
35
OpenSSL::TestSSL#test_client_ca = 0.04 s = E
36
OpenSSL::TestSSL#test_connect_and_close = 0.07 s = .
37
OpenSSL::TestSSL#test_ctx_setup = 0.02 s = .
38
OpenSSL::TestSSL#test_ctx_setup_no_compression = 0.02 s = .
39
OpenSSL::TestSSL#test_exception_in_verify_callback_is_ignored = 0.03 s = .
40
OpenSSL::TestSSL#test_forbid_ssl_v3_for_client = 0.03 s = .
41
OpenSSL::TestSSL#test_forbid_ssl_v3_from_server = 0.03 s = .
42
OpenSSL::TestSSL#test_forbid_tls_v1_1_for_client = 0.03 s = .
43
OpenSSL::TestSSL#test_forbid_tls_v1_1_from_server = 0.03 s = .
44
OpenSSL::TestSSL#test_forbid_tls_v1_2_for_client = 0.03 s = .
45
OpenSSL::TestSSL#test_forbid_tls_v1_2_from_server = 0.03 s = .
46
OpenSSL::TestSSL#test_forbid_tls_v1_for_client = 0.03 s = .
47
OpenSSL::TestSSL#test_forbid_tls_v1_from_server = 0.03 s = .
48
OpenSSL::TestSSL#test_multibyte_read_write = 0.10 s = .
49
OpenSSL::TestSSL#test_not_started_session = 0.03 s = .
50
OpenSSL::TestSSL#test_npn_advertised_protocol_too_long = 0.02 s = .
51
OpenSSL::TestSSL#test_npn_protocol_selection_ary = 0.07 s = .
52
OpenSSL::TestSSL#test_npn_protocol_selection_cancel = 0.03 s = .
53
OpenSSL::TestSSL#test_npn_protocol_selection_enum = 0.07 s = .
54
OpenSSL::TestSSL#test_npn_selected_protocol_too_long = 0.03 s = .
55
OpenSSL::TestSSL#test_parallel = 0.37 s = .
56
OpenSSL::TestSSL#test_post_connection_check = 0.11 s = .
57
OpenSSL::TestSSL#test_read_and_write = 0.10 s = .
58
OpenSSL::TestSSL#test_renegotiation_cb = 0.04 s = .
59
OpenSSL::TestSSL#test_ssl_read_nonblock = 0.04 s = .
60
OpenSSL::TestSSL#test_sslctx_set_params = 0.03 s = .
61
OpenSSL::TestSSL#test_starttls = 1.06 s = .
62
OpenSSL::TestSSL#test_tls_v1_1 = 0.04 s = .
63
OpenSSL::TestSSL#test_tls_v1_2 = 0.04 s = .
64
OpenSSL::TestSSL#test_tlsext_hostname = 0.07 s = .
65
OpenSSL::TestSSL#test_unset_OP_ALL = 0.05 s = .
66
OpenSSL::TestSSL#test_verify_result = 0.06 s = .
67

    
68

    
69
Finished tests in 2.847139s, 11.5906 tests/s, 100.8029 assertions/s.
70

    
71
  1) Error:
72
test_client_auth(OpenSSL::TestSSL):
73
OpenSSL::SSL::SSLError: SSL_connect returned=1 errno=0 state=SSLv3 write certificate verify A: EVP lib
74
    /home/mockbuild/rpmbuild/BUILD/ruby-2.0.0-r36887/test/openssl/test_ssl.rb:607:in `connect'
75
    /home/mockbuild/rpmbuild/BUILD/ruby-2.0.0-r36887/test/openssl/test_ssl.rb:607:in `server_connect'
76
    /home/mockbuild/rpmbuild/BUILD/ruby-2.0.0-r36887/test/openssl/test_ssl.rb:116:in `block in test_client_auth'
77
    /home/mockbuild/rpmbuild/BUILD/ruby-2.0.0-r36887/test/openssl/utils.rb:293:in `call'
78
    /home/mockbuild/rpmbuild/BUILD/ruby-2.0.0-r36887/test/openssl/utils.rb:293:in `start_server'
79
    /home/mockbuild/rpmbuild/BUILD/ruby-2.0.0-r36887/test/openssl/test_ssl.rb:105:in `test_client_auth'
80

    
81
  2) Error:
82
test_client_ca(OpenSSL::TestSSL):
83
OpenSSL::SSL::SSLError: SSL_connect returned=1 errno=0 state=SSLv3 write certificate verify A: EVP lib
84
    /home/mockbuild/rpmbuild/BUILD/ruby-2.0.0-r36887/test/openssl/test_ssl.rb:607:in `connect'
85
    /home/mockbuild/rpmbuild/BUILD/ruby-2.0.0-r36887/test/openssl/test_ssl.rb:607:in `server_connect'
86
    /home/mockbuild/rpmbuild/BUILD/ruby-2.0.0-r36887/test/openssl/test_ssl.rb:149:in `block in test_client_ca'
87
    /home/mockbuild/rpmbuild/BUILD/ruby-2.0.0-r36887/test/openssl/utils.rb:293:in `call'
88
    /home/mockbuild/rpmbuild/BUILD/ruby-2.0.0-r36887/test/openssl/utils.rb:293:in `start_server'
89
    /home/mockbuild/rpmbuild/BUILD/ruby-2.0.0-r36887/test/openssl/test_ssl.rb:142:in `test_client_ca'
90

    
91
33 tests, 287 assertions, 0 failures, 2 errors, 0 skips
92

    
93
ruby -v: ruby 2.0.0dev (2012-09-03 trunk 36887) [x86_64-linux]
94
make: *** [yes-test-all] Error 2
95
./miniruby -I./lib -I. -I.ext/common  ./tool/runruby.rb --extout=.ext  -- --disable-gems "./test/runner.rb" --ruby="./miniruby -I./lib -I. -I.ext/common  ./tool/runruby.rb --extout=.ext  -- --disable-gems"  -v 'test/openssl/test_x509crl.rb'
96
Run options: "--ruby=./miniruby -I./lib -I. -I.ext/common  ./tool/runruby.rb --extout=.ext  -- --disable-gems" -v
97

    
98
# Running tests:
99

    
100
OpenSSL::TestX509CRL#test_basic = 0.02 s = .
101
OpenSSL::TestX509CRL#test_crlnumber = 0.03 s = .
102
OpenSSL::TestX509CRL#test_extension = 0.01 s = .
103
OpenSSL::TestX509CRL#test_revoked = 0.17 s = .
104
OpenSSL::TestX509CRL#test_sign_and_verify = 0.01 s = E
105

    
106

    
107
Finished tests in 0.253423s, 19.7298 tests/s, 319.6232 assertions/s.
108

    
109
  1) Error:
110
test_sign_and_verify(OpenSSL::TestX509CRL):
111
OpenSSL::X509::CertificateError: EVP lib
112
    /home/mockbuild/rpmbuild/BUILD/ruby-2.0.0-r36887/test/openssl/utils.rb:136:in `sign'
113
    /home/mockbuild/rpmbuild/BUILD/ruby-2.0.0-r36887/test/openssl/utils.rb:136:in `issue_cert'
114
    /home/mockbuild/rpmbuild/BUILD/ruby-2.0.0-r36887/test/openssl/test_x509crl.rb:24:in `issue_cert'
115
    /home/mockbuild/rpmbuild/BUILD/ruby-2.0.0-r36887/test/openssl/test_x509crl.rb:200:in `test_sign_and_verify'
116

    
117
5 tests, 81 assertions, 0 failures, 1 errors, 0 skips
118

    
119
ruby -v: ruby 2.0.0dev (2012-09-03 trunk 36887) [x86_64-linux]
120
make: *** [yes-test-all] Error 1
121
./miniruby -I./lib -I. -I.ext/common  ./tool/runruby.rb --extout=.ext  -- --disable-gems "./test/runner.rb" --ruby="./miniruby -I./lib -I. -I.ext/common  ./tool/runruby.rb --extout=.ext  -- --disable-gems"  -v 'test/openssl/test_x509name.rb'
122
Run options: "--ruby=./miniruby -I./lib -I. -I.ext/common  ./tool/runruby.rb --extout=.ext  -- --disable-gems" -v
123

    
124
# Running tests:
125

    
126
OpenSSL::TestX509Name#test_add_entry = 0.00 s = .
127
OpenSSL::TestX509Name#test_add_entry_street = 0.00 s = .
128
OpenSSL::TestX509Name#test_equals2 = 0.00 s = .
129
OpenSSL::TestX509Name#test_hash = md5_dgst.c(78): OpenSSL internal error, assertion failed: Digest MD5 forbidden in FIPS mode!
130
make: *** [yes-test-all] Aborted (core dumped)
131
./miniruby -I./lib -I. -I.ext/common  ./tool/runruby.rb --extout=.ext  -- --disable-gems "./test/runner.rb" --ruby="./miniruby -I./lib -I. -I.ext/common  ./tool/runruby.rb --extout=.ext  -- --disable-gems"  -v 'test/openssl/test_cipher.rb'
132
Run options: "--ruby=./miniruby -I./lib -I. -I.ext/common  ./tool/runruby.rb --extout=.ext  -- --disable-gems" -v
133

    
134
# Running tests:
135

    
136
OpenSSL::TestCipher#test_AES = 0.00 s = .
137
OpenSSL::TestCipher#test_AES_crush = 0.01 s = .
138
OpenSSL::TestCipher#test_ciphers = 0.00 s = .
139
OpenSSL::TestCipher#test_crypt = 0.00 s = F
140
OpenSSL::TestCipher#test_dup = 0.00 s = .
141
OpenSSL::TestCipher#test_empty_data = 0.00 s = .
142
OpenSSL::TestCipher#test_info = 0.00 s = .
143
OpenSSL::TestCipher#test_initialize = 0.00 s = .
144
OpenSSL::TestCipher#test_reset = 0.00 s = .
145

    
146

    
147
Finished tests in 0.022583s, 398.5251 tests/s, 26214.0980 assertions/s.
148

    
149
  1) Failure:
150
test_crypt(OpenSSL::TestCipher) [/home/mockbuild/rpmbuild/BUILD/ruby-2.0.0-r36887/test/openssl/test_cipher.rb:25]:
151
encrypt.
152
<"B+\x9D\xDD{\xD1M\xBE"> expected but was
153
<"\xE1,\t\x10,\xE0\xC8\v">.
154

    
155
9 tests, 592 assertions, 1 failures, 0 errors, 0 skips
156

    
157
ruby -v: ruby 2.0.0dev (2012-09-03 trunk 36887) [x86_64-linux]
158
make: *** [yes-test-all] Error 1
159
./miniruby -I./lib -I. -I.ext/common  ./tool/runruby.rb --extout=.ext  -- --disable-gems "./test/runner.rb" --ruby="./miniruby -I./lib -I. -I.ext/common  ./tool/runruby.rb --extout=.ext  -- --disable-gems"  -v 'test/openssl/test_digest.rb'
160
Run options: "--ruby=./miniruby -I./lib -I. -I.ext/common  ./tool/runruby.rb --extout=.ext  -- --disable-gems" -v
161

    
162
# Running tests:
163

    
164
OpenSSL::TestDigest#test_098_features = 0.00 s = E
165
OpenSSL::TestDigest#test_digest = 0.00 s = E
166
OpenSSL::TestDigest#test_digest_by_oid_and_name = 0.00 s = E
167
OpenSSL::TestDigest#test_digest_by_oid_and_name_sha2 = 0.00 s = E
168
OpenSSL::TestDigest#test_digest_constants = 0.00 s = E
169
OpenSSL::TestDigest#test_dup = 0.00 s = E
170
OpenSSL::TestDigest#test_eql = 0.00 s = E
171
OpenSSL::TestDigest#test_info = 0.00 s = E
172
OpenSSL::TestDigest#test_openssl_digest = 0.00 s = E
173
OpenSSL::TestDigest#test_reset = 0.00 s = E
174

    
175

    
176
Finished tests in 0.015126s, 661.1251 tests/s, 0.0000 assertions/s.
177

    
178
  1) Error:
179
test_098_features(OpenSSL::TestDigest):
180
OpenSSL::Digest::DigestError: Digest initialization failed.: disabled for fips
181
    /home/mockbuild/rpmbuild/BUILD/ruby-2.0.0-r36887/.ext/common/openssl/digest.rb:66:in `initialize'
182
    /home/mockbuild/rpmbuild/BUILD/ruby-2.0.0-r36887/.ext/common/openssl/digest.rb:66:in `initialize'
183
    /home/mockbuild/rpmbuild/BUILD/ruby-2.0.0-r36887/test/openssl/test_digest.rb:7:in `new'
184
    /home/mockbuild/rpmbuild/BUILD/ruby-2.0.0-r36887/test/openssl/test_digest.rb:7:in `setup'
185

    
186
  2) Error:
187
test_digest(OpenSSL::TestDigest):
188
OpenSSL::Digest::DigestError: Digest initialization failed.: disabled for fips
189
    /home/mockbuild/rpmbuild/BUILD/ruby-2.0.0-r36887/.ext/common/openssl/digest.rb:66:in `initialize'
190
    /home/mockbuild/rpmbuild/BUILD/ruby-2.0.0-r36887/.ext/common/openssl/digest.rb:66:in `initialize'
191
    /home/mockbuild/rpmbuild/BUILD/ruby-2.0.0-r36887/test/openssl/test_digest.rb:7:in `new'
192
    /home/mockbuild/rpmbuild/BUILD/ruby-2.0.0-r36887/test/openssl/test_digest.rb:7:in `setup'
193

    
194
  3) Error:
195
test_digest_by_oid_and_name(OpenSSL::TestDigest):
196
OpenSSL::Digest::DigestError: Digest initialization failed.: disabled for fips
197
    /home/mockbuild/rpmbuild/BUILD/ruby-2.0.0-r36887/.ext/common/openssl/digest.rb:66:in `initialize'
198
    /home/mockbuild/rpmbuild/BUILD/ruby-2.0.0-r36887/.ext/common/openssl/digest.rb:66:in `initialize'
199
    /home/mockbuild/rpmbuild/BUILD/ruby-2.0.0-r36887/test/openssl/test_digest.rb:7:in `new'
200
    /home/mockbuild/rpmbuild/BUILD/ruby-2.0.0-r36887/test/openssl/test_digest.rb:7:in `setup'
201

    
202
  4) Error:
203
test_digest_by_oid_and_name_sha2(OpenSSL::TestDigest):
204
OpenSSL::Digest::DigestError: Digest initialization failed.: disabled for fips
205
    /home/mockbuild/rpmbuild/BUILD/ruby-2.0.0-r36887/.ext/common/openssl/digest.rb:66:in `initialize'
206
    /home/mockbuild/rpmbuild/BUILD/ruby-2.0.0-r36887/.ext/common/openssl/digest.rb:66:in `initialize'
207
    /home/mockbuild/rpmbuild/BUILD/ruby-2.0.0-r36887/test/openssl/test_digest.rb:7:in `new'
208
    /home/mockbuild/rpmbuild/BUILD/ruby-2.0.0-r36887/test/openssl/test_digest.rb:7:in `setup'
209

    
210
  5) Error:
211
test_digest_constants(OpenSSL::TestDigest):
212
OpenSSL::Digest::DigestError: Digest initialization failed.: disabled for fips
213
    /home/mockbuild/rpmbuild/BUILD/ruby-2.0.0-r36887/.ext/common/openssl/digest.rb:66:in `initialize'
214
    /home/mockbuild/rpmbuild/BUILD/ruby-2.0.0-r36887/.ext/common/openssl/digest.rb:66:in `initialize'
215
    /home/mockbuild/rpmbuild/BUILD/ruby-2.0.0-r36887/test/openssl/test_digest.rb:7:in `new'
216
    /home/mockbuild/rpmbuild/BUILD/ruby-2.0.0-r36887/test/openssl/test_digest.rb:7:in `setup'
217

    
218
  6) Error:
219
test_dup(OpenSSL::TestDigest):
220
OpenSSL::Digest::DigestError: Digest initialization failed.: disabled for fips
221
    /home/mockbuild/rpmbuild/BUILD/ruby-2.0.0-r36887/.ext/common/openssl/digest.rb:66:in `initialize'
222
    /home/mockbuild/rpmbuild/BUILD/ruby-2.0.0-r36887/.ext/common/openssl/digest.rb:66:in `initialize'
223
    /home/mockbuild/rpmbuild/BUILD/ruby-2.0.0-r36887/test/openssl/test_digest.rb:7:in `new'
224
    /home/mockbuild/rpmbuild/BUILD/ruby-2.0.0-r36887/test/openssl/test_digest.rb:7:in `setup'
225

    
226
  7) Error:
227
test_eql(OpenSSL::TestDigest):
228
OpenSSL::Digest::DigestError: Digest initialization failed.: disabled for fips
229
    /home/mockbuild/rpmbuild/BUILD/ruby-2.0.0-r36887/.ext/common/openssl/digest.rb:66:in `initialize'
230
    /home/mockbuild/rpmbuild/BUILD/ruby-2.0.0-r36887/.ext/common/openssl/digest.rb:66:in `initialize'
231
    /home/mockbuild/rpmbuild/BUILD/ruby-2.0.0-r36887/test/openssl/test_digest.rb:7:in `new'
232
    /home/mockbuild/rpmbuild/BUILD/ruby-2.0.0-r36887/test/openssl/test_digest.rb:7:in `setup'
233

    
234
  8) Error:
235
test_info(OpenSSL::TestDigest):
236
OpenSSL::Digest::DigestError: Digest initialization failed.: disabled for fips
237
    /home/mockbuild/rpmbuild/BUILD/ruby-2.0.0-r36887/.ext/common/openssl/digest.rb:66:in `initialize'
238
    /home/mockbuild/rpmbuild/BUILD/ruby-2.0.0-r36887/.ext/common/openssl/digest.rb:66:in `initialize'
239
    /home/mockbuild/rpmbuild/BUILD/ruby-2.0.0-r36887/test/openssl/test_digest.rb:7:in `new'
240
    /home/mockbuild/rpmbuild/BUILD/ruby-2.0.0-r36887/test/openssl/test_digest.rb:7:in `setup'
241

    
242
  9) Error:
243
test_openssl_digest(OpenSSL::TestDigest):
244
OpenSSL::Digest::DigestError: Digest initialization failed.: disabled for fips
245
    /home/mockbuild/rpmbuild/BUILD/ruby-2.0.0-r36887/.ext/common/openssl/digest.rb:66:in `initialize'
246
    /home/mockbuild/rpmbuild/BUILD/ruby-2.0.0-r36887/.ext/common/openssl/digest.rb:66:in `initialize'
247
    /home/mockbuild/rpmbuild/BUILD/ruby-2.0.0-r36887/test/openssl/test_digest.rb:7:in `new'
248
    /home/mockbuild/rpmbuild/BUILD/ruby-2.0.0-r36887/test/openssl/test_digest.rb:7:in `setup'
249

    
250
 10) Error:
251
test_reset(OpenSSL::TestDigest):
252
OpenSSL::Digest::DigestError: Digest initialization failed.: disabled for fips
253
    /home/mockbuild/rpmbuild/BUILD/ruby-2.0.0-r36887/.ext/common/openssl/digest.rb:66:in `initialize'
254
    /home/mockbuild/rpmbuild/BUILD/ruby-2.0.0-r36887/.ext/common/openssl/digest.rb:66:in `initialize'
255
    /home/mockbuild/rpmbuild/BUILD/ruby-2.0.0-r36887/test/openssl/test_digest.rb:7:in `new'
256
    /home/mockbuild/rpmbuild/BUILD/ruby-2.0.0-r36887/test/openssl/test_digest.rb:7:in `setup'
257

    
258
10 tests, 0 assertions, 0 failures, 10 errors, 0 skips
259

    
260
ruby -v: ruby 2.0.0dev (2012-09-03 trunk 36887) [x86_64-linux]
261
make: *** [yes-test-all] Error 10
262
./miniruby -I./lib -I. -I.ext/common  ./tool/runruby.rb --extout=.ext  -- --disable-gems "./test/runner.rb" --ruby="./miniruby -I./lib -I. -I.ext/common  ./tool/runruby.rb --extout=.ext  -- --disable-gems"  -v 'test/openssl/test_pkey_dh.rb'
263
Run options: "--ruby=./miniruby -I./lib -I. -I.ext/common  ./tool/runruby.rb --extout=.ext  -- --disable-gems" -v
264

    
265
# Running tests:
266

    
267
OpenSSL::TestPKeyDH#test_generate_key = 0.00 s = E
268
OpenSSL::TestPKeyDH#test_key_exchange = 0.00 s = E
269
OpenSSL::TestPKeyDH#test_new = 13.04 s = .
270
OpenSSL::TestPKeyDH#test_new_break = 0.02 s = .
271
OpenSSL::TestPKeyDH#test_public_key = 0.00 s = .
272
OpenSSL::TestPKeyDH#test_to_der = 0.00 s = .
273
OpenSSL::TestPKeyDH#test_to_pem = 0.00 s = .
274

    
275

    
276
Finished tests in 13.073065s, 0.5355 tests/s, 2.1418 assertions/s.
277

    
278
  1) Error:
279
test_generate_key(OpenSSL::TestPKeyDH):
280
OpenSSL::PKey::DHError: Failed to generate key: key size too small
281
    /home/mockbuild/rpmbuild/BUILD/ruby-2.0.0-r36887/test/openssl/test_pkey_dh.rb:49:in `generate_key!'
282
    /home/mockbuild/rpmbuild/BUILD/ruby-2.0.0-r36887/test/openssl/test_pkey_dh.rb:49:in `test_generate_key'
283

    
284
  2) Error:
285
test_key_exchange(OpenSSL::TestPKeyDH):
286
OpenSSL::PKey::DHError: Failed to generate key: key size too small
287
    /home/mockbuild/rpmbuild/BUILD/ruby-2.0.0-r36887/test/openssl/test_pkey_dh.rb:56:in `generate_key!'
288
    /home/mockbuild/rpmbuild/BUILD/ruby-2.0.0-r36887/test/openssl/test_pkey_dh.rb:56:in `test_key_exchange'
289

    
290
7 tests, 28 assertions, 0 failures, 2 errors, 0 skips
291

    
292
ruby -v: ruby 2.0.0dev (2012-09-03 trunk 36887) [x86_64-linux]
293
make: *** [yes-test-all] Error 2
294
./miniruby -I./lib -I. -I.ext/common  ./tool/runruby.rb --extout=.ext  -- --disable-gems "./test/runner.rb" --ruby="./miniruby -I./lib -I. -I.ext/common  ./tool/runruby.rb --extout=.ext  -- --disable-gems"  -v 'test/openssl/test_hmac.rb'
295
Run options: "--ruby=./miniruby -I./lib -I. -I.ext/common  ./tool/runruby.rb --extout=.ext  -- --disable-gems" -v
296

    
297
# Running tests:
298

    
299
OpenSSL::TestHMAC#test_dup = 0.00 s = E
300
OpenSSL::TestHMAC#test_hmac = 0.00 s = E
301

    
302

    
303
Finished tests in 0.010221s, 195.6781 tests/s, 0.0000 assertions/s.
304

    
305
  1) Error:
306
test_dup(OpenSSL::TestHMAC):
307
OpenSSL::Digest::DigestError: Digest initialization failed.: disabled for fips
308
    /home/mockbuild/rpmbuild/BUILD/ruby-2.0.0-r36887/.ext/common/openssl/digest.rb:51:in `initialize'
309
    /home/mockbuild/rpmbuild/BUILD/ruby-2.0.0-r36887/.ext/common/openssl/digest.rb:51:in `block (3 levels) in <class:Digest>'
310
    /home/mockbuild/rpmbuild/BUILD/ruby-2.0.0-r36887/test/openssl/test_hmac.rb:8:in `new'
311
    /home/mockbuild/rpmbuild/BUILD/ruby-2.0.0-r36887/test/openssl/test_hmac.rb:8:in `setup'
312

    
313
  2) Error:
314
test_hmac(OpenSSL::TestHMAC):
315
OpenSSL::Digest::DigestError: Digest initialization failed.: disabled for fips
316
    /home/mockbuild/rpmbuild/BUILD/ruby-2.0.0-r36887/.ext/common/openssl/digest.rb:51:in `initialize'
317
    /home/mockbuild/rpmbuild/BUILD/ruby-2.0.0-r36887/.ext/common/openssl/digest.rb:51:in `block (3 levels) in <class:Digest>'
318
    /home/mockbuild/rpmbuild/BUILD/ruby-2.0.0-r36887/test/openssl/test_hmac.rb:8:in `new'
319
    /home/mockbuild/rpmbuild/BUILD/ruby-2.0.0-r36887/test/openssl/test_hmac.rb:8:in `setup'
320

    
321
2 tests, 0 assertions, 0 failures, 2 errors, 0 skips
322

    
323
ruby -v: ruby 2.0.0dev (2012-09-03 trunk 36887) [x86_64-linux]
324
make: *** [yes-test-all] Error 2
325
./miniruby -I./lib -I. -I.ext/common  ./tool/runruby.rb --extout=.ext  -- --disable-gems "./test/runner.rb" --ruby="./miniruby -I./lib -I. -I.ext/common  ./tool/runruby.rb --extout=.ext  -- --disable-gems"  -v 'test/openssl/test_engine.rb'
326
Run options: "--ruby=./miniruby -I./lib -I. -I.ext/common  ./tool/runruby.rb --extout=.ext  -- --disable-gems" -v
327

    
328
# Running tests:
329

    
330
OpenSSL::TestEngine#test_engines_free = 0.00 s = .
331
OpenSSL::TestEngine#test_openssl_engine_builtin = 0.00 s = .
332
OpenSSL::TestEngine#test_openssl_engine_by_id_string = 0.00 s = .
333
OpenSSL::TestEngine#test_openssl_engine_cipher_rc4 = 0.00 s = E
334
OpenSSL::TestEngine#test_openssl_engine_digest_sha1 = 0.00 s = E
335
OpenSSL::TestEngine#test_openssl_engine_id_name_inspect = 0.00 s = .
336

    
337

    
338
Finished tests in 0.012416s, 483.2524 tests/s, 1047.0468 assertions/s.
339

    
340
  1) Error:
341
test_openssl_engine_cipher_rc4(OpenSSL::TestEngine):
342
OpenSSL::Engine::EngineError: no such cipher `RC4'
343
    /home/mockbuild/rpmbuild/BUILD/ruby-2.0.0-r36887/test/openssl/test_engine.rb:51:in `cipher'
344
    /home/mockbuild/rpmbuild/BUILD/ruby-2.0.0-r36887/test/openssl/test_engine.rb:51:in `block in test_openssl_engine_cipher_rc4'
345
    /home/mockbuild/rpmbuild/BUILD/ruby-2.0.0-r36887/test/openssl/test_engine.rb:68:in `crypt_data'
346
    /home/mockbuild/rpmbuild/BUILD/ruby-2.0.0-r36887/test/openssl/test_engine.rb:51:in `test_openssl_engine_cipher_rc4'
347

    
348
  2) Error:
349
test_openssl_engine_digest_sha1(OpenSSL::TestEngine):
350
OpenSSL::Digest::DigestError: Digest initialization failed.: disabled for fips
351
    /home/mockbuild/rpmbuild/BUILD/ruby-2.0.0-r36887/test/openssl/test_engine.rb:37:in `digest'
352
    /home/mockbuild/rpmbuild/BUILD/ruby-2.0.0-r36887/test/openssl/test_engine.rb:37:in `test_openssl_engine_digest_sha1'
353

    
354
6 tests, 13 assertions, 0 failures, 2 errors, 0 skips
355

    
356
ruby -v: ruby 2.0.0dev (2012-09-03 trunk 36887) [x86_64-linux]
357
make: *** [yes-test-all] Error 2
358
./miniruby -I./lib -I. -I.ext/common  ./tool/runruby.rb --extout=.ext  -- --disable-gems "./test/runner.rb" --ruby="./miniruby -I./lib -I. -I.ext/common  ./tool/runruby.rb --extout=.ext  -- --disable-gems"  -v 'test/openssl/test_pkey_dsa.rb'
359
Run options: "--ruby=./miniruby -I./lib -I. -I.ext/common  ./tool/runruby.rb --extout=.ext  -- --disable-gems" -v
360

    
361
# Running tests:
362

    
363
OpenSSL::TestPKeyDSA#test_digest_state_irrelevant_verify = 0.00 s = E
364
OpenSSL::TestPKeyDSA#test_export_format_is_DSA_PUBKEY_pem = 0.00 s = .
365
OpenSSL::TestPKeyDSA#test_export_password_length = 0.01 s = .
366
OpenSSL::TestPKeyDSA#test_new = 0.00 s = E
367
OpenSSL::TestPKeyDSA#test_new_break = 0.00 s = E
368
OpenSSL::TestPKeyDSA#test_private = 0.00 s = E
369
OpenSSL::TestPKeyDSA#test_read_DSAPublicKey_pem = 0.00 s = .
370
OpenSSL::TestPKeyDSA#test_read_DSA_PUBKEY = 0.00 s = .
371
OpenSSL::TestPKeyDSA#test_read_DSA_PUBKEY_pem = 0.00 s = .
372
OpenSSL::TestPKeyDSA#test_read_private_key_der = 0.00 s = .
373
OpenSSL::TestPKeyDSA#test_read_private_key_pem = 0.00 s = .
374
OpenSSL::TestPKeyDSA#test_read_private_key_pem_pw = 0.02 s = .
375
OpenSSL::TestPKeyDSA#test_read_public_key_der = 0.00 s = .
376
OpenSSL::TestPKeyDSA#test_read_public_key_pem = 0.00 s = .
377
OpenSSL::TestPKeyDSA#test_sign_verify = 0.00 s = E
378
OpenSSL::TestPKeyDSA#test_sign_verify_sha1 = 0.00 s = E
379
OpenSSL::TestPKeyDSA#test_sign_verify_sha256 = 0.00 s = E
380
OpenSSL::TestPKeyDSA#test_sys_sign_verify = 0.00 s = E
381

    
382

    
383
Finished tests in 0.044350s, 405.8615 tests/s, 1352.8717 assertions/s.
384

    
385
  1) Error:
386
test_digest_state_irrelevant_verify(OpenSSL::TestPKeyDSA):
387
OpenSSL::PKey::PKeyError: key size too small
388
    /home/mockbuild/rpmbuild/BUILD/ruby-2.0.0-r36887/test/openssl/test_pkey_dsa.rb:59:in `sign'
389
    /home/mockbuild/rpmbuild/BUILD/ruby-2.0.0-r36887/test/openssl/test_pkey_dsa.rb:59:in `test_digest_state_irrelevant_verify'
390

    
391
  2) Error:
392
test_new(OpenSSL::TestPKeyDSA):
393
OpenSSL::PKey::DSAError: key size invalid
394
    /home/mockbuild/rpmbuild/BUILD/ruby-2.0.0-r36887/test/openssl/test_pkey_dsa.rb:19:in `initialize'
395
    /home/mockbuild/rpmbuild/BUILD/ruby-2.0.0-r36887/test/openssl/test_pkey_dsa.rb:19:in `new'
396
    /home/mockbuild/rpmbuild/BUILD/ruby-2.0.0-r36887/test/openssl/test_pkey_dsa.rb:19:in `test_new'
397

    
398
  3) Error:
399
test_new_break(OpenSSL::TestPKeyDSA):
400
OpenSSL::PKey::DSAError: key size invalid
401
    /home/mockbuild/rpmbuild/BUILD/ruby-2.0.0-r36887/test/openssl/test_pkey_dsa.rb:26:in `initialize'
402
    /home/mockbuild/rpmbuild/BUILD/ruby-2.0.0-r36887/test/openssl/test_pkey_dsa.rb:26:in `new'
403
    /home/mockbuild/rpmbuild/BUILD/ruby-2.0.0-r36887/test/openssl/test_pkey_dsa.rb:26:in `test_new_break'
404

    
405
  4) Error:
406
test_private(OpenSSL::TestPKeyDSA):
407
OpenSSL::PKey::DSAError: key size invalid
408
    /home/mockbuild/rpmbuild/BUILD/ruby-2.0.0-r36887/test/openssl/test_pkey_dsa.rb:8:in `initialize'
409
    /home/mockbuild/rpmbuild/BUILD/ruby-2.0.0-r36887/test/openssl/test_pkey_dsa.rb:8:in `new'
410
    /home/mockbuild/rpmbuild/BUILD/ruby-2.0.0-r36887/test/openssl/test_pkey_dsa.rb:8:in `test_private'
411

    
412
  5) Error:
413
test_sign_verify(OpenSSL::TestPKeyDSA):
414
OpenSSL::PKey::PKeyError: key size too small
415
    /home/mockbuild/rpmbuild/BUILD/ruby-2.0.0-r36887/test/openssl/test_pkey_dsa.rb:235:in `sign'
416
    /home/mockbuild/rpmbuild/BUILD/ruby-2.0.0-r36887/test/openssl/test_pkey_dsa.rb:235:in `check_sign_verify'
417
    /home/mockbuild/rpmbuild/BUILD/ruby-2.0.0-r36887/test/openssl/test_pkey_dsa.rb:41:in `test_sign_verify'
418

    
419
  6) Error:
420
test_sign_verify_sha1(OpenSSL::TestPKeyDSA):
421
OpenSSL::PKey::PKeyError: key size too small
422
    /home/mockbuild/rpmbuild/BUILD/ruby-2.0.0-r36887/test/openssl/test_pkey_dsa.rb:235:in `sign'
423
    /home/mockbuild/rpmbuild/BUILD/ruby-2.0.0-r36887/test/openssl/test_pkey_dsa.rb:235:in `check_sign_verify'
424
    /home/mockbuild/rpmbuild/BUILD/ruby-2.0.0-r36887/test/openssl/test_pkey_dsa.rb:46:in `test_sign_verify_sha1'
425

    
426
  7) Error:
427
test_sign_verify_sha256(OpenSSL::TestPKeyDSA):
428
OpenSSL::PKey::PKeyError: key size too small
429
    /home/mockbuild/rpmbuild/BUILD/ruby-2.0.0-r36887/test/openssl/test_pkey_dsa.rb:235:in `sign'
430
    /home/mockbuild/rpmbuild/BUILD/ruby-2.0.0-r36887/test/openssl/test_pkey_dsa.rb:235:in `check_sign_verify'
431
    /home/mockbuild/rpmbuild/BUILD/ruby-2.0.0-r36887/test/openssl/test_pkey_dsa.rb:50:in `test_sign_verify_sha256'
432

    
433
  8) Error:
434
test_sys_sign_verify(OpenSSL::TestPKeyDSA):
435
OpenSSL::PKey::DSAError: key size too small
436
    /home/mockbuild/rpmbuild/BUILD/ruby-2.0.0-r36887/test/openssl/test_pkey_dsa.rb:36:in `syssign'
437
    /home/mockbuild/rpmbuild/BUILD/ruby-2.0.0-r36887/test/openssl/test_pkey_dsa.rb:36:in `test_sys_sign_verify'
438

    
439
18 tests, 60 assertions, 0 failures, 8 errors, 0 skips
440

    
441
ruby -v: ruby 2.0.0dev (2012-09-03 trunk 36887) [x86_64-linux]
442
make: *** [yes-test-all] Error 8
443
./miniruby -I./lib -I. -I.ext/common  ./tool/runruby.rb --extout=.ext  -- --disable-gems "./test/runner.rb" --ruby="./miniruby -I./lib -I. -I.ext/common  ./tool/runruby.rb --extout=.ext  -- --disable-gems"  -v 'test/openssl/test_x509req.rb'
444
Run options: "--ruby=./miniruby -I./lib -I. -I.ext/common  ./tool/runruby.rb --extout=.ext  -- --disable-gems" -v
445

    
446
# Running tests:
447

    
448
OpenSSL::TestX509Request#test_attr = 0.00 s = .
449
OpenSSL::TestX509Request#test_public_key = 0.00 s = E
450
OpenSSL::TestX509Request#test_sign_and_verify = 0.00 s = E
451
OpenSSL::TestX509Request#test_subject = 0.00 s = .
452
OpenSSL::TestX509Request#test_version = 0.00 s = .
453

    
454

    
455
Finished tests in 0.022645s, 220.7978 tests/s, 1059.8296 assertions/s.
456

    
457
  1) Error:
458
test_public_key(OpenSSL::TestX509Request):
459
OpenSSL::X509::RequestError: EVP lib
460
    /home/mockbuild/rpmbuild/BUILD/ruby-2.0.0-r36887/test/openssl/test_x509req.rb:19:in `sign'
461
    /home/mockbuild/rpmbuild/BUILD/ruby-2.0.0-r36887/test/openssl/test_x509req.rb:19:in `issue_csr'
462
    /home/mockbuild/rpmbuild/BUILD/ruby-2.0.0-r36887/test/openssl/test_x509req.rb:29:in `test_public_key'
463

    
464
  2) Error:
465
test_sign_and_verify(OpenSSL::TestX509Request):
466
OpenSSL::Digest::DigestError: Digest initialization failed.: disabled for fips
467
    /home/mockbuild/rpmbuild/BUILD/ruby-2.0.0-r36887/.ext/common/openssl/digest.rb:51:in `initialize'
468
    /home/mockbuild/rpmbuild/BUILD/ruby-2.0.0-r36887/.ext/common/openssl/digest.rb:51:in `block (3 levels) in <class:Digest>'
469
    /home/mockbuild/rpmbuild/BUILD/ruby-2.0.0-r36887/test/openssl/test_x509req.rb:110:in `new'
470
    /home/mockbuild/rpmbuild/BUILD/ruby-2.0.0-r36887/test/openssl/test_x509req.rb:110:in `test_sign_and_verify'
471

    
472
5 tests, 24 assertions, 0 failures, 2 errors, 0 skips
473

    
474
ruby -v: ruby 2.0.0dev (2012-09-03 trunk 36887) [x86_64-linux]
475
make: *** [yes-test-all] Error 2
476
./miniruby -I./lib -I. -I.ext/common  ./tool/runruby.rb --extout=.ext  -- --disable-gems "./test/runner.rb" --ruby="./miniruby -I./lib -I. -I.ext/common  ./tool/runruby.rb --extout=.ext  -- --disable-gems"  -v 'test/openssl/test_pkey_rsa.rb'
477
Run options: "--ruby=./miniruby -I./lib -I. -I.ext/common  ./tool/runruby.rb --extout=.ext  -- --disable-gems" -v
478

    
479
# Running tests:
480

    
481
OpenSSL::TestPKeyRSA#test_digest_state_irrelevant_sign = 0.00 s = .
482
OpenSSL::TestPKeyRSA#test_digest_state_irrelevant_verify = 0.00 s = .
483
OpenSSL::TestPKeyRSA#test_export_format_is_RSA_PUBKEY = 0.00 s = E
484
OpenSSL::TestPKeyRSA#test_export_format_is_RSA_PUBKEY_pem = 0.00 s = E
485
OpenSSL::TestPKeyRSA#test_export_password_length = 0.01 s = .
486
OpenSSL::TestPKeyRSA#test_new = 0.00 s = E
487
OpenSSL::TestPKeyRSA#test_new_break = 0.00 s = .
488
OpenSSL::TestPKeyRSA#test_new_exponent_default = 0.00 s = E
489
OpenSSL::TestPKeyRSA#test_new_with_exponent = 0.00 s = E
490
OpenSSL::TestPKeyRSA#test_padding = 0.00 s = E
491
OpenSSL::TestPKeyRSA#test_private = 0.00 s = E
492
OpenSSL::TestPKeyRSA#test_read_RSAPublicKey = 0.00 s = .
493
OpenSSL::TestPKeyRSA#test_read_RSAPublicKey_pem = 0.00 s = .
494
OpenSSL::TestPKeyRSA#test_read_RSA_PUBKEY = 0.00 s = .
495
OpenSSL::TestPKeyRSA#test_read_RSA_PUBKEY_pem = 0.00 s = .
496
OpenSSL::TestPKeyRSA#test_read_private_key_der = 0.00 s = .
497
OpenSSL::TestPKeyRSA#test_read_private_key_pem = 0.00 s = .
498
OpenSSL::TestPKeyRSA#test_read_private_key_pem_pw = 0.02 s = .
499
OpenSSL::TestPKeyRSA#test_read_private_key_pem_pw_exception = 0.01 s = .
500
OpenSSL::TestPKeyRSA#test_read_public_key_der = 0.00 s = .
501
OpenSSL::TestPKeyRSA#test_read_public_key_pem = 0.00 s = .
502
OpenSSL::TestPKeyRSA#test_sign_verify = 0.00 s = .
503

    
504

    
505
Finished tests in 0.060451s, 363.9298 tests/s, 942.9090 assertions/s.
506

    
507
  1) Error:
508
test_export_format_is_RSA_PUBKEY(OpenSSL::TestPKeyRSA):
509
OpenSSL::PKey::RSAError: key too short
510
    /home/mockbuild/rpmbuild/BUILD/ruby-2.0.0-r36887/test/openssl/test_pkey_rsa.rb:177:in `initialize'
511
    /home/mockbuild/rpmbuild/BUILD/ruby-2.0.0-r36887/test/openssl/test_pkey_rsa.rb:177:in `new'
512
    /home/mockbuild/rpmbuild/BUILD/ruby-2.0.0-r36887/test/openssl/test_pkey_rsa.rb:177:in `test_export_format_is_RSA_PUBKEY'
513

    
514
  2) Error:
515
test_export_format_is_RSA_PUBKEY_pem(OpenSSL::TestPKeyRSA):
516
OpenSSL::PKey::RSAError: key too short
517
    /home/mockbuild/rpmbuild/BUILD/ruby-2.0.0-r36887/test/openssl/test_pkey_rsa.rb:183:in `initialize'
518
    /home/mockbuild/rpmbuild/BUILD/ruby-2.0.0-r36887/test/openssl/test_pkey_rsa.rb:183:in `new'
519
    /home/mockbuild/rpmbuild/BUILD/ruby-2.0.0-r36887/test/openssl/test_pkey_rsa.rb:183:in `test_export_format_is_RSA_PUBKEY_pem'
520

    
521
  3) Error:
522
test_new(OpenSSL::TestPKeyRSA):
523
OpenSSL::PKey::RSAError: key too short
524
    /home/mockbuild/rpmbuild/BUILD/ruby-2.0.0-r36887/test/openssl/test_pkey_rsa.rb:45:in `initialize'
525
    /home/mockbuild/rpmbuild/BUILD/ruby-2.0.0-r36887/test/openssl/test_pkey_rsa.rb:45:in `new'
526
    /home/mockbuild/rpmbuild/BUILD/ruby-2.0.0-r36887/test/openssl/test_pkey_rsa.rb:45:in `test_new'
527

    
528
  4) Error:
529
test_new_exponent_default(OpenSSL::TestPKeyRSA):
530
OpenSSL::PKey::RSAError: key too short
531
    /home/mockbuild/rpmbuild/BUILD/ruby-2.0.0-r36887/test/openssl/test_pkey_rsa.rb:52:in `initialize'
532
    /home/mockbuild/rpmbuild/BUILD/ruby-2.0.0-r36887/test/openssl/test_pkey_rsa.rb:52:in `new'
533
    /home/mockbuild/rpmbuild/BUILD/ruby-2.0.0-r36887/test/openssl/test_pkey_rsa.rb:52:in `test_new_exponent_default'
534

    
535
  5) Error:
536
test_new_with_exponent(OpenSSL::TestPKeyRSA):
537
OpenSSL::PKey::RSAError: key too short
538
    /home/mockbuild/rpmbuild/BUILD/ruby-2.0.0-r36887/test/openssl/test_pkey_rsa.rb:58:in `initialize'
539
    /home/mockbuild/rpmbuild/BUILD/ruby-2.0.0-r36887/test/openssl/test_pkey_rsa.rb:58:in `new'
540
    /home/mockbuild/rpmbuild/BUILD/ruby-2.0.0-r36887/test/openssl/test_pkey_rsa.rb:58:in `block in test_new_with_exponent'
541
    /home/mockbuild/rpmbuild/BUILD/ruby-2.0.0-r36887/test/openssl/test_pkey_rsa.rb:56:in `upto'
542
    /home/mockbuild/rpmbuild/BUILD/ruby-2.0.0-r36887/test/openssl/test_pkey_rsa.rb:56:in `test_new_with_exponent'
543

    
544
  6) Error:
545
test_padding(OpenSSL::TestPKeyRSA):
546
OpenSSL::PKey::RSAError: key too short
547
    /home/mockbuild/rpmbuild/BUILD/ruby-2.0.0-r36887/test/openssl/test_pkey_rsa.rb:8:in `initialize'
548
    /home/mockbuild/rpmbuild/BUILD/ruby-2.0.0-r36887/test/openssl/test_pkey_rsa.rb:8:in `new'
549
    /home/mockbuild/rpmbuild/BUILD/ruby-2.0.0-r36887/test/openssl/test_pkey_rsa.rb:8:in `test_padding'
550

    
551
  7) Error:
552
test_private(OpenSSL::TestPKeyRSA):
553
OpenSSL::PKey::RSAError: key too short
554
    /home/mockbuild/rpmbuild/BUILD/ruby-2.0.0-r36887/test/openssl/test_pkey_rsa.rb:34:in `initialize'
555
    /home/mockbuild/rpmbuild/BUILD/ruby-2.0.0-r36887/test/openssl/test_pkey_rsa.rb:34:in `new'
556
    /home/mockbuild/rpmbuild/BUILD/ruby-2.0.0-r36887/test/openssl/test_pkey_rsa.rb:34:in `test_private'
557

    
558
22 tests, 57 assertions, 0 failures, 7 errors, 0 skips
559

    
560
ruby -v: ruby 2.0.0dev (2012-09-03 trunk 36887) [x86_64-linux]
561
make: *** [yes-test-all] Error 7
562
./miniruby -I./lib -I. -I.ext/common  ./tool/runruby.rb --extout=.ext  -- --disable-gems "./test/runner.rb" --ruby="./miniruby -I./lib -I. -I.ext/common  ./tool/runruby.rb --extout=.ext  -- --disable-gems"  -v 'test/openssl/test_ssl_session.rb'
563
Run options: "--ruby=./miniruby -I./lib -I. -I.ext/common  ./tool/runruby.rb --extout=.ext  -- --disable-gems" -v
564

    
565
# Running tests:
566

    
567
OpenSSL::TestSSLSession#test_client_session = 0.10 s = .
568
OpenSSL::TestSSLSession#test_ctx_client_session_cb = 0.02 s = E
569
OpenSSL::TestSSLSession#test_ctx_server_session_cb = 0.02 s = E
570
OpenSSL::TestSSLSession#test_server_session = 0.44 s = .
571
OpenSSL::TestSSLSession#test_session = 0.05 s = .
572
OpenSSL::TestSSLSession#test_session_equals = 0.03 s = .
573
OpenSSL::TestSSLSession#test_session_exts_read = 0.02 s = .
574
OpenSSL::TestSSLSession#test_session_time = 0.02 s = .
575
OpenSSL::TestSSLSession#test_session_timeout = 0.02 s = .
576

    
577

    
578
Finished tests in 0.731516s, 12.3032 tests/s, 95.6917 assertions/s.
579

    
580
  1) Error:
581
test_ctx_client_session_cb(OpenSSL::TestSSLSession):
582
Errno::ECONNRESET: Connection reset by peer - SSL_connect
583
    /home/mockbuild/rpmbuild/BUILD/ruby-2.0.0-r36887/test/openssl/test_ssl_session.rb:294:in `connect'
584
    /home/mockbuild/rpmbuild/BUILD/ruby-2.0.0-r36887/test/openssl/test_ssl_session.rb:294:in `block in test_ctx_client_session_cb'
585
    /home/mockbuild/rpmbuild/BUILD/ruby-2.0.0-r36887/test/openssl/utils.rb:293:in `call'
586
    /home/mockbuild/rpmbuild/BUILD/ruby-2.0.0-r36887/test/openssl/utils.rb:293:in `start_server'
587
    /home/mockbuild/rpmbuild/BUILD/ruby-2.0.0-r36887/test/openssl/test_ssl_session.rb:290:in `test_ctx_client_session_cb'
588

    
589
  2) Error:
590
test_ctx_server_session_cb(OpenSSL::TestSSLSession):
591
Errno::ECONNRESET: Connection reset by peer - SSL_connect
592
    /home/mockbuild/rpmbuild/BUILD/ruby-2.0.0-r36887/test/openssl/test_ssl_session.rb:351:in `connect'
593
    /home/mockbuild/rpmbuild/BUILD/ruby-2.0.0-r36887/test/openssl/test_ssl_session.rb:351:in `block (2 levels) in test_ctx_server_session_cb'
594
    /home/mockbuild/rpmbuild/BUILD/ruby-2.0.0-r36887/test/openssl/test_ssl_session.rb:346:in `times'
595
    /home/mockbuild/rpmbuild/BUILD/ruby-2.0.0-r36887/test/openssl/test_ssl_session.rb:346:in `block in test_ctx_server_session_cb'
596
    /home/mockbuild/rpmbuild/BUILD/ruby-2.0.0-r36887/test/openssl/utils.rb:293:in `call'
597
    /home/mockbuild/rpmbuild/BUILD/ruby-2.0.0-r36887/test/openssl/utils.rb:293:in `start_server'
598
    /home/mockbuild/rpmbuild/BUILD/ruby-2.0.0-r36887/test/openssl/test_ssl_session.rb:344:in `test_ctx_server_session_cb'
599

    
600
9 tests, 70 assertions, 0 failures, 2 errors, 0 skips
601

    
602
ruby -v: ruby 2.0.0dev (2012-09-03 trunk 36887) [x86_64-linux]
603
make: *** [yes-test-all] Error 2
604
./miniruby -I./lib -I. -I.ext/common  ./tool/runruby.rb --extout=.ext  -- --disable-gems "./test/runner.rb" --ruby="./miniruby -I./lib -I. -I.ext/common  ./tool/runruby.rb --extout=.ext  -- --disable-gems"  -v 'test/openssl/test_x509cert.rb'
605
Run options: "--ruby=./miniruby -I./lib -I. -I.ext/common  ./tool/runruby.rb --extout=.ext  -- --disable-gems" -v
606

    
607
# Running tests:
608

    
609
OpenSSL::TestX509Certificate#test_check_private_key = 0.01 s = .
610
OpenSSL::TestX509Certificate#test_dsa_with_sha2 = 0.00 s = .
611
OpenSSL::TestX509Certificate#test_dsig_algorithm_mismatch = 0.00 s = F
612
OpenSSL::TestX509Certificate#test_extension = 0.01 s = E
613
OpenSSL::TestX509Certificate#test_public_key = 0.01 s = E
614
OpenSSL::TestX509Certificate#test_serial = 0.02 s = .
615
OpenSSL::TestX509Certificate#test_sign_and_verify = 0.01 s = E
616
OpenSSL::TestX509Certificate#test_validity = 0.03 s = .
617

    
618

    
619
Finished tests in 0.100077s, 79.9388 tests/s, 439.6632 assertions/s.
620

    
621
  1) Failure:
622
test_dsig_algorithm_mismatch(OpenSSL::TestX509Certificate) [/home/mockbuild/rpmbuild/BUILD/ruby-2.0.0-r36887/test/openssl/test_x509cert.rb:182]:
623
[OpenSSL::X509::CertificateError] exception expected, not
624
Class: <OpenSSL::Digest::DigestError>
625
Message: <"Digest initialization failed.: disabled for fips">
626
---Backtrace---
627
/home/mockbuild/rpmbuild/BUILD/ruby-2.0.0-r36887/.ext/common/openssl/digest.rb:51:in `initialize'
628
/home/mockbuild/rpmbuild/BUILD/ruby-2.0.0-r36887/.ext/common/openssl/digest.rb:51:in `block (3 levels) in <class:Digest>'
629
/home/mockbuild/rpmbuild/BUILD/ruby-2.0.0-r36887/test/openssl/test_x509cert.rb:184:in `new'
630
/home/mockbuild/rpmbuild/BUILD/ruby-2.0.0-r36887/test/openssl/test_x509cert.rb:184:in `block in test_dsig_algorithm_mismatch'
631
---------------
632

    
633
  2) Error:
634
test_public_key(OpenSSL::TestX509Certificate):
635
OpenSSL::X509::CertificateError: EVP lib
636
    /home/mockbuild/rpmbuild/BUILD/ruby-2.0.0-r36887/test/openssl/utils.rb:136:in `sign'
637
    /home/mockbuild/rpmbuild/BUILD/ruby-2.0.0-r36887/test/openssl/utils.rb:136:in `issue_cert'
638
    /home/mockbuild/rpmbuild/BUILD/ruby-2.0.0-r36887/test/openssl/test_x509cert.rb:20:in `issue_cert'
639
    /home/mockbuild/rpmbuild/BUILD/ruby-2.0.0-r36887/test/openssl/test_x509cert.rb:47:in `block in test_public_key'
640
    /home/mockbuild/rpmbuild/BUILD/ruby-2.0.0-r36887/test/openssl/test_x509cert.rb:46:in `each'
641
    /home/mockbuild/rpmbuild/BUILD/ruby-2.0.0-r36887/test/openssl/test_x509cert.rb:46:in `test_public_key'
642

    
643
  3) Error:
644
test_extension(OpenSSL::TestX509Certificate):
645
OpenSSL::Digest::DigestError: Digest initialization failed.: disabled for fips
646
    /home/mockbuild/rpmbuild/BUILD/ruby-2.0.0-r36887/.ext/common/openssl/digest.rb:51:in `initialize'
647
    /home/mockbuild/rpmbuild/BUILD/ruby-2.0.0-r36887/.ext/common/openssl/digest.rb:51:in `block (3 levels) in <class:Digest>'
648
    /home/mockbuild/rpmbuild/BUILD/ruby-2.0.0-r36887/test/openssl/test_x509cert.rb:120:in `new'
649
    /home/mockbuild/rpmbuild/BUILD/ruby-2.0.0-r36887/test/openssl/test_x509cert.rb:120:in `test_extension'
650

    
651
  4) Error:
652
test_sign_and_verify(OpenSSL::TestX509Certificate):
653
OpenSSL::Digest::DigestError: Digest initialization failed.: disabled for fips
654
    /home/mockbuild/rpmbuild/BUILD/ruby-2.0.0-r36887/.ext/common/openssl/digest.rb:51:in `initialize'
655
    /home/mockbuild/rpmbuild/BUILD/ruby-2.0.0-r36887/.ext/common/openssl/digest.rb:51:in `block (3 levels) in <class:Digest>'
656
    /home/mockbuild/rpmbuild/BUILD/ruby-2.0.0-r36887/test/openssl/test_x509cert.rb:140:in `new'
657
    /home/mockbuild/rpmbuild/BUILD/ruby-2.0.0-r36887/test/openssl/test_x509cert.rb:140:in `test_sign_and_verify'
658

    
659
8 tests, 44 assertions, 1 failures, 3 errors, 0 skips
660

    
661
ruby -v: ruby 2.0.0dev (2012-09-03 trunk 36887) [x86_64-linux]
662
make: *** [yes-test-all] Error 4
663
./miniruby -I./lib -I. -I.ext/common  ./tool/runruby.rb --extout=.ext  -- --disable-gems "./test/runner.rb" --ruby="./miniruby -I./lib -I. -I.ext/common  ./tool/runruby.rb --extout=.ext  -- --disable-gems"  -v 'test/cgi/test_cgi_session.rb'
664
md5_dgst.c(78): OpenSSL internal error, assertion failed: Digest MD5 forbidden in FIPS mode!
665
make: *** [yes-test-all] Aborted (core dumped)
666
./miniruby -I./lib -I. -I.ext/common  ./tool/runruby.rb --extout=.ext  -- --disable-gems "./test/runner.rb" --ruby="./miniruby -I./lib -I. -I.ext/common  ./tool/runruby.rb --extout=.ext  -- --disable-gems"  -v 'test/net/pop/test_pop.rb'
667
Run options: "--ruby=./miniruby -I./lib -I. -I.ext/common  ./tool/runruby.rb --extout=.ext  -- --disable-gems" -v
668

    
669
# Running tests:
670

    
671
TestPOP#test_apop_invalid = 0.02 s = .
672
TestPOP#test_apop_invalid_at = 0.01 s = .
673
TestPOP#test_apop_ng = md5_dgst.c(78): OpenSSL internal error, assertion failed: Digest MD5 forbidden in FIPS mode!
674
make: *** [yes-test-all] Aborted (core dumped)
675
./miniruby -I./lib -I. -I.ext/common  ./tool/runruby.rb --extout=.ext  -- --disable-gems "./test/runner.rb" --ruby="./miniruby -I./lib -I. -I.ext/common  ./tool/runruby.rb --extout=.ext  -- --disable-gems"  -v 'test/test_pstore.rb'
676
md5_dgst.c(78): OpenSSL internal error, assertion failed: Digest MD5 forbidden in FIPS mode!
677
make: *** [yes-test-all] Aborted (core dumped)
678
./miniruby -I./lib -I. -I.ext/common  ./tool/runruby.rb --extout=.ext  -- --disable-gems "./test/runner.rb" --ruby="./miniruby -I./lib -I. -I.ext/common  ./tool/runruby.rb --extout=.ext  -- --disable-gems"  -v 'test/rubygems/test_gem_commands_cert_command.rb'
679
Run options: "--ruby=./miniruby -I./lib -I. -I.ext/common  ./tool/runruby.rb --extout=.ext  -- --disable-gems" -v
680

    
681
# Running tests:
682

    
683
TestGemCommandsCertCommand#test_execute_add = 0.03 s = .
684
TestGemCommandsCertCommand#test_execute_list = 0.02 s = .
685
TestGemCommandsCertCommand#test_execute_remove = 0.02 s = .
686
TestGemCommandsCertCommand#test_execute_build = 0.42 s = .
687
TestGemCommandsCertCommand#test_execute_private_key = 0.09 s = F
688
TestGemCommandsCertCommand#test_execute_sign = 0.03 s = .
689
TestGemCommandsCertCommand#test_execute_certificate = 0.02 s = .
690

    
691

    
692
Finished tests in 0.632391s, 11.0691 tests/s, 34.7886 assertions/s.
693

    
694
  1) Failure:
695
test_execute_private_key(TestGemCommandsCertCommand) [/home/mockbuild/rpmbuild/BUILD/ruby-2.0.0-r36887/test/rubygems/test_gem_commands_cert_command.rb:96]:
696
--- expected
697
+++ actual
698
@@ -1,28 +1,29 @@
699
-"-----BEGIN RSA PRIVATE KEY-----
700
-MIIEpQIBAAKCAQEAz0tTOtsJuHDKAEXrQx0f6DUEzBEUTSLR1fk0iEHsY9rDCQxm
701
-sw5Bf2UnVhdD03B4/XzIK+pat2CMQc37/vLIBuVgS7g/fzatGiM0m5rAHtycr0XU
702
-8Ek6zjx4iSv70OLjybY+/utHCEc838awGDMCFR21jYxgATPVwqAIyasvwbKh/Vhw
703
-uErFPqT9G8BKTHsaX+H+ADIRH001OmWkjB6EyjF05114kNMa0+2C7daV9hoBL3md
704
-hCt6zOGcapl/9LkGxhcNEUB/So16V1ZQldg9macGyWktyNTSfctlF+f8okAmicG3
705
-XIwaW8UTmjFCmvDs/h1R/uKpe2IOHz87n29d2QIDAQABAoIBAQCR6n/nyg+JmTtX
706
-/d+hGns/RTLfQpZ7xarXZ9gmoeD4WSE42VXhbIOGXXnXDAFecKl6Jb/xycGZm4if
707
-OZPM3rEWyZeDNWrc7WvkHiwF7GSYVMqmRg2iJqoSSla+mAtl+pBFiNfHMW6K0Tp0
708
-erOyFRW+L2+A9/MMZaRun6AP9URkn0jz2kwmMFf+6szmzVn6fPFzZDRI+hEeaDmi
709
-LBzSrfrddrIBX+xGEoBj6RmfnKBCSUVSSxOauYjd4mVjVYxvMH4SV1hXDUS5GPl5
710
-MbCiBb7bpNIg/8ljMoRrQiqk0XwwS7MaCqPtMhUtpSmC/zSjAfmoN7AOc/Xh69cQ
711
-OCMNZH9BAoGBAPBlsuuU6fg0gVTKDdR12jHx03uRRt8/nPxHnpJkZCIh9XKh1LtY
712
-bkumi9HZpp3mzDiaGg/rwfCwNckKx8NLhICLgkric6ClrKftxTu6C8tBAb5YDi6u
713
-74KYnV8lMY/unzBtIloPgM3uluS292POmrWZpKwhvHLD71MewzMor5HFAoGBANy/
714
-mwsBs8i3Gzk8Twjq8effhPpE7kpxhC7bhwmjX3q41EjQWDT8M6xb1P9dRSsCIebi
715
-kqP1yhl27dJpA8r5WqE/z89xhBvObAGRv41eXxOI0LaH2k5lJQrUeSC+51dy+BEB
716
-T3GXD4C5ezZHQ8Wz/oL73uikrfhD+AqOZT2YbMEFAoGBAJvWEWpOGm3f+4bvhI+Z
717
-5lxCG4oa3wqRvj58XvsfQRovUWGCLtlTtgwsZq8enLf3iaOXohV4Czzvva4Z4u1i
718
-4v5BcbEBo1scixRBOn5BWKvl9C9j/a2dkX3jWQD4p2xaj69gz8f6DNFyPTb+tNhq
719
-cjgO5YUASZ1MDrSfWIKteULRAoGAZkZv8x2KyofrmQ0UITGZerDYz4t4TA1kDMGx
720
-QwnqhtVzpXjCJWpkFotFmDsCfPaz9mErR8PtKvcrIL1/AF+fWe5Sve3+I1P0PpXk
721
-hf8fVdGhwbAXuRKrouTmagGI9b9Sp65PvHUcvasyJufFwqeuV8mScX87CzeSiHGI
722
-/ozMdnECgYEAq4+losrhe0DEmiC9zVPvwRXjbSixDsSJxHfOcqIsZqhUgBiZ4TJD
723
-SrkuukrMZib6BAD+PtCJS1TBbJyyvL3QecizhHSIh3ZnT0HnaRPatLEYmU65+3kE
724
-kTqL4ik92bJnnWowy677sydl1lzBJDVa9ZlTs7BFSd8y/0DZaUxGg2I=
725
------END RSA PRIVATE KEY-----
726
+"-----BEGIN PRIVATE KEY-----
727
+MIIEvwIBADANBgkqhkiG9w0BAQEFAASCBKkwggSlAgEAAoIBAQDPS1M62wm4cMoA
728
+RetDHR/oNQTMERRNItHV+TSIQexj2sMJDGazDkF/ZSdWF0PTcHj9fMgr6lq3YIxB
729
+zfv+8sgG5WBLuD9/Nq0aIzSbmsAe3JyvRdTwSTrOPHiJK/vQ4uPJtj7+60cIRzzf
730
+xrAYMwIVHbWNjGABM9XCoAjJqy/BsqH9WHC4SsU+pP0bwEpMexpf4f4AMhEfTTU6
731
+ZaSMHoTKMXTnXXiQ0xrT7YLt1pX2GgEveZ2EK3rM4ZxqmX/0uQbGFw0RQH9KjXpX
732
+VlCV2D2ZpwbJaS3I1NJ9y2UX5/yiQCaJwbdcjBpbxROaMUKa8Oz+HVH+4ql7Yg4f
733
+Pzufb13ZAgMBAAECggEBAJHqf+fKD4mZO1f936Eaez9FMt9ClnvFqtdn2Cah4PhZ
734
+ITjZVeFsg4ZdedcMAV5wqXolv/HJwZmbiJ85k8zesRbJl4M1atzta+QeLAXsZJhU
735
+yqZGDaImqhJKVr6YC2X6kEWI18cxborROnR6s7IVFb4vb4D38wxlpG6foA/1RGSf
736
+SPPaTCYwV/7qzObNWfp88XNkNEj6ER5oOaIsHNKt+t12sgFf7EYSgGPpGZ+coEJJ
737
+RVJLE5q5iN3iZWNVjG8wfhJXWFcNRLkY+XkxsKIFvtuk0iD/yWMyhGtCKqTRfDBL
738
+sxoKo+0yFS2lKYL/NKMB+ag3sA5z9eHr1xA4Iw1kf0ECgYEA8GWy65Tp+DSBVMoN
739
+1HXaMfHTe5FG3z+c/EeekmRkIiH1cqHUu1huS6aL0dmmnebMOJoaD+vB8LA1yQrH
740
+w0uEgIuCSuJzoKWsp+3FO7oLy0EBvlgOLq7vgpidXyUxj+6fMG0iWg+Aze6W5Lb3
741
+Y86atZmkrCG8csPvUx7DMyivkcUCgYEA3L+bCwGzyLcbOTxPCOrx59+E+kTuSnGE
742
+LtuHCaNferjUSNBYNPwzrFvU/11FKwIh5uKSo/XKGXbt0mkDyvlaoT/Pz3GEG85s
743
+AZG/jV5fE4jQtofaTmUlCtR5IL7nV3L4EQFPcZcPgLl7NkdDxbP+gvve6KSt+EP4
744
+Co5lPZhswQUCgYEAm9YRak4abd/7hu+Ej5nmXEIbihrfCpG+Pnxe+x9BGi9RYYIu
745
+2VO2DCxmrx6ct/eJo5eiFXgLPO+9rhni7WLi/kFxsQGjWxyLFEE6fkFYq+X0L2P9
746
+rZ2RfeNZAPinbFqPr2DPx/oM0XI9Nv602GpyOA7lhQBJnUwOtJ9Ygq15QtECgYBm
747
+Rm/zHYrKh+uZDRQhMZl6sNjPi3hMDWQMwbFDCeqG1XOleMIlamQWi0WYOwJ89rP2
748
+YStHw+0q9ysgvX8AX59Z7lK97f4jU/Q+leSF/x9V0aHBsBe5Equi5OZqAYj1v1Kn
749
+rk+8dRy9qzIm58XCp65XyZJxfzsLN5KIcYj+jMx2cQKBgQCrj6WiyuF7QMSaIL3N
750
+U+/BFeNtKLEOxInEd85yoixmqFSAGJnhMkNKuS66SsxmJvoEAP4+0IlLVMFsnLK8
751
+vdB5yLOEdIiHdmdPQedpE9q0sRiZTrn7eQSROoviKT3ZsmedajDLrvuzJ2XWXMEk
752
+NVr1mVOzsEVJ3zL/QNlpTEaDYg==
753
+-----END PRIVATE KEY-----
754
 "
755

    
756

    
757
7 tests, 22 assertions, 1 failures, 0 errors, 0 skips
758

    
759
ruby -v: ruby 2.0.0dev (2012-09-03 trunk 36887) [x86_64-linux]
760
make: *** [yes-test-all] Error 1
761
./miniruby -I./lib -I. -I.ext/common  ./tool/runruby.rb --extout=.ext  -- --disable-gems "./test/runner.rb" --ruby="./miniruby -I./lib -I. -I.ext/common  ./tool/runruby.rb --extout=.ext  -- --disable-gems"  -v 'test/rubygems/test_gem_validator.rb'
762
Run options: "--ruby=./miniruby -I./lib -I. -I.ext/common  ./tool/runruby.rb --extout=.ext  -- --disable-gems" -v
763

    
764
# Running tests:
765

    
766
TestGemValidator#test_verify_gem_file_empty = 0.03 s = .
767
TestGemValidator#test_verify_gem_empty = 0.01 s = .
768
TestGemValidator#test_verify_gem_no_sum = 0.01 s = .
769
TestGemValidator#test_verify_gem_file = md5_dgst.c(78): OpenSSL internal error, assertion failed: Digest MD5 forbidden in FIPS mode!
770
make: *** [yes-test-all] Aborted (core dumped)
771
./miniruby -I./lib -I. -I.ext/common  ./tool/runruby.rb --extout=.ext  -- --disable-gems "./test/runner.rb" --ruby="./miniruby -I./lib -I. -I.ext/common  ./tool/runruby.rb --extout=.ext  -- --disable-gems"  -v 'test/rubygems/test_gem_security.rb'
772
Run options: "--ruby=./miniruby -I./lib -I. -I.ext/common  ./tool/runruby.rb --extout=.ext  -- --disable-gems" -v
773

    
774
# Running tests:
775

    
776
TestGemSecurity#test_class_build_self_signed_cert = 0.02 s = E
777
TestGemSecurity#test_class_email_to_name = 0.01 s = .
778
TestGemSecurity#test_class_build_cert = 0.01 s = E
779
TestGemSecurity#test_class_sign_cert = 0.01 s = E
780

    
781

    
782
Finished tests in 0.067462s, 59.2926 tests/s, 59.2926 assertions/s.
783

    
784
  1) Error:
785
test_class_build_self_signed_cert(TestGemSecurity):
786
OpenSSL::PKey::RSAError: key too short
787
    /home/mockbuild/rpmbuild/BUILD/ruby-2.0.0-r36887/lib/rubygems/security.rb:711:in `initialize'
788
    /home/mockbuild/rpmbuild/BUILD/ruby-2.0.0-r36887/lib/rubygems/security.rb:711:in `new'
789
    /home/mockbuild/rpmbuild/BUILD/ruby-2.0.0-r36887/lib/rubygems/security.rb:711:in `build_self_signed_cert'
790
    /home/mockbuild/rpmbuild/BUILD/ruby-2.0.0-r36887/test/rubygems/test_gem_security.rb:58:in `test_class_build_self_signed_cert'
791

    
792
  2) Error:
793
test_class_build_cert(TestGemSecurity):
794
OpenSSL::PKey::RSAError: key too short
795
    /home/mockbuild/rpmbuild/BUILD/ruby-2.0.0-r36887/test/rubygems/test_gem_security.rb:19:in `initialize'
796
    /home/mockbuild/rpmbuild/BUILD/ruby-2.0.0-r36887/test/rubygems/test_gem_security.rb:19:in `new'
797
    /home/mockbuild/rpmbuild/BUILD/ruby-2.0.0-r36887/test/rubygems/test_gem_security.rb:19:in `test_class_build_cert'
798

    
799
  3) Error:
800
test_class_sign_cert(TestGemSecurity):
801
OpenSSL::PKey::RSAError: key too short
802
    /home/mockbuild/rpmbuild/BUILD/ruby-2.0.0-r36887/test/rubygems/test_gem_security.rb:72:in `initialize'
803
    /home/mockbuild/rpmbuild/BUILD/ruby-2.0.0-r36887/test/rubygems/test_gem_security.rb:72:in `new'
804
    /home/mockbuild/rpmbuild/BUILD/ruby-2.0.0-r36887/test/rubygems/test_gem_security.rb:72:in `test_class_sign_cert'
805

    
806
4 tests, 4 assertions, 0 failures, 3 errors, 0 skips
807

    
808
ruby -v: ruby 2.0.0dev (2012-09-03 trunk 36887) [x86_64-linux]
809
make: *** [yes-test-all] Error 3
810
./miniruby -I./lib -I. -I.ext/common  ./tool/runruby.rb --extout=.ext  -- --disable-gems "./test/runner.rb" --ruby="./miniruby -I./lib -I. -I.ext/common  ./tool/runruby.rb --extout=.ext  -- --disable-gems"  -v 'test/rubygems/test_gem_remote_fetcher.rb'
811
/home/mockbuild/rpmbuild/BUILD/ruby-2.0.0-r36887/test/rubygems/test_gem_remote_fetcher.rb:859:in `initialize': BN lib (OpenSSL::PKey::DHError)
812
	from /home/mockbuild/rpmbuild/BUILD/ruby-2.0.0-r36887/test/rubygems/test_gem_remote_fetcher.rb:859:in `new'
813
	from /home/mockbuild/rpmbuild/BUILD/ruby-2.0.0-r36887/test/rubygems/test_gem_remote_fetcher.rb:859:in `singleton class'
814
	from /home/mockbuild/rpmbuild/BUILD/ruby-2.0.0-r36887/test/rubygems/test_gem_remote_fetcher.rb:847:in `<class:TestGemRemoteFetcher>'
815
	from /home/mockbuild/rpmbuild/BUILD/ruby-2.0.0-r36887/test/rubygems/test_gem_remote_fetcher.rb:25:in `<top (required)>'
816
	from /home/mockbuild/rpmbuild/BUILD/ruby-2.0.0-r36887/lib/test/unit.rb:243:in `require'
817
	from /home/mockbuild/rpmbuild/BUILD/ruby-2.0.0-r36887/lib/test/unit.rb:243:in `block in non_options'
818
	from /home/mockbuild/rpmbuild/BUILD/ruby-2.0.0-r36887/lib/test/unit.rb:237:in `each'
819
	from /home/mockbuild/rpmbuild/BUILD/ruby-2.0.0-r36887/lib/test/unit.rb:237:in `non_options'
820
	from /home/mockbuild/rpmbuild/BUILD/ruby-2.0.0-r36887/lib/test/unit.rb:52:in `process_args'
821
	from /home/mockbuild/rpmbuild/BUILD/ruby-2.0.0-r36887/lib/minitest/unit.rb:956:in `_run'
822
	from /home/mockbuild/rpmbuild/BUILD/ruby-2.0.0-r36887/lib/minitest/unit.rb:949:in `run'
823
	from /home/mockbuild/rpmbuild/BUILD/ruby-2.0.0-r36887/lib/test/unit.rb:21:in `run'
824
	from /home/mockbuild/rpmbuild/BUILD/ruby-2.0.0-r36887/lib/test/unit.rb:767:in `run'
825
	from /home/mockbuild/rpmbuild/BUILD/ruby-2.0.0-r36887/lib/test/unit.rb:820:in `run'
826
	from /home/mockbuild/rpmbuild/BUILD/ruby-2.0.0-r36887/lib/test/unit.rb:824:in `run'
827
	from ./test/runner.rb:25:in `<main>'
828
make: *** [yes-test-all] Error 1